##TITLE = Stilbenediamine adduct
##JCAMP-DX = 5.00 $$ ACD/Spectrum Manager v 3.5
##DATA TYPE = NMR SPECTRUM
##DATA CLASS = XYDATA
##ORIGIN = Dept of Chemistry, UWI, Mona, JAMAICA
##OWNER = Dr Paul Reese / Dr Robert Lancashire
##SPECTROMETER/DATA SYSTEM = BRUKER ASPECT 3000
##.OBSERVE FREQUENCY = 200.126
##.OBSERVE NUCLEUS = ^1H
##.ACQUISITION MODE = SEQUENTIAL
##$URL= http://wwwchem.uwimona.edu.jm:1104/ectoc
##NPOINTS = 8192
##FIRSTX = 2425.126953
##LASTX = -165.304199
##MAXX = 2425.126953
##MINX = -165.304199
##MAXY = 2793.084473
##MINY = -41.413746
##XFACTOR = 1.000000
##YFACTOR = 0.087284
##FIRSTY = -20.528717
##DELTAX = -0.316253
##XUNITS = HZ
##YUNITS = ARBITRARY UNITS
##XYDATA = (X++(Y..Y))
2425.1b35q9Q1j06Q9l4rK5l0KN4o0J14q4l5M7m6P4l6m4MJ66k51P4k2m1J29l6M5j14
2416.0c68jR0K9l4L5N4p2n7m1K6M9l7m8J44j3j11J1J67n3Qj27O1l1L6PO4j62J06J16
2406.8a52j05j15P1K6J12q3m0Q9j43PO3J7L9j16L9l3NK9P8n0n5M1N8n6M2q9J21j62
2397.9c62N6N8n6n0O8K0m1N9L5j47N9J2M6m6k7O2K2o1L7o2N7J4o4J09o2n8M1o6J06
2388.8b41J6j20K2J05p9l5O1j3r4J35n4o1Q2j6M9q7m3J97r5j4J07k09J19k0ORK1r1
2379.9c43Q5p0NJ41n2J4ok7k1l7j3k1M8L5r2K6J03n9L3n4K2n0L7M6l2m0RK0j4k6J18
2370.1b15o0M0NK6pk2Ql2n4J01p8j0j8j1P5l6l3O2qJ0r0K6J34j44j00O7J93j49M5m0
2360.6c15J8l8P7j04L9P9q2L1o9L7N2l1pN4o4K2r6P4K3J5J7o0L9n9K2R5r3P0p4o5P1
$$ y = [-235, -324, -243, -349, -260, -294, -303, -278, -308, -306, -252, -312, -198, -282, -317, -270, -316, -242, -278, -322, -318, -152, -403, -329, -351, -392, -263, -299, -254, -368, -369, -279, -250, -284, -249, -195, -267, -324, -365, -339, -290, -327, -375, -231, -244, -355, -344, -177, -230, -222, -349, -288, -319, -283, -276, -212, -374, -268, -152, -257, -372, -301, -275, -163, -246, -286, -197, -340, -333, -270, -253, -214, -330, -291, -324, -319, -290, -212, -262, -317, -276, -218, -274, -232, -321, -200, -362, -306, -248, -304, -354, -286, -266, -307, -248, -213, -360, -301, -289, -243, -289, -316, -254, -232, -293, -256, -318, -261, -247, -311, -202, -264, -322, -281, -347, -241, -225, -345, -323, -218, -297, -332, -271, -284, -378, -243, -297, -358, -276, -292, -243, -330, -373, -176, -271, -285, -178, -387, -268, -288, -282, -273, -252, -343, -258, -328, -323, -182, -234, -220, -226, -253, -274, -311, -324, -345, -297, -262, -354, -328, -225, -284, -251, -305, -283, -333, -296, -250, -282, -322, -313, -293, -307, -333, -215, -275, -235, -230, -204, -211, -233, -225, -257, -311, -210, -288, -298, -316, -327, -252, -288, -321, -259, -267, -257, -347, -321, -187, -331, -431, -364, -171, -320, -275, -315, -297, -335, -258, -362, -323, -244, -326, -295, -364, -327, -275, -306, -313, -259, -323, -301, -397, -323, -300, -285, -268, -328, -289, -348, -326, -231, -324, -254, -328, -393, -322]
2350.8c22j8J05o7k9O5q4Q8Km1JK8n5Q4J15j13k3r3m2J23k6k8M9K4mq3P2JPTn4K3k8
2340.7c16N3k3n7QJ07k2l1m3k4P3r1O1qR3rp7J7M1j2l6k4N8m8kM9p3K3N6p8L5J19k07
2330.6c88R2r2Q2J6O6k50K09j53N8KJ38j02J25j5k2J9q7J05j10P4n7L5Q4j18J7L7o1
2322.1b96J8j46J02Mk9l2J2lQ7J1l7p9J04k8O1m8k2P3o8N7q6j2J02M8l1nr1L0K1K3
2312.6b60N2qj30P9j7R2p6M0J1p4L2r0J9OO0n4l1L7J04j23L6k1K6K5k0N7q0O1L8k20
2303.1d29K09ok8q7J52j41m0M2Q2ll9Lqo7MJ3n8J44r6J42j57J5J03j67R4P1J3n7L8
2293.9b58Ro2j4J8ONR0r2P5Lr6P9k4l3TL9J4M1k7lj40R8L2kJ17j81Q5M1JK0p6k1N8
2283.5b31l3J3J0k3J5j11M4Q6Q0j60O7L5j87J58J1Pm9k6L7m3p8J49J1r0Q1l9j50P9
$$ y = [-322, -340, -235, -302, -331, -266, -350, -262, -260, -301, -300, -272, -327, -243, -128, -241, -264, -357, -399, -276, -302, -330, -281, -257, -261, -344, -272, -271, -264, -257, -311, -288, -316, -263, -286, -343, -335, -228, -250, -281, -324, -348, -275, -366, -305, -313, -220, -229, -306, -289, -248, -260, -296, -320, -262, -310, -312, -263, -336, -313, -257, -335, -300, -181, -388, -296, -388, -306, -290, -224, -474, -265, -418, -360, -358, -220, -322, -197, -212, -234, -215, -302, -197, -307, -233, -290, -255, -171, -289, -272, -235, -296, -278, -424, -322, -318, -347, -379, -367, -370, -283, -272, -309, -388, -284, -312, -251, -299, -321, -248, -316, -259, -345, -357, -255, -207, -238, -243, -334, -304, -283, -260, -208, -216, -346, -267, -284, -192, -268, -228, -217, -291, -259, -349, -330, -324, -264, -318, -349, -312, -208, -331, -295, -316, -290, -265, -285, -228, -308, -247, -209, -429, -220, -226, -254, -341, -189, -330, -370, -328, -246, -249, -288, -285, -293, -360, -356, -343, -401, -257, -353, -211, -368, -353, -250, -417, -323, -252, -239, -296, -258, -249, -311, -325, -307, -301, -296, -206, -298, -223, -220, -316, -237, -261, -294, -327, -288, -274, -233, -260, -263, -403, -305, -273, -275, -158, -339, -254, -213, -212, -192, -268, -289, -231, -264, -251, -241, -264, -249, -360, -316, -230, -150, -310, -243, -208, -395, -237, -226, -219, -268, -294, -257, -300, -378, -229, -218, -308, -227, -266, -416, -337]
2274.6c37N5Kk7J46j06M6J8j22j4M8l4J04j8k2k3oj06J49k9N6l9Mj8k6M8o7m5J56m9
2265.5b56M7j14J0K7k5R1k4N8j54L4o5P7j8p2J68n0m5k1J09j01J2Q3n3NM9o8N8j19
2256.6c57O0L1J3m4P3o3kJ4RJ2n8O2m3lM6qO6o0K7K9J4o9q1J17m2k6o8O9K0N7j02O8
2246.5b39k1pl6J9RJ2N8o7K6j5N3p1N3r5L8R3j44N2Q8l2k4r1J7rO8O5J8J0j40k8P4
2236.7b66p1K2Q4Mj5jl2J20j09j29J26J16k20R7M3j2J9l8L0q8l6J41Qo4N1j03J22m1
2227.8b42p3l3K5j6K0L0j36K16j15P0L2n1L2P7j63M4L5OKj2o5P1J8L3o1k8o3R9jj38
2218.4c87NR1n1P3pM6O0j33qj3m0J49r0r1L3J01j0l3O7q3m2J64j11m9J61K4r6q8L7
2209.2c21P6K5k2K7j35J25j1o9LM5j3oj08J76j77J72j94K02r8j7J18j44M6Q8o7l7p7
$$ y = [-337, -282, -280, -307, -161, -267, -221, -203, -325, -339, -291, -325, -221, -239, -261, -284, -290, -396, -247, -276, -220, -259, -255, -273, -299, -251, -318, -363, -207, -256, -209, -323, -313, -286, -311, -220, -244, -186, -340, -306, -371, -294, -312, -384, -216, -266, -311, -332, -223, -324, -312, -229, -282, -277, -228, -296, -238, -357, -297, -266, -253, -297, -224, -287, -289, -275, -266, -254, -312, -250, -293, -296, -250, -258, -192, -252, -225, -196, -182, -251, -332, -215, -257, -283, -351, -282, -262, -205, -307, -239, -260, -267, -303, -284, -275, -263, -205, -272, -246, -261, -208, -279, -226, -321, -283, -190, -334, -282, -194, -226, -250, -341, -324, -333, -265, -200, -182, -172, -312, -340, -266, -337, -315, -231, -227, -242, -243, -275, -155, -264, -393, -267, -151, -371, -274, -231, -243, -224, -262, -232, -320, -356, -215, -207, -271, -220, -323, -201, -242, -315, -348, -323, -339, -319, -289, -425, -209, -324, -254, -222, -273, -241, -164, -327, -283, -248, -242, -240, -252, -317, -246, -228, -195, -256, -284, -347, -248, -249, -387, -382, -291, -342, -269, -276, -230, -170, -303, -311, -324, -364, -215, -305, -396, -363, -262, -272, -305, -238, -321, -363, -199, -310, -359, -198, -174, -270, -358, -321, -245, -220, -242, -215, -350, -225, -236, -305, -302, -257, -270, -276, -384, -208, -385, -213, -407, -205, -303, -320, -202, -346, -300, -212, -279, -316, -393]
2200.7c93K19q7q5O3J46j16q5N9l5J63j83L0P0j5P9j78N1O0K1r3J5mj3Q1j26Q6P0r5
2191.8b95N0mP0o2J2Qn2rJ42r4r0O8j8Pl0Ok8Q7p9J6J37j90Q8J1p5M1k8J07l2K3j60
2182.0c73P1J9J00n9j2o3Q1mm5P0j08L2L0j08Q0M4l7K3J00j27K6p8P0K8l6L4k9PkP6
2172.5a90l5j0q0M1L0Q2j89N7J28j16N5q4j3P7j8O8k5r8K9N2n1J53j99J30l0l5k9K9
2163.7b71J23L2j12K6m1L2N1k10R0M1j4oo3J08LO6j89qJ30j39J71J3r8pK2k8M6J30
2154.8a02o3n7j17J39m8pj6L4R8j19jQ3o1L7K9p5L0j01Q3J5n1k4Q0k1r4P5m9J10p0
2145.6b63M5p1J45j35M7K1j1lj3M9M1j15Q0o3J0K6j05N3J7K4n9m4O6O1lr0j04J46l3
2136.5b81K6q8l2J37L7p0J7mj5O3o6J10j88J50qj11Q6O8N0o1k7k9PL8p7P1p0L8l0Q6
$$ y = [-393, -174, -261, -346, -283, -137, -253, -338, -279, -314, -151, -334, -304, -234, -249, -170, -348, -297, -237, -216, -309, -294, -298, -311, -230, -356, -270, -200, -295, -245, -249, -179, -241, -229, -221, -273, -282, -140, -234, -324, -256, -274, -267, -297, -291, -319, -232, -311, -295, -158, -348, -260, -249, -324, -283, -311, -204, -236, -213, -373, -302, -283, -183, -242, -254, -317, -236, -240, -285, -215, -323, -291, -261, -369, -289, -245, -282, -259, -159, -286, -260, -338, -268, -240, -276, -242, -271, -264, -266, -190, -225, -235, -315, -274, -244, -162, -351, -294, -166, -282, -227, -311, -324, -247, -265, -197, -222, -320, -291, -239, -290, -137, -336, -206, -236, -271, -300, -271, -148, -116, -228, -202, -243, -211, -160, -370, -280, -239, -253, -259, -322, -214, -211, -145, -334, -342, -212, -351, -180, -167, -265, -272, -250, -278, -232, -102, -165, -222, -339, -200, -248, -255, -271, -237, -139, -258, -259, -176, -237, -200, -171, -246, -216, -317, -234, -219, -270, -294, -214, -235, -329, -254, -303, -193, -263, -218, -289, -144, -279, -232, -211, -222, -225, -238, -189, -148, -263, -183, -246, -236, -210, -315, -262, -245, -221, -280, -324, -258, -197, -200, -290, -394, -248, -281, -255, -343, -375, -238, -201, -271, -254, -258, -273, -210, -276, -166, -354, -204, -212, -323, -237, -169, -119, -180, -207, -236, -229, -191, -268, -197, -267, -229, -259, -173]
2127.0a73n7k6J8lQl1n1J24J3j18M8K5m2J30Kl6k6Mj08J38q9o0K31j92M0o9R3n8L3
2117.8b32k3k7j1J62j9k4Lj05O8m3J00r6k6M1r7J02o2K2N9J7j09R7n3L9j8N5n3j9R
2108.6b43R2j43OJ03l0j0k4j2J02j39J17M7p8q6N9J01j63O3o0K03j34L2j9nK9J19k07
2100.1b80K5J5o2J29j13K4l4LJ9M8O9p6jO7r7rO7M1n4k4o8N5O6r8M0l9j8J11k7m3N5
2090.3b09l7R4Kp6K5J1r6KN8J4k0J20q3M4l8Mo9L2l6JN5m4J1l0K7N9k1n0N5R0j44O8
2080.2a81lL3j51Q0k1rk1N6Nk0Q0K7N7j48Q8l7j04K2mO0j2m1lR8L8o5p4oJ9k0J46k6
2070.1a37r6J4R7j57O1J5%M1j15O7p6R7l6n2J47j58K5J16k5j02K0K5K3m9O8K1j8km2
2060.9b28O0J19q6l4m6K1Q2J9r8Mm0j5M7o4RM1k8J10k5q5j7OM3O2q6oM9J0r8J92r5
$$ y = [-173, -230, -256, -238, -241, -233, -264, -315, -191, -178, -296, -248, -223, -265, -135, -133, -169, -195, -191, -299, -161, -250, -310, -79, -271, -231, -300, -207, -265, -232, -255, -282, -293, -131, -150, -174, -171, -276, -208, -251, -151, -247, -273, -232, -329, -227, -289, -267, -208, -191, -300, -203, -256, -217, -235, -180, -233, -252, -243, -151, -294, -288, -185, -215, -225, -249, -261, -159, -298, -181, -134, -212, -298, -239, -138, -301, -238, -298, -95, -229, -197, -216, -221, -192, -73, -280, -255, -240, -302, -173, -286, -262, -296, -293, -274, -226, -157, -233, -234, -167, -264, -273, -206, -165, -219, -243, -311, -256, -190, -288, -248, -287, -305, -194, -221, -264, -209, -246, -152, -150, -226, -201, -190, -286, -284, -226, -212, -232, -112, -195, -151, -189, -185, -254, -222, -258, -257, -202, -246, -235, -265, -238, -179, -200, -250, -195, -105, -249, -181, -184, -151, -302, -222, -243, -252, -273, -217, -212, -232, -152, -125, -68, -216, -128, -165, -269, -247, -251, -191, -203, -244, -247, -149, -111, -176, -250, -256, -237, -257, -111, -137, -233, -219, -122, -279, -218, -203, -203, -162, -277, -210, -286, -189, -225, -277, -130, -288, -263, -147, -172, -274, -254, -229, -206, -255, -187, -166, -184, -186, -228, -168, -49, -135, -169, -215, -194, -112, -93, -191, -187, -227, -242, -195, -259, -250, -209, -237, -127, -152, -237, -254, -248, -205, -143, -229, -235, -186, -176, -274, -82, -177]
2051.1a77n5lP7k5q2R5q4Q5M7j47R5%m1l9J00o5m7NP0L3j1q4l6J91j44l2J14j4o4O5
2041.6a73Q3j44O0nJK3j4j06O1j0l7P2J33j79l9J84o6K8p4j1Q0j22M9O3L7o7q3N3m
2032.4b07M3j1L5m2l1L5N1n0P0o5m2P6K7j12o1NJ53J2o6n0J0L6m7p6K17j28M6n5J1
2023.3b16J8l6N9Kp3P2N3l0p2jJ58r8m3Q3p5K3M0n4r2J34p1M6R1o4L6j11j3M0L2qk8
2013.5a98N7k4p0M7L2l5l3%J0J8L8m5P2Np5Q0l9Jr4J09k8MM3pK0o5j0k4n2Q9N5o5K14
2003.0C0K00K20j15j92r7j05J3n4Qj06J31l2m7k6J13j00J7N5J7k6m2o8k6R9R6l4q4
1994.5a55K6J4N0j41J21k4l1M2kj10J03k7N0r2Jj1O6K5m6j2j1Q7J0q6P6j14kL5R3j52
1985.0b17J10l8O0j8p7O2p6M6Q8J4r2K6l8Pll3R5l0K5k3p2L2j0j4%L2N2k8k1k9O7j
$$ y = [-177, -232, -235, -158, -183, -265, -170, -254, -169, -122, -269, -174, -174, -215, -254, -154, -219, -266, -261, -191, -158, -169, -253, -289, -98, -242, -274, -160, -174, -238, -173, -90, -234, -174, -179, -178, -155, -169, -275, -214, -224, -261, -189, -56, -235, -274, -90, -156, -128, -202, -213, -133, -255, -206, -143, -106, -173, -256, -203, -207, -164, -175, -140, -182, -213, -178, -127, -177, -107, -172, -214, -138, -111, -223, -284, -279, -126, -114, -180, -230, -220, -184, -231, -307, -90, -218, -172, -227, -216, -198, -234, -175, -173, -246, -174, -121, -151, -223, -224, -66, -164, -207, -124, -199, -176, -136, -190, -282, -148, -219, -173, -82, -146, -110, -221, -234, -194, -162, -170, -198, -141, -165, -235, -188, -156, -191, -224, -224, -214, -196, -158, -203, -131, -126, -201, -121, -160, -159, -253, -144, -172, -168, -125, -132, -112, -177, -187, -211, -263, -174, -119, -184, 30, 230, 450, 335, 143, 46, -59, -46, -100, -92, -198, -67, -99, -146, -172, -59, -159, -142, -87, -70, -96, -138, -206, -232, -133, -37, -71, -155, -129, -115, -65, -206, -85, -109, -140, -98, -100, -210, -107, -134, -84, -176, -175, -186, -120, -95, -141, -153, -164, -77, -67, -153, -77, -191, -193, -158, -65, -217, -107, -145, -85, -103, -180, -118, -194, -148, -60, -46, -138, -112, -150, -143, -146, -179, -84, -114, -89, -112, -184, -152, -162, -176, -176, -144, -92, -120, -141, -170, -103, -104]
1974.9a04o1l0O5l2j7M0R6q4n2N9k2r6J61p6N4j9Kjk6OK5Jq2Q3nj8l6L5j8TN6n3%n
1964.1a72P1p6J04l2j8j06N3Q7j9J05j61Q1j38J40m1K2mp1M4k4N5j6J4K9o7j1N3r7
1955.3a95Q1q6J62m4p3P1j41M8N3O9n0J7n5k0J7J09m2j01L8N1j7J4j5O9j53M0k0M3
1946.4a30n6j4O1RP8j69Q6K7M0p9L2K2q4j2J43o8L6nNp8J4l3rJ09m0j06Q6Q0m9O4J
1936.6c9q8j7NR9p5Kp3J4J17j00Q0oq4qN5j15O7J0R0j40Q7j21J23j19Q0m8J65k7m2
1927.4a08l0o0J43p6J43r6J4j6qm6P3k9M1k4k3j1p0J36Qrj72J19J2lj3r5J63o5Q3n1
1918.0g0Km4k6J4l8L0O5M2l4q0j4R2p0o4J05p5J7R4L3r9L6j5K7m1j9NL5l5O0k0L1n7
1907.8a13Q7q5L4%p8N9j06J71qQ3j98PJ04j7m7M3p7lP8m7K5p7n1J90kq9l0N1k4o6O6
$$ y = [-104, -165, -195, -130, -162, -179, -139, -43, -127, -179, -120, -142, -238, -77, -153, -99, -118, -116, -117, -143, -137, -112, -111, -193, -110, -115, -133, -169, -134, -152, -170, -114, -167, -167, -172, -101, -177, -73, -105, -123, -229, -176, -89, -108, -3, -164, -83, -221, -81, -122, -100, -104, -175, -131, -155, -100, -116, -102, -73, -140, -151, -98, -195, -114, -200, -38, -82, -155, -84, -225, -177, -124, -55, -105, -88, -143, -163, -146, -37, -79, -180, -142, -91, -108, -94, -109, -40, -193, -153, -173, -130, -186, -200, -139, -130, -52, -221, -135, -108, -68, -147, -115, -93, -177, -189, -46, -114, -78, -83, -78, -156, -142, -175, -184, -75, -115, -221, -135, -55, -104, -40, -39, -127, -144, -139, -40, -115, -113, -186, -172, -55, -155, -75, -81, -165, -173, -118, -233, -166, -156, -66, -206, -119, -240, -117, -236, -156, -204, -39, -66, -108, -138, -198, -55, -131, 12, -84, -70, -86, -94, -140, -67, -96, -55, -79, -102, -113, -183, -47, -39, -48, -220, -101, -89, -92, -105, -200, -37, -102, -19, -70, -68, -112, -138, -124, -162, -132, -67, -25, -59, -139, -153, -61, -131, -195, -90, -165, -148, -54, -21, -120, -84, -99, -72, -113, -132, -127, -92, -127, -67, -87, -56, -113, -26, -111, -77, -77, -155, -96, -202, -31, -39, 44, -154, -147, -43, -60, -107, -64, -141, -144, -66, -113, -88, -165, -216, -26, -28, -117, -147, -96, -120, -186, -120]
1898.0a20J39n3j71J14J1l1K3N6n1jQj9m0M3l4N8n2N8o5no8J66k6ll0N2j17J06N1j45
1888.5a46O7m1M2%j12O7P9J2o2O3j46J43m6m1lj0J37j44OQ9n8P3k0j0k9K3n7L7n3L0
1879.0a10Pl6J22j14Q3nn1K7K2k1k0m1P7L0j00M0l0J0J39n0p2m0O2j3k0mN8ro6N0K
1869.2g3L7K5Mol8j10K21j89P1Q4r3n4J9R0n2L9j3k7J8Tq8Q1j09J06J8m0P1r5lm9J15
1859.4b2p1OkK6O5o6Rl9J2R0j35P5r0J66j01j7O6j11O5R3r4M0J6p3K0j07J81j9%m0
1850.0e7L4l4J1qJj03J98r6mj4K2P8j52J37m8P0q6M1p4J27j51Q1m7J5j23J80j4q2K
1840.8i6j7R6l2L0n3MQ7K7Jl0m0k8m0N9%Pl3L8j33J01n5j6J21m8JrJ9LP4j28n0J00
1830.7d0MP4j6p1O6n1n9j2R3l8Nm9N3L5o8L6O5p3m9j2M0J6j9J8pM4o0k3O3o0K8O6p9
$$ y = [-120, 19, -34, -205, -91, -80, -111, -88, -32, -83, -84, -76, -95, -135, -92, -126, -68, -120, -62, -127, -132, -200, -34, -60, -63, -93, -41, -158, -52, -1, -146, -79, -120, -78, -78, -190, -123, -44, -32, -94, -31, -177, -34, -80, -121, -124, -134, 3, -141, -135, -46, -104, -31, -51, -61, -90, -67, -124, -87, -140, -110, -103, -139, -17, -131, -48, -53, -104, -77, -55, -76, -96, -137, -60, -30, -130, -90, -120, -110, 29, -21, -93, -133, -71, -84, -104, -108, -50, -59, -125, -75, -73, -36, -11, -7, -13, -51, -161, 60, -129, -58, 26, -67, -121, -102, -12, -64, -25, -38, -65, -47, -29, -117, -36, -145, -39, -21, -61, 10, -85, -88, -137, -22, -93, -87, -89, -63, 2, -64, -55, -94, -82, 8, -127, -52, -142, 24, -77, -94, -28, -139, -74, 19, -75, -35, -19, -92, -72, -179, 2, -17, -17, -57, -23, -57, -46, -54, -53, -156, 42, -54, -58, -72, -50, 28, -124, 13, -35, 35, -51, -10, -84, 43, -108, -27, -74, -59, -182, -2, -16, -98, -96, -113, -17, -49, -19, -72, -68, 19, 46, 47, 17, -23, -51, -91, -32, -32, -25, -58, -20, -153, -52, -107, -123, -2, -50, -49, -58, -39, -36, 38, -90, -140, -40, -36, 38, 22, -49, 17, -34, -93, -105, -12, -50, -45, -94, -41, -6, -74, -38, 27, -46, -95, -107, -67, -51, -70, -52, -59, -15, -75, -98, -35, -95, -67, -1, -80]
1820.2h0l7J42q7K4l8J15o1q1J09o7k0N2m1M6p5O9p9P2O5K0o6J9j61Q8O6o1%N2m2L3
1810.7b4l7O0k7lM6k9j9n4PO9M5j48J77j21Q6j31J39k2Rj4o1k7K2L1O4m7m1O7m7L5
1801.2Eo7LkJ3LjMJ63j45J02j37Q7P6p5Qo1KOP0qj10K5Q3j1p9R4o2m%j6O3n5K9o4L2
1790.2b9O6p0nL6j13J45l4k3j0Lk9P5P6q7q3N8j1R1r3L0K0j00Q9k4O5n3J1jL2q4L8
1780.4a4n5j7K5N2r9j9J85O9o1J3oo2rN5q8lJ2J48j09j3r1O5Q2j9M9r3N5j09P6r4k1
1770.6i6J52l1J3J5o6M3oo0J35r2J0j4N7j6K7n2O7l5J7o7L4o8K5l3r0J91k7j04K12
1761.4A41j43Q1l5K1l0Ok5O7jk0j10qJ00m9k0M2pM2L9l5q6L9K0k3L0K0q6M2N7l4M4
1751.6G9p4N0M7j24kO1J6k5QN2q4J9L7O0j44J1Q1n4P0q7j0J18j21Q0m4k9l7L0L6J1
$$ y = [-80, -117, 25, -62, -38, -76, 39, -22, -103, 6, -61, -81, -29, -70, -24, -99, -30, -109, -37, 28, 48, -18, 1, -160, -72, -6, -67, -67, -15, -57, -24, -61, -1, -28, -31, 15, -14, -33, -87, -80, -11, 34, -114, 63, -58, 28, -103, 36, 14, 23, 9, -52, -79, -57, -26, 38, -9, -50, 17, -30, 5, -62, -59, -61, -48, -45, -46, -42, 121, -24, 78, -59, 28, 104, 29, 37, -24, -22, -16, 54, 46, -64, -39, 44, 33, -46, 48, -14, -18, -18, -34, 29, -26, 3, -61, -29, 37, -33, -38, -2, -115, 30, -4, -27, -37, -34, -63, 12, 88, 1, -82, -24, -35, 56, -37, -7, 13, -87, 2, -22, 43, -10, 1, 0, 32, -52, -14, -69, -86, -61, -9, -108, -127, 58, 127, 66, 79, 73, 11, 2, 57, -31, -34, -22, 126, 17, 4, -87, -22, 60, 41, 90, -3, 52, -57, 19, -75, -96, 56, 25, 38, 53, -13, 30, 24, -36, 99, 7, 17, 3, 60, 44, 71, 19, 86, 51, 68, 1, 35, -33, -8, -41, -131, 60, 33, -71, 141, -2, 79, 44, 65, 35, 41, 16, 83, 82, 62, -48, -56, 44, -5, -25, 17, 10, 52, 91, 56, -30, 9, 29, 6, 36, 56, -30, 12, 69, 35, 79, 5, 55, 102, -22, -24, 37, 53, 28, 36, 88, 4, 23, 60, 120, -24, -13, 68, 14, 84, -3, -13, 105, -16, 64, 20, -9, -46, -16, 20, 31]
1742.1C1k9L0o5%J17J5q1K9pn1L7kNJ4n3P3N4Jj18j7M0N9j12P0N6k3Qr0OJ64j04j7
1732.0D0M8J3n2RmL9njm4m5R3J3Mk0Jp7j3J19k5k3M2j00Q9r6J05r4N2P1nj01P7p8M3
1721.5G5m7P6n5q2O0R6m6P3j3n4R9r3JKj00J51p8P4q0m1J29j27M5M4J5Oo5Pj9L1p2
1711.7A2K4R4r4N2Lm0J4j28J98o7Rl8j8L4K1o0O2p8N7M5j1P4j77mO9P0J4m6Q5r8j5
1701.9F3k7P2j7p6J33j23J3l0N1R9m4j1nQ9j04K9K6L1o1mLJ15j50J21q2J8r1M6M4m9
1692.4G9J1m4J22p6K0n0O1jk6N0j28L7N6k5k1K5NJ4l3N1K1r6M3j4J6Q3k8M3m9TM3n6
1682.3H4J01p0j9Q7j5o8P1l1j36L0O2J9M5r1QM0l6M3k0L7m9N5P8r5Q4r3lP1n1oM5o2
1672.2A15m5J30j01m5O6m3P8l0J66j64N2k5j8Q6M6r3K9n8O5j13O6m9O8n7M7J09j22
$$ y = [31, 2, 32, -33, -33, 84, 99, 18, 47, 40, -11, 26, 24, 29, 43, -10, 63, 117, 118, 0, -17, 23, 82, -30, 40, 96, 73, 81, -9, -3, 161, 57, 40, 88, 101, 49, 58, 54, 93, 88, 87, 43, -2, 91, 104, 108, 88, 89, 12, -1, 118, 93, 70, 112, 12, 101, 5, 110, 16, 68, 139, 134, 33, 110, 32, 75, 28, 104, 49, -33, 27, 123, 77, 150, 137, 83, 182, 89, 90, 92, -8, 143, 65, 139, 59, 18, 147, 20, 65, 109, 124, 130, 65, 72, 53, 84, 12, 36, 130, 36, 88, 91, 51, 65, -63, 135, 68, 77, 39, 21, 55, 76, 16, 78, 0, 57, 102, 91, 165, -12, -16, 53, 123, 137, 91, 176, 78, 63, 36, 108, 91, 15, 148, 25, 38, 8, 59, 158, 114, 103, 98, 187, 83, 112, 138, 169, 108, 104, 107, 222, 72, 193, 111, 129, 38, 84, 128, 79, 90, 46, 168, 92, 112, 62, 123, 122, 96, 146, 18, 55, 111, 86, 65, 90, 95, 109, 76, 127, 148, 52, 95, 81, 97, 180, 152, 195, 146, 97, 140, 84, 185, 115, 96, 183, 168, 100, 171, 140, 4, 34, 96, 115, 160, 69, 77, 117, 81, 124, 104, 141, 92, 147, 225, 130, 214, 121, 118, 189, 138, 132, 177, 115, 70, 200, 99, 54, 120, 77, 155, 125, 291, 127, 179, 154, 136, 222, 268, 175, 204, 146, 211, 98, 164, 115, 183, 126, 173, 282, 160]
1663.7A60jj1O5P6l7O9o5O2k0p1K1K4N8p0K5O3L8j6R9J47P9M70R16J169P36R1m56r43
1654.8B678q32m47k16k29m0j03j22m1l5l6o1K2p3Q5M2r2K2j70J04o7N2n4L6o0ll1l2
1646.3B97o8J13k9R4m6p1J3N4r4J06n9K3l2k5J1j5J40o4Jn3J10j44J4l0M4P7j17K8
1637.4B78L9l2m4rQ3Kk7m0rN5O6l2l9l6L1j09P3j3L6kK5n3J6K2q5J43j71J19n2N7l3
1627.6B59jM3k6o6Q9l1pol9lN1J5p1R7rn5J5K8j7Qj14R3n4J0To3Q0kP1K3m7j5j08J50
1616.9C08l8rJ04n0m6q2J11m1j3L4N8O2j51KL5J09j73MN0j0l8J32j30Q3l9J1l4N3M1
1607.7C43q8N5k8q0Q8Mk2K6k0j8P7r0M7L5pk2L6M7n9M7m9k2O1j3m2L7p3N2r3J33l2
1597.9C30k6nJ2p6J19j2j15O7N3J8l2m3L0TL5L7k7j06N4O8j21L7m5O4p5J59o5k7QJ4
$$ y = [160, 159, 148, 213, 289, 252, 321, 256, 318, 298, 227, 248, 272, 330, 260, 285, 348, 386, 370, 469, 616, 695, 1165, 2081, 3250, 3986, 4077, 3621, 2678, 1846, 1399, 1183, 954, 914, 811, 689, 648, 613, 577, 516, 538, 465, 550, 592, 500, 522, 352, 456, 389, 441, 387, 423, 363, 360, 329, 297, 229, 342, 313, 407, 361, 290, 303, 357, 263, 369, 310, 333, 301, 276, 287, 272, 412, 348, 349, 296, 406, 262, 276, 246, 290, 367, 250, 278, 317, 285, 241, 232, 315, 317, 290, 250, 241, 296, 362, 330, 291, 255, 286, 177, 250, 237, 273, 271, 296, 243, 259, 281, 196, 339, 168, 287, 235, 292, 259, 258, 301, 275, 209, 298, 267, 260, 254, 215, 212, 263, 278, 207, 304, 295, 240, 255, 283, 266, 274, 160, 253, 199, 209, 219, 156, 236, 234, 305, 328, 281, 266, 158, 308, 270, 261, 365, 315, 269, 187, 298, 257, 244, 278, 336, 398, 247, 249, 284, 393, 220, 224, 274, 264, 226, 358, 228, 311, 272, 283, 249, 302, 343, 255, 310, 282, 202, 290, 294, 272, 298, 278, 260, 337, 247, 294, 329, 322, 300, 336, 383, 324, 371, 322, 300, 361, 348, 306, 343, 270, 322, 229, 362, 330, 304, 299, 311, 235, 354, 342, 227, 294, 347, 365, 333, 290, 320, 350, 385, 422, 395, 289, 343, 411, 290, 327, 282, 346, 271, 430, 365, 338, 346, 360]
1588.4C60k1L9n7L3J6p3Q1k8K9K0j7r4kJ28L7r4q3J18k0j5j1O0m1n1K4RM1J49kl6q2
1578.6D17J37J41j6j08k2J8K4j05M2n8l9K5M0o1J1N7n1r4J57k2lK35J29j29j09j11
1570.4E05J50J99r1n1o8m2k6QM2J8k8p5K9J7m1J07p4M3J4n4l9K4N1NJ33r5K0M8N7Q
1560.9G94l9K7P1J23K12L83N07j54k94l67O2L52M53L21j22m54l07j46J00p8J97L70
1553.9B011L47K57K46p2N8j66l56j75k5j22q3J88Q5q7L77L73j54l92l49l51j37J19
1547.0A592K0M6m3j09j05j26J0J81N9j82l5j11k1j26l5m4N7L8j33N8m3o8oO3m4%k6
1538.4H67Lj2MJ01K4j7M4m7OJ8K5J26Q3O76L11m5n1J96N87j1n05l18j31jO2k48j51
1529.9A596k16m1lM9N0K15l2p4j68J91O24O27Q99m14m42m47M5P47Q3n29n13l10l13
$$ y = [360, 339, 378, 321, 354, 370, 297, 378, 350, 379, 399, 382, 288, 286, 414, 451, 357, 274, 392, 372, 357, 346, 406, 365, 314, 338, 347, 388, 537, 535, 499, 417, 554, 695, 679, 571, 549, 567, 591, 486, 528, 470, 431, 456, 496, 435, 446, 503, 452, 358, 515, 493, 490, 725, 854, 725, 616, 505, 655, 854, 763, 712, 644, 602, 576, 584, 626, 644, 616, 541, 570, 587, 546, 653, 579, 622, 636, 582, 543, 567, 618, 623, 756, 661, 681, 729, 786, 794, 755, 782, 853, 976, 1188, 1571, 2078, 1924, 1630, 1263, 1325, 1677, 2130, 2451, 2329, 1875, 1568, 1422, 1522, 1444, 1641, 2011, 2358, 2615, 2861, 2789, 2847, 2681, 2325, 2150, 2125, 2003, 1920, 2108, 2193, 2106, 2483, 2856, 2702, 2310, 1961, 1610, 1473, 1592, 1612, 1658, 1615, 1506, 1401, 1275, 1285, 1466, 1525, 1343, 1308, 1197, 1176, 1050, 1015, 971, 1028, 1066, 933, 991, 948, 880, 874, 937, 893, 893, 867, 870, 858, 862, 963, 987, 970, 1014, 967, 973, 991, 1016, 1142, 1225, 1901, 2212, 2167, 2116, 2312, 2899, 2888, 2383, 2065, 1934, 1933, 1995, 1747, 1596, 1380, 1339, 1336, 1385, 1435, 1650, 1618, 1544, 1376, 1567, 2191, 2818, 3717, 3303, 2861, 2414, 2459, 3206, 3289, 2760, 2247, 1937, 1624]
1522.6A624j09p4j72J30j53j02n5J34o5q6J3p6J75K9n7j32p6J12m0K8j2n3m0M6n4j6
1514.4I19L4j08J12L3o7M1N5Q9J1K6M8j51o4n8J14pp6n1K3j8rJ9J7n6J3K4PO9J11j58
1504.9I42J09%J64O3o9n6p4m5k5qK2J4j1J2p1k0R9p0j8J50R9J50j65K2R2R3L7p6j04
1495.7A256m6L5j7J87P8j29R3l8l9l0k1J42K02J64L55N42N5j67j77k03j85L11P8P6
1488.1B522L39N8L66N48J964L4j342k57k6OQ29R42L34j94j339r32n05N3M05J50L34
1481.5D289K80J27j75k97J111N46N6N0j336q60k80K06k20m81k58p9l8j2k9j65Oj67
1474.5B274J95N02p6N2j42j00K30J017K94n02m8m33m93j62j99O9j89j49p3j36j7J0
1467.6A924L7P2M9n2J9k0L03J0O5k70j70q3J38J36L2k56j05p1o6N4QK6L0k7J63l5J7
$$ y = [1624, 1515, 1441, 1269, 1399, 1246, 1144, 1089, 1223, 1158, 1072, 1085, 1009, 1184, 1213, 1156, 1024, 948, 1060, 1020, 1048, 1036, 983, 943, 989, 935, 919, 953, 845, 957, 990, 923, 964, 1019, 1108, 1119, 1145, 1193, 1042, 978, 920, 1034, 1027, 951, 900, 923, 905, 896, 915, 932, 876, 889, 913, 920, 989, 1100, 942, 1051, 1051, 1215, 1278, 1209, 1153, 1079, 1034, 1009, 1001, 1023, 1037, 1026, 1038, 967, 947, 1046, 976, 958, 1108, 1207, 1357, 1192, 1214, 1306, 1399, 1436, 1360, 1256, 1210, 1245, 1228, 1415, 1493, 1364, 1457, 1419, 1380, 1350, 1329, 1471, 1673, 1837, 2192, 2734, 2789, 2622, 2445, 2242, 2057, 2368, 2446, 2522, 2861, 2919, 3285, 3833, 5797, 5831, 4489, 4232, 4206, 4212, 5041, 5983, 6317, 6123, 4784, 3852, 3347, 3400, 3805, 3955, 4289, 4569, 4696, 4521, 4224, 5335, 5881, 5937, 5987, 4651, 3791, 3511, 3717, 3497, 3016, 2758, 2679, 2641, 2629, 2600, 2435, 2441, 2274, 2469, 2971, 2895, 2947, 2805, 2705, 2935, 3952, 4246, 3744, 3696, 3263, 2770, 2608, 2409, 2478, 2289, 2140, 2067, 1931, 1914, 1924, 1961, 2033, 2082, 2030, 2049, 2029, 2332, 2342, 2407, 2137, 1967, 1884, 2022, 2158, 2190, 1934, 1829, 1758, 1692, 1746, 1754, 1780, 1810, 1783, 1946, 1911, 1928]
1459.0A928k7rl0n2J46L2M5N9Q0P8N8m0M4N2q5N0K8MN6MJ8j42R3j3K61J14J95K98o1
1449.9C184q1J30L21Q52J559J1352o153m155j051m25l87l68k07J8L21J039P23M85N90
1443.8G747P72J454L486P179J0126J236k248m492n790l505j891k581j534r73l06J2
1438.8H692q27r18o78o44k35j66n2k21j97r0j76P3J47J56j3q9pl08l10k02j96k41j58
1431.5C340p1n3j99j1On0o7N4j09l0l3L0k6m3J71j39M7j31k1r2j65l5J2p8o4J3M1j47
1422.7B150K5J39J06r3J18k03P2j36L7o0M2Qn3N4l7r3K2j0q4mQm7q1J3K0n1R4PO8l1
1413.2B000j50M4J34r0j6q9k8J47J08j04l1j09r%M2M5q9O9l4J6m4n1m0Qn4l7QL5P1
1404.0A752l9J2nJ6r4Q7j53K3L0QTMq1Kj04ro7N1n4J6J4R3r3l2L1o9O5o4J1l0RQ8m9
$$ y = [1928, 1901, 1892, 1862, 1810, 1956, 1988, 2033, 2092, 2172, 2250, 2308, 2268, 2312, 2364, 2279, 2329, 2357, 2361, 2417, 2421, 2439, 2297, 2390, 2377, 2638, 2752, 2947, 3245, 3184, 3103, 3233, 3554, 4406, 5965, 17317, 11164, 7009, 5958, 5533, 5146, 4778, 4571, 4589, 4910, 5949, 6672, 7157, 7747, 8519, 9973, 13459, 20638, 30764, 32000, 29752, 25260, 19470, 15965, 14074, 11493, 9959, 8986, 8680, 8692, 7865, 6947, 6269, 5625, 5390, 5224, 5172, 4951, 4754, 4664, 4488, 4561, 4708, 4864, 4851, 4762, 4755, 4447, 4137, 3935, 3739, 3498, 3340, 3269, 3216, 3017, 3006, 3012, 2962, 2895, 2949, 2840, 2810, 2777, 2807, 2781, 2738, 2909, 2770, 2817, 2686, 2665, 2573, 2408, 2373, 2385, 2307, 2243, 2256, 2297, 2150, 2175, 2314, 2420, 2327, 2445, 2242, 2314, 2178, 2215, 2155, 2197, 2205, 2152, 2206, 2169, 2076, 2098, 2088, 2004, 2000, 2008, 1961, 1880, 1893, 1913, 1862, 1956, 1963, 2031, 2000, 1850, 1894, 2028, 1938, 1922, 1833, 1805, 1952, 2060, 1956, 1925, 1816, 1807, 1807, 1849, 1894, 1805, 1874, 1840, 1856, 1812, 1761, 1721, 1729, 1675, 1638, 1646, 1681, 1752, 1713, 1725, 1720, 1736, 1642, 1729, 1576, 1599, 1629, 1637, 1645, 1649, 1568, 1570, 1466, 1457, 1390, 1441, 1387, 1403, 1417, 1510, 1417, 1385, 1416, 1347, 1412, 1348, 1359, 1329, 1338, 1426, 1377]
1393.6A377Kj14N5o1P1k0K0m3l8P4j42J08j44L8j0n6OP3LM0r8j0N4pn4j09J04o3M5
1384.4A101n2O0j18J34q7N9n2nJ21j39L5l9k6M8r2N2m7Q3q5Oj02N2J9K3J06j10J4O8
1375.5A027q9K9Jq1N3K9j21M1J7J2N2k7J9no8R5q7QL1p1O0p1J24m5jp1K9J28n8n5o0
1365.7H45J49j23K0o7L4l4Q2ml2O6j9o7K0J5M7m5k3M6n4PO2m7L0O4q1j01Q3k4J5K2
1356.2H86N7r1j0Lj18K34j32Q9m3k9K1j3n0J20o6m2K7J9L8l4j9k0Q8o1L9l2J09l2k
1347.1I36N4J7O6n1M8J54j4J1P5K7O6N0P8M0m7m5pp7j15N6k6n8l5J7p9R1L8j8l8M1
1337.6A255P4N3QN0jJ02j8R2l9J3j19L3n6p2m0j04l9N7o3j23n0K7l9r0L4K2n6O7j12
1328.4H66J27p7K0n2n7m8L4N1n7L0j57Q2rjk5J57j42m9R9q7J00n0J2j52R5K3R1j07
$$ y = [1377, 1379, 1265, 1320, 1259, 1330, 1310, 1330, 1287, 1249, 1323, 1181, 1289, 1145, 1183, 1173, 1117, 1123, 1196, 1199, 1239, 1141, 1131, 1185, 1178, 1124, 1015, 1119, 1056, 1101, 1049, 1109, 991, 1125, 1038, 1097, 1045, 1040, 1161, 1022, 1057, 1018, 992, 1040, 948, 1000, 953, 1036, 951, 957, 855, 907, 926, 949, 1055, 945, 959, 1027, 938, 967, 968, 887, 940, 969, 848, 889, 906, 918, 970, 943, 962, 957, 889, 984, 897, 905, 936, 865, 925, 854, 978, 933, 932, 861, 890, 1018, 960, 905, 845, 994, 871, 891, 824, 858, 824, 906, 902, 870, 936, 917, 850, 870, 885, 932, 887, 864, 910, 856, 863, 925, 878, 908, 972, 891, 790, 873, 849, 864, 886, 943, 852, 842, 845, 727, 961, 829, 918, 875, 846, 867, 854, 804, 924, 858, 816, 843, 862, 900, 866, 847, 827, 915, 854, 893, 861, 970, 938, 936, 990, 1007, 1073, 1022, 1070, 1224, 1210, 1221, 1296, 1323, 1389, 1439, 1517, 1557, 1510, 1465, 1458, 1381, 1266, 1322, 1296, 1238, 1203, 1220, 1141, 1232, 1270, 1252, 1214, 1255, 1329, 1382, 1390, 1440, 1439, 1541, 1523, 1615, 1576, 1589, 1470, 1503, 1447, 1375, 1335, 1231, 1192, 1249, 1186, 1063, 1013, 1040, 1001, 911, 945, 967, 911, 978, 866, 993, 916, 936, 884, 827, 779, 813, 864, 807, 837, 680, 762, 753, 752, 727, 884, 742, 693, 792, 705, 805, 755, 767, 615, 710, 733, 824, 717]
1319.5G17K5n4O0p7L7QM6m4k0K7lM7l1k7j8j9qM6j05n9R9m4j9P9lj5K4p3K2k7L2Q1
1309.4G04j45N6O0%j21O6r0J27j16N3R0r4K8o%j2P8k8l1P1j40N7q7J70j08JkO6j3L7
1299.9F71j58JJ60l7j19Q0N0j42jJ16j0p0K6m4jM8o2J57o1L1m7m5m6J18p0M2Jr3J7
1290.8E12J9L8L3m0m2n0Q9PTJ77j37m6p0NN2O9Jm3k7M7l2Q0j1j06K8L8m3j5rO8m6K8
1280.6E81jl3O8r5M7q8n3J05k1J13j23L5qj3NQN7l7K1l0L3n7Q2J9j91N5J29p4m8L3
1271.2E19J3M1q0qN3p5J14l1o4K9j0j9QJ55p5j94J54q4N2N4j08P9Jq3%OJJ8K0p2O9
1261.3D83nK9%L4r3O1j35J08nlLK4k1o6N7J8P2o8Q7j24M3n4oNN2r5L5n2L0R1l9rJ2
1250.9D69n6L4Ll4M3Q2m4k1q1R0j4oPn1J7N1j35P7J12q1Rk9m6J04k6TJ6K0j34J91j21
$$ y = [717, 742, 688, 748, 671, 708, 716, 762, 718, 698, 725, 722, 769, 738, 711, 693, 674, 666, 712, 607, 548, 647, 603, 584, 663, 660, 645, 669, 596, 618, 591, 623, 704, 559, 615, 675, 675, 554, 620, 530, 657, 541, 594, 684, 590, 618, 612, 612, 600, 678, 650, 619, 690, 550, 607, 520, 690, 582, 583, 581, 647, 634, 671, 513, 514, 674, 637, 518, 598, 648, 506, 505, 621, 611, 541, 567, 523, 522, 570, 508, 665, 604, 635, 588, 543, 497, 615, 545, 587, 588, 495, 512, 531, 569, 602, 562, 520, 470, 559, 566, 573, 750, 613, 567, 497, 502, 554, 623, 624, 581, 554, 601, 569, 649, 638, 532, 560, 598, 555, 540, 531, 599, 553, 581, 580, 547, 615, 520, 567, 479, 426, 531, 510, 623, 500, 535, 527, 514, 519, 527, 584, 547, 568, 538, 571, 514, 596, 615, 424, 479, 608, 534, 486, 519, 532, 573, 493, 485, 538, 463, 577, 546, 482, 511, 501, 482, 490, 645, 570, 376, 530, 446, 498, 552, 444, 523, 524, 441, 441, 447, 448, 466, 486, 414, 483, 478, 507, 507, 541, 448, 509, 374, 482, 477, 474, 477, 501, 480, 414, 471, 489, 561, 493, 580, 456, 499, 445, 439, 444, 496, 401, 436, 384, 414, 505, 466, 457, 469, 413, 447, 450, 416, 459, 541, 497, 476, 395, 485, 471, 465, 472, 421, 438, 489, 354, 431, 543, 462, 471, 442, 396, 500, 474, 448, 464, 484, 350, 541, 420]
1241.1D20qp2L7R1n9R7j26R1L6k7j5k3JL8TK5r7K6m7O3j2j35J72j43J04n3Q0r9P7j05
1231.6C75R5mm4L4j7k5K2J5J2n1l3R8o9M8j03P2P7l7n7n5P3Qm0O9l2KR5l7k9m4J1l5
1221.5C94N5lk7J9q5Q2q%K7p0P5q6P9pn2oLO1q8O9lK8L9j00M6L1rJ6n7p2J22q9p4N8
1210.7C68RM4Rl7j8K9M8j01O8j01Q7N9n7J7r2O1M5o1p3J0J29l0l3L3k2J6r5O3J39r2
1201.3D22n9k0L3J11r7L2K0qn0O0n3P1k3l6O7m1r9R8n4q3L2J24j32J12p1M6mk2O3p7
1191.8C62O0q0RJ06j35R6j8K3qj03J05Q0n4r3J21j73Q7m5m6L8Q3q7J29j48N1O1r1Q2
1182.9D12j69R5N%M5k6M2J0m7J6R4j69J2R3r9K7NM9l2m3Q9Kl3J0J4k1N1mj43J18o7
1173.1C36M6p2J2N7j9N8j8j2M3q6k0Q4qj17Q5rL6O0j01QJM4p7l5Q4M2l1j2L1NL2q8
$$ y = [420, 412, 340, 377, 468, 409, 506, 380, 471, 507, 480, 465, 442, 443, 481, 519, 544, 447, 473, 426, 489, 477, 342, 514, 371, 475, 422, 502, 403, 480, 375, 470, 466, 422, 456, 439, 414, 436, 451, 463, 412, 379, 477, 408, 456, 353, 425, 502, 465, 408, 353, 426, 434, 394, 463, 431, 433, 528, 491, 462, 418, 429, 394, 449, 446, 419, 438, 353, 435, 427, 427, 454, 384, 459, 373, 452, 445, 393, 387, 390, 451, 363, 432, 429, 457, 496, 396, 442, 473, 464, 480, 423, 351, 473, 384, 310, 368, 377, 421, 430, 393, 375, 404, 452, 351, 419, 318, 405, 464, 407, 424, 332, 393, 438, 377, 304, 314, 443, 413, 380, 413, 391, 407, 312, 375, 514, 422, 363, 343, 376, 487, 390, 422, 442, 434, 384, 444, 391, 462, 439, 403, 470, 429, 330, 428, 374, 291, 323, 447, 315, 427, 356, 402, 398, 376, 439, 362, 422, 342, 351, 457, 322, 418, 400, 423, 415, 312, 417, 497, 443, 350, 471, 298, 385, 340, 294, 332, 415, 328, 457, 309, 360, 421, 330, 412, 243, 338, 343, 343, 388, 362, 404, 414, 367, 383, 477, 308, 320, 413, 314, 341, 346, 395, 363, 320, 409, 411, 378, 388, 402, 381, 432, 428, 285, 403, 336, 382, 310, 322, 379, 360, 418, 400, 388, 431, 345, 325, 409, 401, 284, 369, 360, 396, 456, 355, 363, 364, 408, 331, 296, 380, 422, 391, 379, 410, 415, 447, 359]
1163.0C59Q0r7k6O6m7mm8J07l9K5rN9j31O6N8j0k6m0L3Q4j00P2l1j9O9m5k7M5l4n3
1153.5C37pO8mn0k7j9O8N5o4O8o8l5M1O2m4qQ3p6J5l7K6NLr3M7M0K0TLl6o3N8J5j7
1142.7C86o4N8L0kl5r3O1Q8k9n5P3rM7r3mJ8M3p8L5jl6Q8j25J48o6N0k7J17j27j6Q3
1132.9D65j20R2rp9L5J21o4j09P1k1N0K5o3K4L9k9Mkm6n9R2j66J44L2j5ONjqM2q1J33
1122.8E08l7o3m8N9J1k9JrR3L6l7n6J38o4J39J76M07L10r2l39k02j34P3j25j15j2Q4
1114.3F73m6N1K7K15Q0N51J87j31l11k69j42O5o5J02K58M40k7l58j86k10j07m4N1j3
1106.7G91M9j52N3N7P5J80K21M63n6m85j70j51l2n7L6o0j23K9j15J05r9PL1joJ2r0
1098.1E12K5O1m1J00j08p7Q2P3j44J18k0J06j50P0p9N9%j81J10L8M5j42L7J4k7l7J7
$$ y = [359, 439, 342, 316, 382, 335, 331, 283, 390, 351, 376, 367, 426, 295, 361, 419, 409, 383, 343, 376, 460, 360, 432, 401, 382, 451, 406, 379, 424, 390, 337, 330, 398, 394, 344, 317, 298, 366, 421, 357, 425, 357, 322, 363, 425, 381, 373, 456, 380, 395, 358, 384, 389, 392, 299, 346, 386, 406, 426, 429, 393, 330, 388, 403, 386, 322, 380, 410, 408, 373, 280, 341, 429, 400, 345, 418, 409, 456, 363, 359, 377, 420, 342, 377, 376, 340, 428, 303, 451, 385, 435, 408, 525, 398, 382, 465, 345, 437, 428, 349, 384, 505, 441, 332, 403, 382, 432, 457, 394, 418, 457, 428, 432, 430, 384, 325, 417, 251, 395, 427, 412, 418, 423, 422, 414, 456, 375, 508, 471, 408, 360, 419, 430, 401, 402, 393, 486, 522, 485, 429, 567, 503, 642, 818, 1225, 1535, 1443, 1104, 902, 768, 841, 716, 601, 589, 673, 627, 678, 705, 920, 1000, 1551, 1738, 1607, 1296, 1027, 885, 950, 885, 987, 1245, 1685, 1658, 1300, 1114, 904, 797, 753, 804, 791, 840, 688, 741, 798, 873, 1053, 1274, 1737, 1681, 1196, 1026, 875, 843, 786, 822, 762, 639, 668, 553, 658, 559, 566, 597, 596, 590, 602, 512, 537, 598, 557, 657, 549, 472, 554, 627, 483, 601, 581, 687, 537, 607, 528, 587, 587, 406, 516, 554, 599, 457, 494, 508, 481, 444, 461]
1089.6D61lP0r7R3klM6k0K2q5J2J7M1o8n4J27j07j2L0k6P2j17N6m3J16l9o8k5N2j1
1080.1D35k2N3KQ0o2J47rnL5j38m6O5o2K3j2j9j8QK0J6L8O0K4pjRo5j8RM5m4P9m3m5
1069.4E32o0N8j4j00rj5J16m7J7k6k7QP5L3J01o0p8j36R5j5M8p0j0P3q6n5J26Lr3N3
1059.9D37r6R3l2K4j4j9k6n2J55j05R7k2j16NJ38n7j7r2J12n1l1N8l0L2jK2r4L7l8
1050.7C17R5m3J0L9o3R2l5Mj03Q5M6j65J9L4J21j11J12q9l4M6j3l0P2o2k5Q2L5kn1
1041.5C83m2N5o3M7k4J04r3J3m7J07p1R9o7n0P3p6K3R7j01O8r5l0OkL5Jn2RP7K3j2
1031.7C95j10J08n1k9Q3m5L3l0J8P3q0p9J30p9K0K1n1O1M4m8k5n2J00L5k3m0P7j52
1022.9C04M1L7J3J7l9o2M2ll4J4K7M2kTj4K6m6nj1M7M8m1j06j5J35j7p4J1oK6j0L8
$$ y = [461, 458, 528, 431, 524, 522, 519, 565, 545, 567, 482, 494, 511, 552, 484, 430, 557, 450, 438, 468, 442, 514, 397, 453, 410, 526, 487, 419, 394, 446, 435, 413, 466, 468, 548, 486, 633, 624, 619, 654, 516, 470, 535, 473, 496, 484, 465, 447, 455, 475, 491, 529, 589, 613, 606, 605, 614, 549, 531, 540, 585, 541, 620, 577, 532, 472, 530, 516, 416, 407, 392, 508, 461, 478, 452, 425, 433, 508, 541, 642, 582, 504, 368, 463, 448, 496, 426, 416, 489, 403, 348, 474, 477, 384, 437, 341, 434, 402, 426, 412, 393, 367, 315, 470, 365, 462, 440, 324, 329, 467, 410, 393, 301, 413, 362, 331, 389, 359, 391, 390, 412, 318, 355, 317, 412, 369, 379, 418, 355, 447, 412, 416, 313, 398, 444, 279, 298, 332, 453, 342, 454, 365, 331, 377, 364, 334, 406, 344, 319, 401, 436, 434, 383, 341, 396, 333, 380, 356, 460, 367, 380, 333, 440, 369, 468, 401, 351, 424, 348, 371, 468, 367, 435, 340, 310, 316, 314, 349, 350, 298, 307, 384, 407, 395, 285, 393, 342, 313, 396, 351, 384, 354, 372, 445, 365, 286, 416, 337, 357, 378, 327, 388, 432, 384, 359, 307, 407, 442, 419, 379, 456, 304, 345, 382, 395, 412, 373, 311, 353, 350, 316, 330, 357, 399, 397, 395, 381, 407, 361, 356, 345, 392, 440, 399, 293, 278, 413, 396, 322, 333, 327, 353, 343, 381]
1012.7C81rm3MM8p0M8n5M5k2M6m4k5L2Q0l5rR2j37O9j04P4l6oO8Nm1M7n6J4n6R0n4
1002.6C41L2kj9m8J14m7K5o8P5Qj11P7J2q9J11l7J0J9O9j44J03P2q1K4L7N1j02J39
993.8E71KJ42M7J11K42O68M27K96j05l20m42l58j34m0j58M7j30j0J28R6L04N20L76
986.5B280K43k03l95n02k32r9j24j03j22o0QM2q0j11N1Kj8K5j9r7M9n3R8p0N9p8l6
978.0D55J18K6j36O8r5P6L0j25N5K4n5m4n5J08p0L8RK9o4QTJ0Jn8N5k6j2M3j15L5J03
968.2D44K7l7Tj0l8RP5j9O3p9l6L2K5o4r9Q2kqN2j09J65j65Q3Q1k4onk3O7j22N7K0
958.0C99prm0L3j6l3mN8r0L9N6K2l8r1K8L5JJ2Kln1JL8p4P0l4O3l5K1o0Q5k3qmN1j22
946.7B72J15k7M7m3j2m1O5k3J8j03L3P7p6q2J18N8j03L8Pm2N2l3j1J3L4J6q5M7J5n6
$$ y = [381, 372, 329, 333, 381, 311, 359, 304, 349, 327, 373, 329, 304, 336, 416, 381, 372, 464, 327, 396, 292, 366, 330, 324, 392, 397, 356, 403, 347, 361, 305, 395, 341, 373, 371, 352, 304, 418, 371, 396, 328, 403, 411, 300, 377, 389, 300, 411, 374, 384, 403, 472, 328, 431, 503, 422, 446, 483, 534, 432, 571, 573, 715, 762, 873, 1115, 1783, 2210, 2506, 2401, 2081, 1639, 1281, 1147, 1107, 949, 996, 866, 856, 984, 1080, 1384, 1904, 2280, 2523, 2320, 1925, 1423, 1191, 1092, 968, 865, 743, 683, 691, 733, 653, 542, 593, 595, 577, 602, 583, 486, 535, 482, 580, 510, 569, 491, 455, 573, 599, 463, 531, 436, 512, 542, 417, 472, 496, 441, 397, 342, 450, 380, 418, 427, 456, 392, 400, 408, 418, 419, 361, 416, 390, 378, 421, 306, 341, 444, 471, 434, 397, 387, 349, 358, 433, 414, 477, 398, 362, 394, 419, 355, 256, 338, 336, 328, 380, 271, 436, 271, 354, 435, 411, 405, 400, 377, 444, 322, 379, 399, 392, 383, 343, 376, 360, 327, 323, 381, 291, 330, 386, 408, 370, 279, 307, 342, 343, 355, 357, 354, 303, 304, 342, 268, 338, 304, 367, 332, 353, 293, 378, 355, 347, 343, 394, 272, 387, 360, 407, 364, 352, 311, 376, 353, 371, 268, 301, 378, 302, 220, 338, 396, 293, 331, 338, 296, 348, 315, 304, 317, 351, 367, 282, 329, 344, 288]
937.2B88L6M7n1j7J9j1L3o2R7j6l6o7j7M2P4l4l6J5N1J0p2lK9j4L4j2M8m3m6M4p8Q2
927.1C34J5j2K1m6K5q3N8O0m4m0j2K9q6J03Kn5J9LJ5Tok0j0O7q6Q6n0L3n3K1N4m7P6
916.6C86l7%m8p2J26n0P2j88M0K12k26J70r2P7j40R4q5K3J38j31N1L6qp0l8O1l8K4
907.8B87Q0k4l5K4ol3Kk6O2K2j27P1oRL7j8l1qo1R4k1n8jJ6J09j26P8%j1j5M9k3rK9
897.0C30j4qj30J24M2j1J3l8J7J6m1n1N5j3J5j06J75N5q5k6K3J5p1qkl5M5O7p6O1o9
887.2B69on1J27L2p7j7L6n3N6O4j21Jq9K8J65n9P7jO1m0P3J56K0kJj37j1r6L6p8j7
877.4C47N0j27J46m4K7P4J30J37n9J7n4p0j14r6J5K4l0lrk9q7J14m2j8K3O1r4M0qm6
867.9B75L3L4p8L8j1J1J21j3j07n6J70j17N6o9n1R1o6Rp1M2N6J5k3K1Tn0M1m9M2k0
$$ y = [288, 324, 371, 320, 303, 322, 311, 344, 282, 379, 363, 327, 260, 243, 285, 359, 325, 289, 304, 355, 365, 293, 290, 319, 305, 339, 327, 375, 332, 286, 330, 252, 334, 349, 337, 358, 312, 337, 254, 312, 372, 328, 288, 276, 305, 219, 322, 324, 269, 288, 291, 306, 321, 315, 295, 285, 352, 266, 352, 302, 335, 282, 303, 357, 310, 386, 349, 349, 301, 229, 355, 305, 377, 189, 229, 441, 215, 385, 293, 370, 230, 324, 239, 262, 400, 269, 320, 356, 348, 278, 240, 301, 263, 287, 367, 343, 308, 332, 326, 293, 295, 269, 331, 353, 226, 297, 291, 300, 337, 319, 288, 280, 219, 313, 292, 234, 233, 249, 358, 232, 310, 310, 299, 284, 333, 310, 301, 330, 316, 308, 178, 302, 344, 333, 346, 308, 325, 341, 300, 249, 304, 291, 306, 200, 375, 430, 345, 319, 342, 357, 286, 278, 276, 241, 286, 353, 277, 338, 269, 263, 212, 339, 371, 294, 277, 313, 260, 316, 380, 259, 260, 171, 199, 364, 305, 382, 381, 442, 402, 475, 631, 651, 649, 650, 513, 502, 406, 442, 364, 347, 397, 270, 416, 372, 399, 473, 603, 740, 681, 698, 644, 574, 460, 364, 379, 403, 373, 370, 361, 332, 245, 359, 317, 299, 322, 383, 289, 329, 321, 275, 308, 342, 264, 302, 291, 302, 423, 410, 303, 247, 417, 300, 356, 287, 236, 327, 261, 270, 199, 241, 297, 312, 289, 310, 331, 281, 322, 273, 315, 295]
858.4B95O9o5m0J2jo1Q5ML3j04J17l6M0j09L9rM0J2m4Ro%L5qm7k9K6K8L1n0M1j1m7
848.0B49M6k1K7lo1M1J4L6j53J37q9L7P1o5J4lN7p8N7rO1j00K1k2o7J63j21R2r8qN8
838.2B83o8P4LQN1j06L3NL6p7k9M0J9rj3R5p8M7j12Q2L5j8Tl0N7k1Qml5J2k8RnQ2j05
827.1B23J10j14O8j1n3N9o7Q4l8k6Q6q9N0m2L6j7Pk7JQO1N5n4j17P1mj0o0J24m2N3
817.3C25m3q8Q7N2j39J7MP8m0N1N6Kj27M0R5j38O0O6j27l8N1kP8l5l8NQ9j20L1j3M0
807.5B79o8K2P2K7kj68J31M6k06R2J9Q1n0l1J6%K4j0rJk9J00r9M2nn3J47m7n1m1J4
797.7B44J5l9L9m9L6m4J8k9P0K1j10J6O6K2n7N2q5%J08m9L4l1oK2kJ1j39P5J1K9kK3
787.6B70JO1j26O4M7r9L5p3M2Q2r5N3J0N8p1ml0J2K4j7jL9o8O7p9L1O6l5N3j00k8o
$$ y = [295, 364, 299, 259, 271, 270, 209, 294, 298, 331, 227, 344, 308, 348, 239, 278, 269, 309, 321, 277, 286, 280, 280, 315, 307, 260, 231, 257, 285, 316, 266, 307, 296, 249, 295, 274, 301, 298, 237, 278, 292, 328, 175, 312, 223, 260, 331, 266, 280, 277, 334, 256, 313, 304, 365, 265, 286, 264, 197, 360, 239, 331, 233, 225, 283, 215, 289, 292, 300, 351, 245, 278, 283, 319, 242, 213, 253, 272, 263, 250, 345, 267, 314, 202, 284, 319, 301, 283, 253, 310, 289, 297, 293, 258, 270, 242, 251, 246, 328, 223, 333, 219, 287, 276, 223, 282, 215, 299, 261, 235, 321, 232, 282, 240, 276, 259, 266, 239, 240, 248, 309, 364, 310, 193, 264, 260, 250, 190, 314, 272, 325, 282, 194, 281, 333, 194, 211, 215, 293, 253, 304, 360, 362, 235, 275, 370, 232, 292, 358, 231, 193, 244, 242, 320, 285, 247, 252, 341, 221, 252, 239, 279, 211, 233, 305, 332, 330, 162, 293, 339, 133, 225, 244, 325, 275, 244, 260, 260, 284, 274, 265, 266, 237, 337, 238, 280, 275, 222, 369, 322, 271, 230, 244, 259, 220, 259, 210, 246, 202, 220, 191, 261, 282, 172, 188, 254, 276, 219, 271, 186, 186, 294, 245, 279, 248, 242, 264, 262, 273, 134, 209, 220, 249, 247, 270, 271, 332, 206, 270, 317, 218, 253, 180, 222, 304, 209, 262, 272, 330, 259, 255, 225, 237, 261, 244, 243, 282, 214, 281, 202, 233, 299, 264, 317, 217, 189, 183]
777.5A83P3j1Jk5O8n6m8O3L4k9O2j4j50J14q1M8k3P5o2O5J5k0p0M6j21Q0nM9P6q5k9
767.7B23K9p0R8r0O2L2n1P8j13P8L4m2J4k4oQ8j11M4N1p7l4k5L2O6r9NJ6O1n5Q1n6
757.9B39p3J04l2L9k2L6mOM8j57n2J05m1K0QL4j13J52J3m7l9l8Q9n8qL2q9M5L2L1N
748.1B65rl7Q4n5o5N9J3n0M3M0k5l9J1m6P7j6M8q3M1Qj9M2n4JK0O0Lr0OJ2PK4l6J0
737.3B50q5P6j04J25J8j8mj00M2O3l2K1NL1k4j00R5qj0Ko4K2M5p6N0L2k5o3J18m2Q1
727.5C21m7lK7K6k02P9O7m9j2J6O5j5k9p3L8%O9j7OM4j33O3k2O5On2j8K1l5J16Nk7
717.4C00o5pO0K7l4j0J0NLp6J04m4TQO8p9K8K9n4N3k1j7M5m2j24R2R1l2p5J01k1n0
707.3B29JmQNMl2J7ll1L8K1Q6j26ln9J32p5K5qK5on3Q5q5O0p6R0k7%j5m1J06k5o2L6
$$ y = [183, 256, 245, 246, 221, 289, 233, 185, 248, 282, 253, 315, 301, 151, 265, 184, 232, 209, 284, 222, 287, 302, 282, 212, 258, 137, 217, 212, 261, 337, 252, 223, 252, 182, 280, 190, 252, 284, 233, 311, 198, 276, 310, 268, 282, 258, 252, 340, 229, 273, 324, 247, 213, 188, 220, 286, 187, 192, 208, 269, 214, 295, 239, 166, 270, 238, 277, 255, 291, 287, 293, 341, 184, 132, 237, 196, 216, 224, 258, 145, 297, 310, 263, 224, 186, 275, 217, 209, 241, 152, 197, 229, 260, 265, 256, 219, 303, 248, 183, 242, 255, 205, 248, 288, 263, 224, 235, 189, 266, 250, 298, 215, 256, 264, 245, 287, 233, 234, 254, 314, 317, 227, 233, 245, 252, 276, 240, 250, 165, 241, 137, 262, 280, 262, 258, 158, 200, 263, 231, 252, 257, 288, 264, 164, 259, 251, 241, 243, 179, 201, 246, 170, 220, 252, 227, 164, 282, 240, 321, 274, 271, 298, 324, 122, 201, 268, 219, 207, 223, 288, 273, 244, 171, 209, 209, 278, 261, 267, 311, 178, 241, 219, 284, 290, 238, 220, 241, 206, 322, 327, 300, 235, 228, 288, 315, 281, 271, 281, 286, 289, 213, 317, 273, 229, 237, 305, 226, 254, 283, 229, 282, 261, 244, 289, 247, 123, 215, 306, 274, 199, 300, 279, 229, 230, 226, 234, 239, 243, 211, 228, 225, 194, 232, 253, 339, 213, 210, 151, 283, 208, 233, 225, 250, 244, 191, 276, 191, 251, 175, 265, 238, 238, 223, 182, 288, 263, 201, 237]
696.2B37Ko6J20j85J20O4n2j5MJ2pN2Lk0j2n%j11R3M0k8j5LM3JK3m0N9j22M6nl0L0
685.8B39l4J8M2n7%j4j2P1qM5j00L6Mj2R3m1q6O5Lk4K5rJ5J1j15J1Q7jl3q5J36qq2
675.3A80P4nO3l3r0J07j7q2mM9qQk8k9%O1J5m3nJ6LL5o6Q1n1n2M7KK9K6k6l2j4L8P
664.3B56m6KqJ23n2o1N7Km4O0p1l6P4m1J52j91O0%L9%r2J30k2l1r6P1m7M1TN0k9k3
654.2B68j9lj30R0K6p2J02o5M1K3q2M8J6Nn2L7l8m2jN7J9p0M4K0L2L3J5q0o0J06O4
644.3C32k14J17j5j0j16J33l1O8r7PJ04J6m5O1j09J8o2J02N5j7n1J4m0P7j06N6mp6
635.5A67M4r4J44j2L9qo4PJ2r5J20M6o7O0p3J8K9l4j8p3J79o1K1J3j41N6J2QMO6n1
625.7B54n9NL8R5q5J5r0R8j1l5j7q8J17j8P0o3k8N7n7Rl8j0P5K6K8k8r7Q3r1J08rn6
$$ y = [237, 239, 173, 293, 108, 228, 292, 240, 225, 229, 241, 234, 286, 289, 269, 257, 252, 252, 141, 234, 274, 246, 231, 234, 277, 278, 301, 261, 320, 198, 244, 239, 209, 239, 205, 223, 265, 208, 208, 194, 182, 253, 245, 290, 190, 226, 230, 218, 311, 270, 184, 249, 252, 228, 253, 244, 259, 270, 155, 166, 253, 252, 219, 134, 270, 262, 180, 254, 249, 312, 279, 189, 296, 279, 197, 193, 242, 234, 242, 214, 185, 185, 246, 261, 218, 213, 229, 232, 267, 201, 282, 231, 179, 226, 228, 257, 283, 257, 225, 211, 249, 256, 210, 212, 204, 327, 275, 214, 271, 273, 229, 289, 218, 182, 256, 215, 367, 176, 236, 236, 275, 275, 183, 313, 291, 260, 164, 235, 188, 229, 270, 320, 291, 268, 249, 246, 116, 206, 232, 160, 262, 197, 238, 261, 179, 227, 243, 248, 196, 233, 195, 153, 152, 209, 228, 158, 202, 222, 254, 287, 302, 222, 162, 268, 332, 118, 235, 220, 210, 94, 227, 196, 264, 167, 174, 278, 294, 249, 310, 201, 219, 157, 259, 314, 297, 246, 260, 220, 297, 191, 247, 243, 167, 211, 117, 261, 249, 288, 280, 216, 223, 235, 140, 260, 306, 239, 299, 226, 244, 273, 239, 221, 148, 327, 266, 287, 300, 159, 215, 227, 235, 239, 305, 254, 195, 200, 238, 333, 248, 263, 173, 271, 260, 225, 208, 120, 237, 219, 289, 226, 198, 255, 198, 207, 169, 159, 234, 260, 288, 260, 163, 246, 155, 263, 254, 198]
615.6A98q2J32m1j5N8L1k0m1l6O3o2J9R1p2l4rk2R3r7o6J22Q7j21J16o2OJ2K1n2J9
606.1B36Oj5m5L3R1r4Mk2K1j3Q6j44J02n4O8KK4o8k6L3m6OmJ03p2j4J09l3p7N0n3Q
596.0B02P9k6J0p6P3p8R2k9j2K5l4J7r3J18k0N6j08Q1L8j05Ln7P0Qj2Q9n0np0M9q9
586.2A46Q3l2R9r8j1J30r5n4m4N2O8pn7J9P8p0QO7p5nJ4P4L2r5Jk7O7Qn4J12j20m9
576.0A65O2J20k03P6Q3On6mo4P5m0l7N9n6P5j9qm1Q5n4o1N7k2O9K1o2j19J47m5PK9
566.2B45l3l9O6k6r5J05J8OM2r7l1P3m2J14k0J2o8m7P4K3oko3N5m5PP6r0jJ25j44J54
556.1C46j20L7k0mnl6P0J3o3l2M0N4r2N3M7r6M7lK3k3rK6J5ML2q8%R1N7j38m0K6m8
545.7A64J01J07j09n5N6L9l3TR1j18K5L1j0j02J24j3m8k6M6N8o3l2L7P6r6j4P4m3K6
$$ y = [198, 116, 248, 207, 192, 250, 281, 261, 220, 184, 247, 185, 204, 295, 223, 189, 180, 158, 251, 154, 88, 210, 297, 176, 292, 230, 236, 248, 269, 217, 236, 242, 227, 182, 215, 306, 212, 216, 194, 215, 202, 288, 144, 246, 192, 260, 262, 286, 218, 192, 225, 179, 185, 181, 284, 212, 198, 307, 274, 197, 247, 194, 202, 281, 255, 265, 189, 262, 184, 276, 247, 235, 260, 226, 243, 150, 268, 248, 304, 196, 277, 315, 210, 213, 156, 226, 234, 222, 311, 261, 256, 186, 235, 146, 229, 197, 296, 198, 187, 317, 222, 168, 124, 176, 244, 237, 180, 199, 277, 207, 215, 282, 207, 202, 216, 290, 322, 227, 228, 201, 268, 276, 222, 334, 214, 165, 227, 347, 144, 220, 303, 309, 253, 249, 185, 260, 220, 183, 242, 186, 261, 242, 234, 193, 278, 224, 163, 220, 198, 267, 288, 226, 107, 254, 209, 216, 245, 212, 173, 239, 213, 118, 223, 241, 247, 289, 192, 161, 234, 192, 306, 286, 298, 230, 183, 257, 280, 274, 272, 209, 264, 219, 226, 302, 212, 211, 336, 192, 346, 226, 263, 243, 239, 234, 198, 268, 281, 218, 186, 226, 280, 188, 241, 288, 192, 239, 236, 259, 236, 227, 253, 268, 272, 304, 216, 216, 307, 364, 226, 186, 212, 164, 265, 372, 263, 208, 264, 303, 270, 237, 328, 210, 235, 266, 256, 154, 278, 265, 217, 191, 237, 295, 232, 200, 237, 313, 217, 203, 277, 234, 260]
536.5B60l4L2Qk5m5jJ35r8%J06j18N1l1m0R8q7j7O8K7N2j10m5J00o6R0J7l7k5j5RJ3
526.7B72jj38P7k8M2L6n3N5K7q5K9J08j42J3K8o4Q2Q4j04K09k27P1J3lm7qK9M1l3n2
517.2B31j0L3N1r9QJ28j48K1o2J33N7k4q2L5j8o6J21j8k8J3k0J10j19J2j7J24r5N9
508.4C30o8L9Mm2m1P4m1qq4R5P6o7Q0j10K0L1j2o3R4k07J74j5N8N0p3n3Mk4J24l5m3
498.6B67j4J3p6N8N7j34L1N8rO0m2O0k6J1L4k0q3J28n9n3M4k3j6J02j34M4k8o9J57
489.4C38k0n3N1j9Q0j67J9L6M3k4j3m0N6J8klM5k8p3j9L0J4o1L9RL8J7L6j19L3Ln4
479.3B10J34j67J65o4O0j6K2l6k0M7N3j40K5N9n3J2l7k8J59l0Mj12K1P4Q1k8o9M0J7
470.1C83l3L8J08k0J1k1J94L46P77Q04O08M7k08p87m78n07j97l16j6j08J27o4j15M
$$ y = [260, 226, 258, 266, 241, 196, 195, 330, 232, 232, 338, 220, 271, 240, 200, 298, 211, 194, 262, 289, 341, 231, 186, 286, 220, 310, 327, 290, 265, 250, 259, 272, 271, 133, 210, 182, 224, 260, 207, 262, 289, 204, 233, 341, 199, 212, 240, 176, 258, 342, 238, 447, 220, 291, 304, 301, 254, 246, 275, 316, 283, 231, 221, 254, 305, 206, 214, 342, 194, 215, 153, 286, 343, 319, 237, 272, 254, 188, 309, 291, 263, 276, 256, 366, 247, 259, 242, 366, 271, 330, 262, 301, 305, 263, 222, 296, 255, 247, 163, 258, 334, 267, 347, 237, 257, 288, 276, 213, 307, 100, 274, 259, 317, 367, 294, 241, 245, 221, 345, 310, 267, 253, 266, 190, 248, 305, 171, 202, 260, 251, 311, 269, 329, 303, 314, 348, 328, 245, 373, 314, 261, 305, 282, 266, 368, 234, 278, 250, 181, 338, 318, 265, 316, 297, 377, 210, 229, 265, 308, 284, 271, 231, 287, 305, 303, 300, 345, 317, 244, 225, 255, 269, 208, 247, 256, 294, 311, 347, 228, 261, 264, 210, 344, 177, 342, 278, 338, 322, 344, 308, 288, 335, 388, 248, 273, 332, 279, 291, 254, 226, 385, 355, 359, 247, 268, 342, 423, 395, 326, 366, 383, 350, 388, 496, 476, 487, 466, 660, 1006, 1783, 2587, 3195, 3242, 3034, 2247, 1769, 1262, 1065, 749, 733, 625, 752, 688, 573, 577]
462.5E77N5p0m4J6mj09O8k1M1j03O5j02P5K3N2j08L6Lm9p9J23o6Q1r5pJ3N8m0p0QQ9
452.7D16l3O1n6m3n2J52O2p5r5P1k9n0M1l0l3M9K5o9M8Rj3m9O8p8L2j5J8j4n5P0K3
442.9C56J1L1l2j8j09J14kj28O2N1j2M0k9j1R7r5R5j64O7M7rM5j15K0L1r0K1J36Ko1
433.4C51k4%K1TM8q4l9Q7m1l8o9J87qJk1l8N2l8M6j01J39j06Pq3RJ43j49l4J17N8m5
423.6C69q8Q6k3j0J52k18L7J42J0r4K7m8m5Q8M3o8%O6P7R8n8j17k0R4n0N5J8L55L63
414.4A241k60k85k36Q0K6j00m1rl9Ol0J7N9m7L9j13J24rr5L9M9J7j4n8Nl8P1n1j7J9
405.0C50L7j4P6r5Q0r3J27Q0j56j1J16q5l7P2Nm7N2L2o5O8l2j34N9L0o2K2TJ1M8j11
395.5C45P2r4Q9m5j7k2R4n3J11j79P8P1q1o6O0L3R4r5n4N2Jl0J8N0j89J65j45J04n3
$$ y = [577, 632, 562, 518, 534, 530, 421, 489, 468, 509, 406, 471, 369, 444, 467, 519, 411, 447, 450, 401, 322, 445, 379, 460, 365, 358, 371, 429, 389, 319, 327, 416, 383, 444, 388, 345, 293, 445, 507, 432, 337, 408, 379, 329, 370, 340, 307, 356, 381, 312, 360, 369, 356, 307, 375, 297, 329, 314, 332, 318, 263, 333, 356, 367, 398, 366, 348, 239, 353, 351, 223, 285, 336, 324, 364, 335, 324, 421, 326, 421, 257, 324, 371, 362, 407, 292, 312, 343, 253, 274, 410, 412, 351, 327, 327, 348, 369, 417, 333, 294, 381, 340, 302, 233, 420, 412, 413, 392, 354, 406, 368, 414, 313, 452, 346, 353, 270, 279, 422, 273, 239, 356, 414, 369, 281, 367, 344, 334, 486, 268, 305, 447, 457, 363, 390, 342, 297, 385, 428, 360, 360, 426, 503, 601, 543, 426, 406, 500, 450, 505, 523, 878, 1241, 981, 696, 460, 540, 566, 466, 425, 416, 377, 383, 353, 370, 429, 382, 421, 308, 432, 423, 328, 367, 416, 433, 419, 361, 366, 328, 399, 348, 331, 350, 387, 373, 449, 354, 434, 341, 468, 548, 392, 381, 497, 412, 375, 447, 452, 405, 457, 489, 424, 492, 460, 326, 385, 415, 353, 375, 397, 408, 456, 345, 417, 323, 412, 367, 350, 328, 422, 369, 480, 301, 379, 450, 369, 303, 363, 396, 490, 395, 341, 393, 394, 364, 382, 432, 243, 408, 263, 367, 314]
386.3C14O4o9J34n0k8Jj6oK0m3m0J00K0r9J14o2ML3n6Nj5M6L5j2o5P1M4l2m2MNK1%
375.9D00l0J7l2N8j02N7L3p0R3N3n6j10nK2M5l9J23p8k9o4R5o4L5K4k3L1p1P4O3pj1
366.1D32j26N5N1J5m9K5k7j1N4l4k0j2Q4j3Ko9Nk3O5l8j5L0Q5QJ5j11O6K7p1o6O1N
355.9D00N4%K6l6K7l8J9n3L0M0mJ98k18N1m6R9ml1j6l2M0Kq5M0L5l3P7n7K1j0J28m5
345.8E79m8Q8n8p6o7P8l2O4R9r0p0k2N5J1J9nj3j07R8M5j02J21kn5M4m9O2Om7l5J16
336.0F07j71O2N7r2P2j8L1k1J4n2J03M0o0M6J0J2K3n3k7L7J0Lk3k2P2K0l5Q4m1l8P1
326.2G21P6m0k1L0o9K6J9j4Q1m2M5Nl6jQ8N5j20Q6J2K6L1p1R3L7J36j15NK22n8K1%
316.4A228K77m7P4J16J94Q5J17K41J91K90L41M69N67J138J470K486M485P150O501j953
$$ y = [314, 378, 309, 443, 393, 365, 366, 350, 344, 364, 321, 281, 381, 401, 302, 416, 354, 358, 391, 335, 340, 325, 371, 406, 394, 329, 400, 444, 412, 370, 374, 379, 400, 400, 370, 387, 355, 413, 311, 368, 401, 331, 424, 477, 421, 311, 306, 328, 373, 334, 457, 379, 350, 286, 381, 317, 352, 376, 353, 384, 313, 387, 450, 443, 432, 306, 361, 412, 427, 378, 403, 376, 365, 419, 385, 365, 353, 437, 424, 426, 357, 362, 339, 404, 366, 351, 381, 466, 474, 489, 378, 444, 471, 400, 334, 395, 400, 454, 454, 480, 444, 471, 433, 452, 399, 429, 469, 465, 663, 445, 496, 450, 549, 545, 514, 498, 466, 506, 508, 423, 463, 498, 465, 542, 485, 506, 496, 624, 579, 531, 619, 561, 485, 418, 496, 464, 528, 627, 537, 467, 445, 500, 511, 530, 525, 512, 405, 503, 548, 446, 567, 565, 510, 554, 505, 567, 573, 526, 491, 607, 436, 498, 555, 463, 535, 517, 548, 527, 541, 489, 592, 632, 572, 618, 628, 640, 663, 610, 583, 620, 630, 633, 610, 588, 660, 680, 645, 729, 688, 650, 721, 797, 757, 736, 766, 697, 723, 742, 728, 809, 767, 812, 817, 781, 780, 868, 923, 803, 889, 901, 927, 958, 887, 980, 1017, 1153, 1038, 1043, 1265, 1207, 1228, 1228, 1505, 1458, 1532, 1648, 1842, 1927, 2044, 2285, 2476, 2766, 3107, 3576, 4143, 5281, 6751, 9237, 13722, 20872, 27373, 25420]
310.1B5420o048n039l167k454j552j058q03p01n03l19l55k10k37k44q0j14j23k04N
304.1B214j52j14l8N0j32p4j56k4J1N2r4j24K8o8k1N1l3r4k1M9Mj35O3j4q8j0k1L3
295.2A142m0qR4j10m5J9n8Kn2N4k2m4k6L2j0R2j5j54M3Q2j47O4j06k3N4j3N2M1q8m3
285.7G67M6K0j8j3m0o0O1m7J51j51KJ17o6q1M7k9R8m0M3j33P8J4r5J1L7K4M1j61R6
276.6G19L0K4K7n3j13N9kM4n8P4j33N8Poj5L4r3P9n4L3JL7K6L2l3M3j20R8m2r3L2j6
266.4F26K4N4mQ0j1j86J42O9q1%K3j7jrk5M1Q5o7N6r2N8Qo0J31k3n7qR6k2l2RN5o9
256.0G93Q2KMk5m8P5k1J30k9K4p8J17K6P6l9J2R4O2o5M9J57O8J16J07J54K72K36M12
247.1B763N50P37Q98m31j017q22l81l80j43k12j44p0j21n0n1M3j47L8l5j27Nl6k9k3
$$ y = [25420, 19372, 14333, 11166, 8712, 7160, 6102, 5299, 4598, 4095, 3776, 3421, 3211, 2974, 2730, 2650, 2536, 2413, 2209, 2214, 2062, 1948, 1910, 1960, 1828, 1754, 1598, 1574, 1585, 1637, 1543, 1419, 1447, 1379, 1358, 1409, 1376, 1282, 1261, 1310, 1314, 1179, 1242, 1228, 1140, 1130, 1109, 1142, 1102, 1094, 1188, 1078, 1033, 1052, 994, 996, 944, 998, 976, 932, 906, 938, 928, 1020, 1005, 851, 894, 976, 829, 893, 787, 764, 818, 805, 857, 898, 810, 767, 813, 833, 815, 802, 762, 702, 763, 716, 867, 716, 718, 835, 769, 688, 735, 706, 804, 764, 807, 674, 752, 766, 671, 682, 719, 743, 784, 623, 719, 749, 773, 800, 747, 634, 693, 691, 735, 677, 751, 618, 676, 683, 677, 662, 696, 603, 682, 628, 661, 662, 699, 725, 757, 724, 767, 647, 745, 703, 610, 642, 626, 650, 704, 700, 780, 769, 583, 725, 794, 713, 713, 736, 719, 718, 709, 684, 725, 810, 743, 799, 707, 765, 773, 713, 844, 821, 764, 756, 852, 830, 798, 807, 862, 793, 875, 877, 881, 856, 808, 883, 862, 992, 963, 987, 909, 1026, 1052, 1128, 1089, 1101, 1195, 1257, 1192, 1241, 1398, 1466, 1582, 1689, 1843, 2115, 2351, 2763, 3313, 4050, 4948, 4517, 3500, 2678, 2297, 1917, 1774, 1562, 1418, 1348, 1227, 1177, 1126, 1169, 1022, 1060, 1025, 898, 903, 867, 838, 815]
239.6H15M8M9p4j4j01Q1p6R4p2M4p7%q5P3j08N3P5m2j2j19J31j36O0O1j20J31n7L7
230.7F59J07k01LP0n0k9J3R6j71J16j22Q7j38J09K0j35J09M4r3K8j7jJ0Lq7j1O8l4
221.8D53P1k8J4r7O4j2J03J7q6l8R9K6m3L6O4p7n0j1m0K6J5L7Kq2l0K4J7k1R6k1j06
212.0D22J1j5O8j45J9kJ3O3Qk6p4J58j57K5R9k5j12pQ2O5l0o8k7J83j76L6j7N0J0P9
202.6E10j08M1L0p6P8j25j8J82j31O6M4j52N9nm1n9O4k3Q1k9n2J5J14k0q9K3P4j60
193.7B93P5j2Q6m8lj5j3K7r4k2J43k6j05M0j0P2j10J36q0O2k0o7%M6j0OK4q2M0L9K0
183.9C92j20P2K3lJ5o4J72j43%O1q6L1P7o6J24p0J7M2p8P8r2R6k0K5m9Q0p5M2k1j9
174.4D41o0K2R7k1J9j7N5R6RLl6k5m7q0k6O3j4l1o1O3o4J85q5k8j53K38L4o5M8o3M1
$$ y = [815, 863, 912, 838, 824, 723, 804, 728, 822, 750, 794, 717, 717, 632, 705, 597, 650, 725, 683, 671, 552, 683, 547, 607, 668, 548, 679, 622, 659, 766, 565, 568, 638, 588, 559, 572, 668, 497, 613, 491, 578, 440, 549, 569, 434, 543, 587, 494, 522, 505, 504, 514, 517, 430, 419, 487, 453, 524, 496, 510, 413, 477, 465, 568, 585, 499, 461, 560, 586, 543, 579, 643, 566, 516, 505, 465, 491, 506, 543, 545, 463, 433, 457, 474, 453, 549, 528, 422, 433, 418, 486, 341, 360, 358, 371, 434, 442, 416, 342, 500, 343, 368, 467, 442, 330, 323, 405, 470, 440, 372, 345, 528, 352, 388, 371, 421, 431, 510, 402, 443, 473, 397, 475, 350, 332, 514, 383, 449, 493, 341, 400, 395, 354, 295, 359, 336, 417, 388, 336, 351, 465, 445, 356, 379, 453, 293, 368, 356, 442, 394, 391, 376, 363, 390, 296, 274, 417, 391, 286, 326, 316, 388, 278, 414, 334, 396, 376, 309, 309, 355, 345, 351, 375, 293, 333, 372, 392, 272, 344, 367, 364, 379, 315, 487, 344, 344, 405, 319, 350, 427, 361, 485, 415, 432, 474, 396, 474, 382, 478, 458, 483, 434, 514, 439, 481, 460, 441, 381, 403, 500, 479, 498, 481, 536, 632, 641, 644, 608, 583, 536, 456, 430, 493, 479, 448, 387, 450, 386, 571, 486, 458, 305, 543, 577, 512, 560, 497, 538]
164.6E38n0pj7j04J77j32j9oj9J2L1l1p0J55j73JJ01q7J51j50Q8o2M7q1jO4O1m1l1
155.4C45M9j15J05j35O5j1P3q7J04l5j10J01n0O3j00M0l8oP5p7O0o2O4n2L3j06Q7k5
146.6B55M2Qj02L1Q0L9j19kN2J5o7L4L1m0p8jQ0KQM8q4q7J02pN5r6J24j22J36nj38
136.8A94O3N7l9J7n7M8R1j00m0k2R1k3L0K1j40OP4N1j93J60q5R6q2Qk3l4P2Qq7M0K1
127.0B23m3m2J01m0nJ07j40J18o2nj5Q6q5O9j2r8M8K8q7J0Q0l8k6M9R0j70R2p9O8j18
117.5A04J01J1J36j33m1n5M9J7M6r8J48j39P2M7J5j26M4L2J4Ok0J2p8N7P4l6m5QKj7
108.0B07M4r6J1K7Nq6N8L5L1o2Q1j80J67O8j76J62j42J3R2j12J24l4o5J5M7J71j58
99.5B47M9j67J10J4n6J47r8k5n9n1J09m6O0j36R9l3J2JM6n4l8P8l1n4J02n8K3J2j1
$$ y = [538, 488, 481, 464, 360, 537, 405, 386, 380, 361, 373, 404, 373, 303, 458, 285, 286, 387, 300, 451, 301, 389, 327, 374, 293, 292, 356, 417, 376, 345, 394, 279, 384, 249, 314, 303, 376, 289, 393, 358, 248, 349, 299, 362, 262, 302, 264, 258, 333, 256, 316, 254, 318, 266, 299, 193, 280, 255, 297, 305, 203, 234, 314, 353, 234, 232, 284, 299, 232, 266, 297, 257, 179, 178, 258, 260, 268, 316, 232, 145, 247, 240, 295, 199, 323, 201, 337, 332, 194, 257, 314, 275, 292, 235, 283, 374, 274, 234, 212, 303, 280, 310, 331, 191, 197, 271, 322, 129, 289, 204, 300, 218, 226, 203, 169, 241, 249, 162, 202, 223, 180, 138, 239, 199, 194, 301, 161, 279, 217, 212, 197, 283, 198, 267, 255, 157, 205, 233, 146, 156, 236, 198, 172, 221, 311, 141, 233, 154, 222, 104, 205, 216, 352, 219, 178, 123, 172, 189, 235, 137, 285, 146, 218, 265, 280, 154, 198, 230, 244, 250, 230, 242, 164, 221, 295, 259, 214, 222, 224, 207, 251, 155, 166, 193, 198, 112, 170, 205, 236, 174, 255, 75, 242, 310, 134, 296, 154, 167, 259, 147, 271, 237, 172, 187, 234, 405, 247, 296, 129, 239, 253, 197, 344, 246, 221, 162, 111, 220, 174, 234, 98, 197, 164, 176, 177, 223, 169, 131, 209, 178, 124, 226, 168, 191, 203, 192]
90.3A92L5l5L4K7n6jl6j8m1J63k5k2k8m3O4k8Kp5J41q2L4l8N7n0O3l1L8kK1p3o3J22
80.2B46l8PlO2l3j13J2k1L9J3O1JN0n6k3p%j4J4noOl2TM0M3p4J37r1J5L1K0l7Kj0j2
68.8A92m0N4j46J05N0O7r9Mp0Q9k4L9k7lj05Q7J42j25j8m7O7J1N2q4N0Pnm4R7p1Lj31
58.7G7Q4J7P2j2Lo8L1j05Q0j7l5J06j8O5j12Q7l8Pk6j10J74j02m1J11o1pM0J9n3K8
49.2A96j6J57j67R7j82J10pk2P9q3j7K9m9R0K0q1Q2M7q9K2k8K8n9L7K6o9K6J8n1P7
39.7B21J2n8K6l8J10j09P3k6l7ol0K4Q8j0lj09Q8o1J7J40j39J8m7J02l2O9j17R0Ok2
30.2B40J7q5M3L4J5p5O2k5Pj43Q5Nl1M1Oj4L3L9n5N3N7k7l8r8N4P6j71Q2K3P4j16J8
20.1A86J2M1L4P0j75N1M5j15Q2J13j31M5pL9j71J83j3m5K5N2K9p8J30j05N7K4o3J1
$$ y = [192, 227, 192, 226, 253, 197, 196, 160, 142, 101, 264, 239, 217, 189, 146, 210, 182, 184, 109, 250, 168, 202, 164, 221, 171, 234, 203, 241, 239, 260, 187, 124, 246, 208, 215, 212, 274, 241, 128, 140, 119, 158, 171, 232, 233, 283, 227, 204, 197, 197, 183, 197, 192, 186, 192, 160, 128, 168, 211, 137, 274, 183, 198, 229, 249, 212, 214, 204, 192, 152, 206, 60, 165, 215, 282, 183, 187, 117, 206, 182, 221, 194, 191, 86, 173, 315, 190, 172, 125, 192, 203, 255, 171, 221, 228, 223, 179, 276, 205, 208, 77, 161, 178, 250, 238, 241, 173, 204, 99, 179, 162, 127, 233, 215, 280, 168, 255, 217, 224, 198, 88, 262, 160, 119, 230, 169, 162, 202, 221, 168, 196, 180, 337, 170, 267, 85, 195, 188, 166, 245, 162, 145, 174, 125, 215, 235, 154, 236, 283, 194, 216, 188, 216, 157, 194, 220, 151, 177, 195, 144, 221, 233, 175, 201, 163, 273, 164, 237, 211, 174, 168, 138, 162, 250, 240, 237, 128, 216, 155, 172, 312, 173, 191, 144, 246, 214, 283, 166, 256, 262, 240, 257, 172, 215, 249, 264, 189, 251, 226, 233, 90, 175, 180, 149, 190, 196, 182, 215, 254, 199, 252, 309, 282, 244, 146, 200, 276, 105, 187, 210, 284, 168, 186, 198, 239, 273, 343, 168, 219, 264, 149, 231, 344, 213, 258, 251, 290, 119, 302, 289, 244, 269, 321, 350, 272, 402, 297, 354, 378, 315, 326]
11.2C26Q3j39j44J83J39j70M7l3N8l0qp0Q0N5j01J42j20J24k5m0rJ08l3R0j6r2O6n7
$$ y = [326, 409, 270, 126, 309, 448, 278, 325, 292, 350, 320, 312, 242, 322, 377, 276, 418, 298, 422, 397, 357, 348, 456, 423, 513, 497, 405, 471, 414]
2.4D14j5J01K1p7Q1j2n13%W23
-165.2@
##END = $$ End of the data block
