##TITLE = meso-Stilbenediamine
##JCAMP-DX = 5.00 $$ ACD/Spectrum Manager v 3.5
##DATA TYPE = NMR SPECTRUM
##DATA CLASS = XYDATA
##ORIGIN = Dept of Chemistry, UWI, Mona, JAMAICA
##OWNER = Dr Paul Reese / Dr Robert Lancashire
##SPECTROMETER/DATA SYSTEM = BRUKER ASPECT 3000
##.OBSERVE FREQUENCY = 200.126
##.OBSERVE NUCLEUS = ^1H
##.ACQUISITION MODE = SEQUENTIAL
##$URL= http://wwwchem.uwimona.edu.jm:1104/ectoc
##NPOINTS = 8192
##FIRSTX = 2436.134033
##LASTX = -154.297119
##MAXX = 2436.134033
##MINX = -154.297119
##MAXY = 414.067535
##MINY = -8.025364
##XFACTOR = 1.000000
##YFACTOR = 0.012940
##FIRSTY = -6.144043
##DELTAX = -0.316253
##XUNITS = HZ
##YUNITS = ARBITRARY UNITS
##XYDATA = (X++(Y..Y))
2436.1d75n4K4j5jTL6l0j8j6P3n4J2qK9l7M0j7j3L1jn3J9L0k6K0k7L1j8l3pK3OnPj1
$$ -475 -529 -505 -520 -521 -522 -486 -516 -534 -550 -477 -531 -519 -527 -498 -535 -495 -512 -525 -494 -495 -548 -529 -499 -525 -505 -532 -501 -519 -552 -559 -536 -530 -535 -528 -539
2425.1e39q1K2N8L4l5pQK2oJ8l4J2j7L0n7K4J8qNJ1k5lL3nomj4MqLK2LL3l2m2M6K5
$$ -539 -620 -598 -540 -506 -541 -548 -540 -518 -524 -506 -540 -528 -545 -515 -572 -548 -530 -538 -533 -522 -547 -550 -517 -522 -528 -532 -546 -542 -550 -547 -525 -522 -489 -521 -563 -517 -492
2413.4d92m3QN2r1N6Ml0RJ0K4j3J4J8o4m1J04n9L0l9K7j4oLj9j4O1jQk5k8L1Jk1K7
$$ -492 -535 -527 -475 -566 -510 -506 -536 -527 -517 -493 -506 -492 -474 -538 -579 -475 -534 -504 -543 -516 -530 -536 -533 -552 -566 -505 -506 -498 -523 -551 -520 -519 -540 -513
2402.6e13J1pl3L3Ol3K0m0K1QJ8J5m4J6N2j6j0JTm4J6k5L3J3K1nm7pTK5k1K8k5K4j2
$$ -513 -502 -509 -542 -509 -503 -536 -516 -556 -535 -527 -509 -494 -538 -522 -470 -486 -496 -495 -494 -538 -522 -547 -514 -501 -480 -485 -532 -539 -546 -521 -542 -514 -539 -515 -527
2391.6e27L3J8l4TL0k6M3j6J1k1J4j9J6PpK2n4O5K2n7R3l3L7o5L9K7j8K6L8l3J5qO0
$$ -527 -494 -476 -510 -544 -514 -540 -497 -513 -502 -523 -509 -528 -512 -505 -512 -490 -544 -479 -457 -514 -421 -454 -417 -482 -443 -416 -434 -408 -370 -403 -388 -396 -336
2381.1c36l1j3k2N4n9M3q1JP1k9l2Ol8O9k2Jo3L8j4m1J9J3L4l0Jj5j1M7Mm2K3l4M5
$$ -336 -367 -380 -402 -348 -407 -364 -445 -444 -373 -402 -434 -428 -466 -397 -419 -418 -481 -443 -457 -498 -479 -466 -432 -462 -461 -476 -487 -440 -436 -478 -455 -489 -444
2370.7d44k4j2L3K2m4J7L4p0J2m0K1l0J3n1J0L5j2pj3Qj1j4m7N9L2j3J9O7n1n3N0K8
$$ -444 -468 -480 -447 -425 -469 -452 -418 -488 -476 -516 -495 -525 -512 -563 -553 -518 -530 -537 -550 -542 -553 -567 -614 -555 -523 -536 -517 -450 -501 -554 -504 -476
2360.6d76o5Q2q6L0j3rjL5Ml9RJ9l2K1J7jl2J0M5m5k1mj1J7M2p8R4l4%l4L8K7n7O8
$$ -476 -541 -459 -545 -515 -528 -537 -538 -503 -499 -538 -529 -510 -542 -521 -504 -505 -537 -527 -482 -527 -548 -552 -563 -546 -504 -582 -488 -522 -522 -556 -518 -491 -548 -480
2349.8d80m0M0J0mN4o1J8l1pJ4nK8j0J5j5J7m2K5j1j8M0K0n2M3l7N0on9O6o3O0m9M5
$$ -480 -520 -480 -470 -474 -420 -481 -463 -494 -501 -487 -492 -464 -474 -459 -474 -457 -499 -474 -485 -503 -463 -443 -495 -452 -489 -439 -445 -504 -438 -501 -441 -490 -445
2339.4d45m2M7o0J4L1m8kM0m0k1jM2nL6j8j2J3l9Q7o8KL2rj9N1l6k8J2npK6K5j9Nk
$$ -445 -487 -440 -500 -486 -455 -503 -505 -465 -505 -526 -527 -485 -490 -454 -472 -484 -471 -510 -423 -491 -489 -457 -466 -485 -434 -470 -498 -486 -491 -498 -472 -447 -466 -461 -463
2328.3d63l5K4kk5M4j7l4JLoM5k6Kj4K8J4k8rk0M9k3m2K0O0k3l4J2jJ9J1K2k6M1Jj2
$$ -463 -498 -474 -476 -501 -457 -474 -508 -507 -504 -510 -465 -491 -489 -503 -475 -461 -489 -498 -518 -469 -492 -534 -514 -454 -477 -511 -499 -500 -481 -470 -448 -474 -433 -432 -444
2317.3d44K6l4ojj3J5K5l8L0nl1K6K2On5Rk6L7K3l2L0l4nKl8j0J8jm0N5n8K8M1k9N2
$$ -444 -418 -452 -458 -459 -472 -457 -432 -470 -440 -445 -476 -450 -428 -422 -477 -468 -494 -457 -434 -466 -436 -470 -475 -473 -511 -521 -503 -504 -544 -489 -547 -519 -478 -507 -455
2306.2d55p9L2j6L8j3J0N7m1rJ6J4K0Jl3J7j2JJ3m7L8m7L5J4j9K3k8qK1k1j8K0M0q3
$$ -455 -534 -502 -518 -480 -493 -483 -426 -467 -476 -460 -446 -426 -425 -458 -441 -453 -452 -439 -486 -448 -495 -460 -446 -465 -442 -470 -478 -457 -478 -496 -476 -436 -519
2295.8e19j0N9m7J6j0J5MJ3l7M9J6o5M3PKK8o2NO0NJ8j9rPm4J9Ok3L0n0%J9pl4K0L6
$$ -519 -529 -470 -517 -501 -511 -496 -492 -479 -516 -467 -451 -516 -473 -466 -464 -436 -498 -493 -433 -428 -410 -429 -438 -431 -475 -456 -450 -473 -443 -493 -493 -474 -481 -515 -495 -459
2284.4d59om9ML1j2%oPk8P2l8K7k2N8j8n8O9l6L1k2QNn2K5O7o0K4l5M7j5j9K1K9m3
$$ -459 -465 -514 -510 -479 -491 -491 -497 -490 -518 -446 -484 -457 -479 -421 -439 -497 -428 -464 -433 -455 -447 -442 -494 -469 -402 -462 -438 -473 -426 -441 -460 -439 -410 -453
2273.6d53k5K5o1nQ3j2l6pol0N8rJ8K0Om1M1j0%m0L9l3N0K3q9N4j9LK0l5jM5jJJ2l8
$$ -453 -478 -453 -514 -519 -436 -448 -484 -491 -497 -527 -469 -478 -460 -440 -434 -475 -434 -444 -444 -484 -445 -478 -428 -405 -494 -440 -459 -456 -436 -471 -472 -427 -428 -427 -415 -453
2262.2d53jN2k8qK2Ol3L5Rl1J6k0M2k5L9l7j7K9Pk7%k0K3l4K0j3J4k0L3l0L9j5K0K
$$ -453 -454 -402 -430 -438 -416 -410 -443 -408 -399 -430 -414 -434 -392 -417 -378 -415 -432 -403 -396 -423 -423 -443 -420 -454 -434 -447 -433 -453 -420 -450 -411 -426 -406 -404
2251.5d04k7L1J6j1k3k2M4n3KO0n3K9j0l8J9j4J1K2l3Q8p0m9N6j7j3lpL3j1K5j4NL5
$$ -404 -431 -400 -384 -395 -418 -440 -396 -449 -447 -387 -440 -411 -421 -459 -440 -454 -443 -421 -454 -366 -436 -485 -429 -446 -459 -462 -469 -436 -447 -422 -436 -431 -396
2241.1c96k1J4N0k2J4m1J4N0l1K5m9L1n3k7o0RL4k6j0N0j7l0K1k0K9K3Rk2N2L0j9K0
$$ -396 -417 -403 -353 -375 -361 -402 -388 -338 -369 -344 -393 -362 -415 -442 -502 -493 -459 -485 -495 -445 -462 -492 -471 -491 -462 -439 -430 -452 -400 -370 -389 -369
2230.9c69L6pMj2Rm3O8l7j2pj5rKJ6LJ9m3J8N5o0N4l2K1JP4j11P4l2J0J9n9K6kL5o1
$$ -369 -333 -340 -336 -348 -339 -382 -314 -351 -363 -370 -385 -394 -392 -376 -373 -354 -397 -379 -324 -384 -330 -362 -341 -340 -266 -377 -303 -335 -325 -306 -365 -339 -341 -306 -367
2219.9c67K9k7JjOKlpJ7JM5o2K7N8lK8RJ4nj3K7K1l7m7k1K6J8n7N6o3OPLoPj7N0L8
$$ -367 -338 -365 -364 -365 -359 -357 -360 -367 -350 -349 -304 -366 -339 -281 -284 -256 -247 -233 -238 -251 -224 -203 -240 -287 -308 -282 -264 -321 -265 -328 -322 -315 -312 -318 -311 -328 -278 -240
2207.9b40qq6J01rK3Pl4L7l0KONqj1j7Jl1j5kk4j1k9L9n2K4l5%k4j2m8L1k0K6j1j4
$$ -240 -248 -334 -233 -242 -219 -212 -246 -209 -239 -237 -231 -226 -234 -245 -262 -261 -292 -307 -309 -333 -344 -373 -334 -386 -362 -397 -397 -421 -433 -481 -450 -470 -444 -455 -469
2196.8d69RJ2k3J0j2J3PJ4jKl6L2k2MK4K5J3rm0K3K6kk2L0k1%qoLj8l1N0l9N6L5k6
$$ -469 -460 -448 -471 -461 -473 -460 -453 -439 -440 -438 -474 -442 -464 -460 -436 -411 -398 -407 -447 -424 -398 -400 -422 -392 -413 -413 -421 -427 -424 -442 -473 -423 -462 -406 -371 -397
2185.4c97n0JL2L0m5mL3l4J3J9k7M9k2m3K6n4J08q4N6%l7O5l8Qk6P0j4j1K6K1Pp2M9
$$ -397 -447 -446 -414 -384 -429 -433 -400 -434 -421 -402 -429 -380 -402 -445 -419 -473 -365 -449 -393 -393 -430 -365 -403 -395 -421 -351 -365 -376 -350 -329 -322 -394 -345
2175.0c45l5M7l5J3o9j5N2qk0L4L3n6OJ6j6L6j1l3K9k9J9M3k3k2L3m0j7K5m1N1%qj4
$$ -345 -380 -333 -368 -355 -424 -439 -387 -395 -415 -381 -348 -404 -398 -382 -398 -362 -373 -406 -377 -406 -387 -344 -367 -389 -356 -396 -413 -388 -429 -378 -378 -386 -400
2164.6d00j4M8l1l9K4pM5nl7J9J5l4L7k5J9L5K8K2oj6mrpjo2nJ6MK4O3K9l1J0L7k0
$$ -400 -414 -366 -397 -436 -412 -419 -374 -379 -416 -397 -382 -416 -379 -404 -385 -350 -322 -300 -306 -322 -326 -335 -342 -343 -405 -410 -394 -390 -366 -303 -274 -305 -295 -258 -278
2153.5b78L4m8mK9K4Mk7L3J9k8p5%q9n2J6J9Q0j0J03K5L1j2p2l2q1qq8O2l5J05l1Q7
$$ -278 -244 -292 -296 -267 -243 -239 -266 -233 -214 -242 -317 -317 -406 -458 -442 -423 -343 -353 -250 -225 -194 -206 -278 -310 -391 -399 -487 -425 -460 -355 -386 -299
2143.4b99P3l0J6jo1M9n7jm6l2K9Oj9M6L3k3j0L2k6%j1K8l4L4J1k0k2J1K9l4Q0m1r
$$ -299 -226 -256 -240 -241 -302 -253 -310 -311 -357 -389 -360 -354 -373 -327 -294 -317 -327 -295 -321 -321 -332 -304 -338 -304 -293 -313 -335 -324 -295 -329 -249 -290 -299
2132.9b99L1o3kK0m7l2K4p6J3J2l5K4R0N5mO8%rk8l1o4K1l8L4K5LpJ6j2%l0Pl4jKL7
$$ -299 -268 -331 -333 -313 -360 -392 -368 -444 -431 -419 -454 -430 -340 -285 -289 -221 -221 -230 -258 -289 -353 -332 -370 -336 -311 -308 -315 -299 -311 -311 -341 -334 -368 -369 -367 -330
2121.6c30l8J7k9J1Rk5N7oL7k6L0lK5LK8p6J6k5j8mk7L1ok4L7l6J3N1q3Q6nJN5k9N
$$ -330 -368 -351 -380 -369 -360 -385 -328 -334 -297 -323 -293 -296 -271 -268 -240 -316 -300 -325 -343 -347 -374 -343 -349 -373 -336 -372 -359 -308 -391 -305 -310 -309 -254 -283 -278
2110.5b78J5kl2J8jm9L2qJ5j1j8K0l8Q3j2n7J3J4j3j5K1j5j3nK7K9p0N3L1j9j2j9L1
$$ -278 -263 -265 -297 -279 -280 -329 -297 -305 -290 -301 -319 -299 -337 -254 -266 -323 -310 -296 -309 -324 -303 -318 -331 -336 -309 -280 -350 -297 -266 -285 -297 -316 -285
2100.1b85kMql7M7j6k0J8pn5K8L8j1M0n2L3pK7m8J06k5k8K4oj7Jk0L0qk0J8j0m2O7
$$ -285 -287 -283 -291 -328 -281 -297 -317 -299 -306 -361 -333 -295 -306 -266 -318 -285 -292 -265 -313 -207 -232 -260 -236 -242 -259 -258 -278 -248 -256 -276 -258 -268 -310 -243
2089.3b43k6K6o9M5m2M1l0n8M2J6L4j0L1J3nJ1l7M1p1M6ll8PM1l4J0K8o0L0k2l6Kj2
$$ -243 -269 -243 -312 -267 -309 -268 -298 -356 -314 -298 -264 -274 -243 -230 -235 -224 -261 -220 -291 -245 -248 -286 -279 -238 -272 -262 -234 -294 -264 -286 -322 -320 -332
2078.9c32%M4j6J5k0K3L4N0rj5k4m1K9l1qm2M1k9j5O8RmM2l1PkL6K3l7Kjm3NK6j8k4
$$ -332 -332 -288 -304 -289 -309 -286 -252 -202 -211 -226 -250 -291 -262 -293 -301 -343 -302 -331 -346 -278 -269 -273 -231 -262 -255 -257 -221 -198 -235 -233 -234 -277 -272 -246 -264 -288
2067.5b88j4rK8k3J9LkM4k0j2j4O3j8J6k1K2L7p4K6Oj9J9m3k1J5j0l9N4M7Kj9L6PK5
$$ -288 -302 -311 -283 -306 -287 -284 -286 -242 -262 -274 -288 -225 -243 -227 -248 -226 -189 -263 -237 -231 -250 -231 -274 -295 -280 -290 -329 -275 -228 -226 -245 -209 -202 -177
2056.7a77j8m1J4J5oj5K7n5J8jJ2qL6n2Lk6N6K5j4m4K2J8Rl9L4n1J3l7J8O%l1K8kM9
$$ -177 -195 -236 -222 -207 -213 -228 -201 -256 -238 -239 -227 -235 -199 -251 -248 -274 -218 -193 -207 -251 -229 -211 -202 -241 -207 -258 -245 -282 -264 -258 -258 -289 -261 -263 -214
2045.7b14n2L5k7qJ6oJ5%J8k0L4Ml3K8j1J4Kj4J4NMk5j1K4j1kk0PJ6J5j7J6M9o4J2
$$ -214 -266 -231 -258 -266 -250 -256 -241 -241 -223 -243 -209 -205 -238 -210 -221 -207 -205 -219 -205 -200 -196 -221 -232 -208 -219 -221 -241 -234 -218 -203 -220 -204 -155 -219 -207
2034.6b07J4J1j8m1L1l7L0j3LJ1j0JoJ0kj9P2l6k7J7j0k4J7K7M%Rl7J0lL2k6qJN4n8
$$ -207 -193 -182 -200 -241 -210 -247 -217 -230 -227 -216 -226 -225 -231 -221 -223 -242 -170 -206 -233 -216 -226 -250 -233 -206 -202 -202 -193 -230 -220 -223 -191 -217 -225 -224 -170 -228
2023.2b28J1K5k6L3l7PL3j1l3j9O0J4o4J6K7n4J3J1KJTj7j8J0L4n0L5j7J4J0K5j7j8
$$ -228 -217 -192 -218 -185 -222 -215 -182 -193 -226 -245 -185 -171 -235 -219 -192 -246 -233 -222 -220 -219 -218 -235 -253 -243 -209 -259 -224 -241 -227 -217 -192 -209 -227
2012.8b27m1L7%J7n2OL0j3n5Ok3N2k3m6L9k3J6Lk4L6J8mO9m6L5%K5j3OM9L0LKNl9N7
$$ -227 -268 -231 -231 -214 -266 -260 -230 -243 -298 -292 -315 -263 -286 -332 -293 -316 -300 -297 -321 -285 -267 -271 -202 -248 -213 -213 -188 -201 -195 -146 -116 -113 -111 -106 -145 -88
2001.4h8j8L8k2K0jj9J7pNL0J8mK5Nk3j9l3K7m7PL9m1OJ7o5L1k3K5kjJ4rK3l6L9p1
$$ -88 -106 -68 -90 -70 -71 -90 -73 -80 -75 -45 -27 -31 -6 -1 -24 -43 -76 -49 -96 -89 -50 -91 -85 -68 -133 -102 -125 -100 -102 -103 -89 -98 -75 -111 -72 -143
1990.0a43J7j2n5M1k5k4L5n8L1l5K7J3rJ1K5Rj3O2j0o3M6O8j0k4L6l4J2mL2q5M6j6
$$ -143 -126 -138 -193 -152 -177 -201 -166 -224 -193 -228 -201 -188 -197 -186 -161 -152 -165 -103 -113 -176 -130 -62 -72 -96 -60 -94 -82 -86 -54 -139 -93 -109
1979.9a09kKM2LJ0K1J3k9L9j7j8L1m4k6N7m1kk6oj2k6L8k6NK2m0J0l0pJk5Kj7rk9j3
$$ -109 -111 -109 -67 -64 -54 -33 -20 -49 -10 -27 -45 -14 -58 -84 -27 -68 -70 -96 -102 -114 -140 -102 -128 -123 -101 -141 -131 -161 -168 -167 -192 -190 -207 -216 -245 -258
1968.5b58K3l4j0l8N4MJ0k6J8OpKPN0JkK2JM2j9J7Ljojj6j4J3L9p4M0JM2l7j7o4P4
$$ -258 -235 -269 -279 -317 -263 -259 -249 -275 -257 -251 -258 -256 -249 -199 -198 -200 -178 -177 -135 -154 -137 -134 -135 -141 -142 -158 -172 -159 -120 -194 -154 -153 -111 -148 -165 -229 -155
1956.8a55L6k3M4m1pLj5N1m5K1mPk6oK7oL2j9POK4l6lM6m6K3j4mL2p0P1j0q5M8L7j3
$$ -155 -119 -142 -98 -139 -146 -143 -158 -107 -152 -131 -135 -128 -154 -160 -133 -139 -107 -126 -119 -113 -89 -125 -128 -82 -128 -105 -119 -123 -91 -161 -90 -100 -185 -137 -100 -113
1945.4a13j5p%rP1n4l2J1Mj3M3j8Kj2J6k4J3kqK9kk4j6L0J8j2k4L4K7J7j2j5M7K0o2
$$ -113 -128 -135 -135 -144 -73 -127 -159 -148 -144 -157 -114 -132 -130 -142 -126 -150 -137 -139 -147 -118 -120 -144 -160 -130 -112 -124 -148 -114 -87 -70 -82 -97 -50 -30 -92
1934.3i2J5L1L0l1oKPk4L3l9J8J6k5Ojl1L7m0M1j5k3J8n0k1P1Kn6J%K9l0L0l7J4J5
$$ -92 -77 -46 -16 -47 -53 -51 -44 -68 -35 -74 -56 -40 -65 -59 -60 -91 -54 -94 -53 -68 -91 -73 -123 -144 -73 -71 -127 -126 -126 -97 -127 -97 -134 -120 -105
1923.3a05l0O6l5lN3n9pR1m0M9k4K7jK6k1J2m1kN0nrl2ML1Ln1P6r6M5k6PJ9j2J1j4
$$ -105 -135 -69 -104 -107 -54 -113 -120 -29 -69 -20 -44 -17 -18 8 -13 -1 -42 -44 6 1 -8 -40 -36 -5 -2 -53 23 -73 -28 -54 -47 -28 -40 -29 -43
1912.2d3j3k2J8nK0l6JJ1oLK9n0N9L2m8kNl4LM0L1n2%K9m1Nj8K0K3m1L3kj6j7L7k9
$$ -43 -56 -78 -60 -65 -45 -81 -80 -69 -75 -72 -43 -93 -34 -2 -50 -52 -47 -81 -78 -38 -7 -59 -59 -30 -71 -66 -84 -64 -41 -82 -49 -51 -67 -84 -47 -76
1900.8g6mkJ2L4p3K2K7l0O3l9j0kNnPJ8Om9K2j1K1j6K0k4l2mL9rQM3l8J5Tl1pK1JK0
$$ -76 -80 -82 -70 -36 -109 -87 -60 -90 -27 -66 -76 -78 -73 -78 -71 -53 -47 -96 -74 -85 -64 -80 -60 -84 -116 -120 -81 -90 -82 -39 -77 -62 -47 -78 -85 -64 -63 -43
1888.8d3j4l3O3pk5M2J3k7l7M5Ll2K9%k1L6nj6k0M3K3m2J4K3jj9l2NK2J5m2J1%M6k0
$$ -43 -57 -90 -27 -34 -59 -17 -4 -31 -68 -23 -20 -52 -23 -23 -44 -8 -13 -29 -49 -6 17 -25 -11 12 11 -8 -40 -35 -13 2 -40 -29 -29 17 -3
1877.7co%k6K1K5m2J4J9K6j8l4J4L4l1j4J3j0L4k0m5R0o9J8nNJ7m9M0J6m1J8L3l2J1
$$ -3 -9 -9 -35 -14 11 -31 -17 2 28 10 -24 -10 24 -7 -21 -8 -18 16 -4 -49 41 -28 -10 -15 -10 7 -42 -2 14 -27 -9 24 -8 3
1867.0CK3m0Nk1K5mKK4m8PJ4j1K4L2m0pk8L2l4Oj1L1K9l6K5n3K1j1l6NJ7M5nj2K5l9
$$ 3 26 -14 -9 -30 -5 -9 -7 17 -31 -24 -10 -21 3 35 -5 -12 -40 -8 -42 -36 -47 -16 13 -23 2 -51 -30 -41 -77 -72 -55 -10 -15 -27 -2 -41
1855.6d1K9k6O3k5Pj7K7TKk2J4L1k5l6O1mm8O6p2L0lJ7J5m2l7N4lj8qQJ6k9K6l5K4
$$ -41 -12 -38 25 0 7 -10 17 44 46 24 38 69 44 8 69 65 17 83 11 41 38 55 70 28 -9 45 42 24 16 24 40 11 37 2 26
1844.5B6j5NK8k7J2nJJ4m8N7k3k9LJ7j5L6n9M0n5M7MK1j1OJ6n9O5j9pL0lLj3k5j5P
$$ 26 11 16 44 17 29 24 25 39 -9 48 25 -4 -1 16 1 37 -22 18 -37 10 14 35 24 30 46 -13 52 33 26 56 53 56 43 18 3 10
1833.1A0k0K5k6N8n3%L7p3L6Rk1P3j7k9l6J8M3o6L6L3l1K9j5k1K6k%J9Rl3J5Lm6M4
$$ 10 -10 15 -11 47 -6 -6 31 -42 -6 3 -18 55 38 9 -27 -9 34 -32 4 37 6 35 20 -1 25 23 23 42 51 18 33 36 -10 34
1822.4C4l7J1j8L1nJ7k5J7MK6j0mJ3M0m1l5O5J6J8n3M4k5k3M4Lj6L8m4j3nL0n2O8J5
$$ 34 -3 8 -10 21 16 33 8 25 29 55 45 41 54 94 53 18 83 99 117 64 108 83 60 104 107 91 129 85 72 67 97 45 113 128
1811.6A28%m9N3l3J3J0k4K5J5n0J1K3m4RPJ1kl6K2j0m3oM1%lk4QrlJ1k5M8n2OL1m0
$$ 128 128 79 132 99 112 122 98 123 138 88 99 122 78 87 94 105 103 67 89 79 36 30 71 71 68 44 52 43 40 51 26 74 22 28 59 19
1800.2A9J9J5j9j4Pm0O6j0Kl2J6KL6Jj7j2M1nj4K3k0L1j0l2MJ7Tm0O0m0J5rj8lpOJ5
$$ 19 38 53 34 20 27 -13 53 43 45 13 29 31 67 68 51 39 80 75 61 84 64 95 85 53 57 74 91 51 111 71 86 77 59 56 49 55 70
1788.5G0K2Lj0j4J4j2mNnj2L2k1LK7k6KJ4Ml2L6k5k2L0J0jLj2J7K4l9K7j4%NK6o7P
$$ 70 92 95 85 71 85 73 69 74 69 57 89 68 71 98 72 74 88 92 60 96 71 49 79 89 88 91 79 96 120 81 108 94 94 99 125 58 65
1776.8F5L3j4jPomj9JL0k5K6l2J6l4L3k3Rpk8K1J2kl8K9j1K5Tk3M1k4m0kP0k3O0p0
$$ 65 98 84 83 90 84 80 61 62 92 67 93 61 77 43 76 53 62 55 27 48 60 58 20 49 38 63 88 65 106 82 42 40 110 87 147 77
1765.4G7OJ3K2J1ql6L3J2Pj6l5J4plK5L6n8L3k4J9KPpRj4K9rj4M7n4k9M7PJ6k5rJL
$$ 77 83 96 118 129 121 85 118 130 137 121 86 100 93 90 115 151 93 126 102 121 123 130 123 132 118 147 138 124 171 117 88 135 142 158 133 124 125 128
1753.4A28RJ9m1nrJ6k9N7j4J6k5kK3m8M8Jj8K0loK0m8K3j0Q4p3%N7n6K7j1O1j7TnK2
$$ 128 137 156 115 110 101 117 88 145 131 147 122 120 143 95 143 144 126 146 143 137 157 109 132 122 206 133 133 190 134 161 150 211 194 177 172 194
1742.0A94j7jpQJ3K4k9%K1onj9L3J9n3K0K4Ln0nJ2pk5JrTO5k0j8J6l8J3pK1k8L2k4
$$ 194 177 176 169 177 190 214 185 185 206 200 195 176 209 228 175 195 219 222 172 167 179 172 147 148 139 130 195 175 157 173 135 148 141 162 134 166 142
1730.3A42L7j0JJ0M1j3o4K0L7N3m7OL2j8k1L3rj8K0m6L3Mk6RJ2l0K0k8PJ6n4Ml1M6
$$ 142 179 169 170 180 221 208 144 164 201 254 207 213 245 227 206 239 230 212 232 186 219 223 197 206 218 188 208 180 187 203 149 153 122 168
1719.6A68m2M5l5M4pJqK7pTJJ5j2K0K1j1k0LL2J4jlLL3n6R2l6j8J0qj2L3m5K9Rl1K9
$$ 168 126 171 136 180 173 174 166 193 186 179 180 195 183 203 224 213 193 196 228 242 241 238 241 274 218 310 274 256 266 258 246 279 234 263 272 241 270
1707.9B70l9L4k0J3k2j0K5J5n0J8ojqLj6j9J3k4J5J8l2J8j7j0J8l1J3nj0J5j0N5k4
$$ 270 231 265 245 258 236 226 251 266 216 234 228 227 219 222 206 187 200 176 191 209 177 195 178 168 186 155 168 163 153 168 158 213 189
1697.4A89Pl3K4j0K3J8o0M5m5L1qj7NJ4N6n2N0m1M3jJ3j4j3K8K3l4nk8O1j3JJ3j3%
$$ 189 196 163 187 177 200 218 158 203 158 189 181 164 169 183 239 187 237 196 239 238 251 237 224 252 275 241 236 208 269 256 257 270 257 257
1686.7B57nPM4k7Jk3qP3k3oK2l5M0PQk5j9K9KM7k9L5n2NK1k9K0qmJ4mrJ5n7MJ1j0n
$$ 257 252 259 303 276 277 254 246 319 296 290 312 277 317 324 332 307 288 317 319 366 337 372 320 325 346 317 337 329 325 339 335 326 341 284 288 299 289 284
1674.7B84J8Kk3j8L2j8N9j5k1K4j4l2L0lNKmK4j4J7%L1j3nN5l5k5M0l9K6k5j1%k3q
$$ 284 302 304 281 263 295 277 336 321 300 324 310 278 308 305 310 312 308 332 318 335 335 366 353 348 403 368 343 383 344 370 345 334 334 311 303
1663.6C03L3n9N2nk5K3k0L6o0%L4j2k5qO5k6l7K1plL9k3L1j8K0Ql2L6j2j3K4L3pRj6
$$ 303 336 277 329 324 299 322 302 338 278 278 312 300 275 267 332 306 269 290 283 280 319 296 327 309 329 337 305 341 329 316 340 373 366 375 359
1652.5C59K6q8P7l0K5OTm0K8j7QTJ3j3k4N9k7j9J1J8j0k7Ol4KL1j6KL6o6L5K0No7L1
$$ 359 385 297 374 344 369 375 381 341 369 352 360 368 381 368 344 403 376 357 368 386 376 349 355 321 323 354 338 340 376 310 345 365 370 303 334
1641.5C34N1j3k4lJ6N5p5M4k7qj6M7K5m5J4L3J2o9N8l1N2l4QJ7pQk6k3mnl3M5j1k1
$$ 334 385 372 348 345 361 416 341 385 358 350 334 381 406 361 375 408 420 351 409 378 430 396 404 421 414 422 396 373 369 364 331 376 365 344
1630.7C44jK2m6L3mL0l4N5j5L6j6K5j8j5J0kj4Oj0M0k6J0L4J9%jj0qJ6j1L1m5PM3o2
$$ 344 343 365 319 352 348 378 344 399 384 420 404 429 411 396 406 404 390 396 386 426 400 410 444 463 463 462 452 444 460 449 480 435 442 485 423
1619.6D23K3m7N6ml9J0PK7JlK2K3k4nRM9m2K5pOj6O0n7L2Mk5j6J8m7PjK1J9j6oLK1
$$ 423 446 399 455 451 412 422 429 456 457 454 476 499 475 470 479 528 486 511 504 510 494 554 497 529 533 508 492 510 463 470 469 490 509 493 487 490 511
1607.9E11J9k6N6k8O1J04J33J30P0n2p0j05o9q9Rm0mk9j3J0jm5j9N9rlpk4QN4j1lr
$$ 511 530 504 560 532 593 697 830 960 1030 978 908 803 734 645 654 614 610 581 568 578 577 532 513 572 563 560 553 529 537 591 580 577 568
1597.5E68Rj4RjJ2L3n1L8%m1OMO3j3j0jm%m1N0NM0k9ql3L0lj3m0N1n7O4j7N3n0K7j4
$$ 568 577 563 572 571 583 616 565 603 603 562 568 572 635 622 612 611 607 607 566 616 621 661 632 624 591 621 618 605 565 616 559 623 606 659 609 636 622
1585.8F22N5nRjJ4k8K4Jl3J1l1ok2j9K5J0j4jJ0K9k5J8Oj1L0moN7j7J9o6M6k2Lj2J6
$$ 622 677 672 681 680 694 666 690 691 658 669 638 632 610 591 616 626 612 611 621 650 625 643 649 638 668 664 658 715 698 717 651 697 675 678 666 682
1574.4F82J7m3LL6o1M1lLJ4J8mJ8K5o4O2J1P3l8Qj8L9JL0l7K1%L3m1mM1k8J8M2o7j7
$$ 682 699 656 659 695 634 675 672 675 689 707 703 721 746 682 744 755 828 790 798 780 819 820 850 813 834 834 867 826 822 863 835 853 895 828 811
1563.3H11k1K0L5k0K0JpJ8JJ3RK3J4K5k3MrM3m6J2jK9k4KJ0j2k9L0lo2k0L6k2j1N4
$$ 811 790 810 845 825 845 846 839 857 858 871 880 903 917 942 919 923 914 957 911 923 922 951 927 929 939 927 898 928 925 863 843 879 857 846 900
1552.3I00k3j8k0J1L9l9JlK0OQlj5J7k0N5j4M9m1K3Ql6J8rL0l5j7M8k9%oj8M0k4N8
$$ 900 877 859 839 850 889 850 851 848 868 874 882 879 864 881 861 916 902 951 910 933 941 905 923 914 944 909 892 940 911 911 905 887 927 903 961
1541.2I61P8O2L2K3m3l4Q0O2O8J2l7l2o4nk3%K7L7R9LL9O8l6l1j4oj0j3mL5J0N6K4
$$ 961 1039 1101 1133 1156 1113 1079 1159 1221 1289 1301 1264 1232 1168 1163 1140 1140 1167 1204 1303 1306 1345 1413 1377 1346 1332 1326 1316 1303 1299 1334 1344 1400 1424
1530.8A424k0K5p6m1l8l7k4K5j1m1J6Jj3lL0l7RJ6nl0K6Kj7K0K3k0M7m8L7l8J9l6L8
$$ 1424 1404 1429 1353 1312 1274 1237 1213 1238 1227 1186 1202 1203 1190 1187 1217 1180 1189 1205 1200 1170 1196 1198 1181 1201 1224 1204 1251 1203 1240 1202 1221 1185 1223
1520.3A223K5j1k6MK0J1POK6PK6Ll2J4rJ0J4LL1pk5K6kL8RnJ2RJ1j2TO4j4N2q1O0k0
$$ 1223 1248 1237 1211 1215 1235 1246 1253 1259 1285 1292 1318 1321 1289 1303 1294 1304 1318 1321 1352 1345 1320 1346 1344 1382 1391 1386 1398 1407 1418 1406 1394 1458 1444 1496 1415 1475 1455
1508.6A455J9pmKlN3L5j1L3M7loJ3k7M2L3N8jJK1RK7L3n0N4RL6N5j2P6K5ONM8J9N0
$$ 1455 1474 1467 1463 1465 1462 1515 1550 1539 1572 1619 1616 1610 1623 1596 1638 1671 1729 1728 1729 1750 1759 1786 1819 1769 1823 1832 1868 1923 1911 1987 2012 2018 2023 2071 2090 2140
1497.2B140N0KM6K9N1RR5K8L4N8R7K40L08L27J44J26K24J86k6mL92Q05Q51K91k57k52
$$ 2140 2190 2192 2238 2267 2318 2327 2422 2450 2484 2542 2639 2879 3187 3514 3658 3784 4008 4194 4168 4164 4556 5361 6212 6503 6246 5994
1489.0E994p1l04j36K21M22M90R97K105K793J357P08J233J800O40L54J420L048J795
$$ 5994 5923 5619 5483 5704 6126 6616 7613 9718 12511 13868 14576 15809 17609 18249 18603 20023 23071 24866
1483.3B4866o91o54J874K805k22l497l938j924m37p04j206L02L531L623J521R68M65
$$ 24866 24175 23521 25395 28200 27978 24481 20543 18619 18182 17478 16272 16574 20105 23728 25249 26217 26682
1477.9B6682k498m206l097k095j644q52l36m46r54r05n14j53N31K267J943M1j944q70
$$ 26682 24184 19978 16881 14786 13142 12290 11954 11508 10554 9649 9135 8982 9513 11780 13723 13764 11820 10950
1472.2A0950J99N05N88J771J381Lj626j446o16j60n81j330j222p57k54j81k69m39j43
$$ 10950 11149 11654 12242 14013 15394 15397 13771 12325 11709 11549 10968 9638 8416 7659 7405 7224 6955 6516 6373
1466.2F373J79K36k4J56M76M93m13q56p61n14m01l41j76l9M6J0J30J78M28J410L84
$$ 6373 6552 6788 6764 6920 7396 7889 7476 6620 5859 5345 4944 4603 4427 4388 4434 4444 4574 4752 5180 6590 6974
1459.6F974m40r94n76l76l30k17j27r1m7Rp2j90o6j43l1n0l3o0r4p0j12q0n5j43l2
$$ 6974 6534 5540 4964 4588 4258 4041 3914 3823 3776 3785 3713 3523 3457 3314 3283 3233 3200 3140 3046 2976 2864 2784 2729 2586 2554
1451.7B554o3l5m5k4jk7N6L8k0r1m0l8j1j9K2J0j9k8n8k9l2j1o0l2l8m0o0k5o5%j4
$$ 2554 2491 2456 2411 2387 2386 2359 2415 2453 2433 2342 2302 2264 2253 2234 2256 2266 2247 2219 2161 2132 2100 2089 2029 1997 1959 1919 1859 1834 1769 1769 1755
1441.9A755J0l7J0J6Lj0j1j9j8l2n1K1m0j0j7j0J2J6q1rMj2J3k5Rn5J4J8j2j6L2k5
$$ 1755 1765 1728 1738 1754 1757 1747 1736 1717 1699 1667 1616 1637 1597 1587 1570 1560 1572 1588 1507 1498 1502 1490 1503 1478 1487 1432 1446 1464 1452 1436 1468 1443
1431.8A443J1n5O5p4kJ2L3k1rJ7m5L9l1j5mk4Oj0N7J5l5k0J5J4k6k1QKjn0M1k2k7j6
$$ 1443 1454 1399 1464 1390 1388 1400 1433 1412 1403 1420 1375 1414 1383 1368 1364 1340 1346 1336 1393 1408 1373 1353 1368 1382 1356 1335 1343 1345 1344 1294 1335 1313 1286 1270
1421.0A270K1RJ2j1qL3nl6jM5k6L1L3L0P1j5j3m6n2qj0k5l9l7N2m9MN9k1l2K7m7P1
$$ 1270 1291 1300 1312 1301 1293 1326 1321 1285 1284 1329 1303 1334 1367 1397 1468 1453 1440 1394 1342 1334 1324 1299 1260 1223 1275 1226 1230 1289 1268 1236 1263 1216 1287
1410.6A287J3Pk0l1l6l5J7p0L8J9j4k9RqLK8j1k0N0rl6j9lK5k5rkk3L9l6k5OKM8no3
$$ 1287 1300 1307 1287 1256 1220 1185 1202 1132 1170 1189 1175 1146 1155 1147 1150 1178 1167 1147 1197 1188 1152 1133 1130 1155 1130 1121 1119 1096 1135 1099 1074 1080 1082 1130 1125 1062
1399.2A062K4l7j2Km7k4J7J0n1L8l4O1n4J3n9M0k5j5K5L3k9J3MkTOl0Lj6L1j6mk5J1
$$ 1062 1086 1049 1037 1039 992 968 985 995 944 982 948 1009 955 968 909 949 924 909 934 967 938 951 955 953 951 957 927 930 914 945 929 925 900 911
1388.4I11k4j3Lk0M6l0onj4LK0n2L2Qj7OjOj2k5J3k6j1nj1m5M2j5L6lOm9L1J0k1On
$$ 911 887 874 877 857 903 873 867 862 848 851 871 819 851 859 842 848 847 853 841 816 829 803 792 787 776 731 773 758 794 791 797 748 779 789 768 774 769
1376.7G69j0Om2K8jk9j1L8j1J2KQj1ok0L9j5rjrjL2j6On2pN7moj6L3m5j9M8n3L2ok3
$$ 769 759 765 723 751 750 721 710 748 737 749 751 759 748 742 722 761 746 737 736 727 726 758 742 748 696 689 746 742 736 720 753 708 689 737 684 716 710 687
1364.7F87J6RnK4o4L0k8N3Kj1j2J2j9J7l4k5%M3l1rJ7K0pj8J8k8j8kK1NMmJ4o7O4k8
$$ 687 703 712 707 731 667 697 669 722 724 713 701 713 694 711 677 652 652 695 664 655 672 692 685 667 685 657 639 637 658 663 667 663 677 610 674 646
1353.3F46K7J5k3j4L1lk4K5j4K2m9J0Nk7Kj8J8pNKm0L1K3m2jj0LN2j4KJnj4L7K2j5
$$ 646 673 688 665 651 682 679 655 680 666 688 639 649 654 627 629 611 629 622 627 629 589 620 643 601 600 590 593 645 631 633 634 629 615 652 674 659
1341.9F59Ql1J8K6j0Nk6l1MQl2K7m0L4p8J3pj3%jj6K2%M0n3N6k7J8L9k3J2J7NJ6k6
$$ 659 667 636 654 680 670 675 649 618 622 630 598 625 585 619 541 554 547 534 534 533 517 539 539 579 526 582 555 573 612 589 601 618 623 639 613
1330.9F13M1%j7j3Mm0L5n2J4NJ1nk9J1%J9j6N4k4J6L6j2Tk1OJ7j4Nm9K6J2l3o3L6N
$$ 613 654 654 637 624 628 588 623 571 585 590 601 596 567 578 578 597 581 635 611 627 663 651 639 618 624 641 627 632 583 609 621 588 525 561 566
1319.8E66J7jl4RM3k1J0J9K1Qj5K8K7pJ0NJ6K3p4L5l6l3L3n7K9j6l6L1k6J4J1J8JJ8
$$ 566 583 582 548 557 600 579 589 608 629 637 622 650 677 670 680 685 701 724 650 685 649 616 649 592 621 605 569 600 574 588 599 617 618 636
1309.0F36J9j5L7l1L3J4k9LL7l8L3k1j9k3Mj5j3k5L1m4l0J4k8o1K7k0k2j0j2J6RKl5
$$ 636 655 640 677 646 679 693 664 667 704 666 699 678 659 636 640 625 612 587 618 574 544 558 530 469 496 476 454 444 432 448 457 459 424
1298.6D24mMk7K5J6l4LTj0kk1K2J3K5l8J4k0J3qK8j7J3L9m4RKj9k1J1K6Pj6L8l7L2
$$ 424 420 424 397 422 438 404 407 410 400 398 377 399 412 437 399 413 393 406 398 426 409 422 461 417 426 428 409 388 399 425 432 416 454 417 449
1287.5D49j5j8K8j4M2qm8M6j2K6j3n6M2Proj1L3k5K0J8k0j7J5Qm9P4mn0j9N1l0mj2
$$ 449 434 416 444 430 472 464 416 462 450 476 463 407 449 456 447 441 430 463 438 458 476 456 439 454 462 413 487 483 433 414 465 435 431 419
1276.8D19L2J3j7k9J9lk5L5m0Q6m4Lj1K7j4k1J7K5k1K3J8mqJ2j7L2k8J2Oj1lj6NK3
$$ 419 451 464 447 418 437 434 409 444 404 490 446 449 438 465 451 430 447 472 451 474 492 488 480 492 475 507 479 491 497 486 483 467 472 495
1266.0D95J3k8L2l5J4kPnl5J9lTM0m0Km0J0NK8l8kqJm5N9m5K3RqK1p2L6mJ2K1j1m1
$$ 495 508 480 512 477 491 489 496 491 456 475 472 469 509 469 471 431 441 446 474 436 434 426 427 382 441 396 419 428 420 441 369 405 401 413 434 423 382
1254.3C82M4J5l4lNj9pO2l6k5L1j9L1jm7jL8oj6l9P0k8j2rjrM1j4J3k4lL4K2l5K9K1
$$ 382 426 441 407 404 409 390 383 445 409 384 415 396 427 426 379 378 416 410 394 355 425 397 385 376 375 366 407 393 406 382 379 413 435 400 429 450
1242.9D50oj1j8K0OK4mkk7K4j0J8k8k3J2j2Nkj3Kj8Mj3M1n8N5m6J5oK6l3K3k6O0k5
$$ 450 444 433 415 435 441 465 461 459 432 456 446 464 436 413 425 413 418 416 403 405 387 391 378 419 361 416 370 385 379 405 372 395 369 429 404
1231.9D04K%M4k7j5RojOqj8MJ7j7nk4L9K4k3J7K0%J4m3J8j9L7Lk2Lj2J1k9L6k3K9N
$$ 404 406 406 450 423 408 417 411 410 416 408 390 394 411 394 389 365 404 428 405 422 442 442 456 413 431 412 449 452 430 433 421 432 403 439 416 445 450
1220.2D50n4J6Lm8L4l3m2M2mK9j9lMM8m0j8K6okJ5N1m5K5m2%K1JK1m6J9mqL1l7O6l9
$$ 450 396 412 415 367 401 368 326 368 364 393 374 371 375 423 383 365 391 385 383 398 449 404 429 387 387 408 409 430 384 403 399 391 422 385 451 412
1208.8D12K8l5K4j6J8k5%K7m6K9j2qk6K0J0m5j4K1M8n4LJ4Lj4N7k9Kl4jN0k4k3J5K5
$$ 412 440 405 429 413 431 406 406 433 387 416 404 396 370 390 400 355 341 362 410 356 359 373 376 362 419 390 392 358 357 407 383 360 375 400
1198.0D00j9Qk4M9l4J6j7J0Qk7K2k1K2j7M3k5k8J8QLK0l8L4l8K8l7K5L0lk0QqPl2K7
$$ 400 381 389 365 414 380 396 379 389 397 370 392 371 393 376 419 394 366 384 392 395 415 377 411 373 401 364 389 419 416 396 404 396 403 371 398
1187.0C98J8K2pn8J1QM%Oj3j1J4k0O6n0J2%mJ2mK2q%j0M2j6%mqk0mK6J3j3m8N6mn0
$$ 398 416 438 431 373 384 392 396 396 402 389 378 392 372 438 388 400 400 396 408 404 426 418 418 408 450 434 434 430 422 402 398 424 437 424 376 432 428 378
1174.9C78L7l0K6m1jQM6n3L9l1QL3Mk9K8k4nP8j8rK6Jk8PJ3J2k0j4K2m7j2k2P0m9J7
$$ 378 415 385 411 370 369 377 423 370 409 378 386 419 423 394 422 398 393 471 453 444 470 471 443 450 463 475 455 441 463 416 404 382 452 403 420
1163.9D20m1L0mnM9l2l3M1kl2K1qK6J1%k3m8O6m3L8mJMl2j8K9k7J4K8n7jJ4m7J6Qp
$$ 420 379 409 405 400 449 417 384 425 423 391 412 404 430 441 441 418 370 436 393 431 427 428 432 400 382 411 384 398 426 369 368 382 335 351 359 352
1152.5C52j2J2k6O3m5OkL8l2JoL9K5j6k5K0J2k6L4qk1M6l9O4n2K5n1P2m6K2j6K0m5
$$ 352 340 352 326 389 344 350 348 386 354 355 349 388 413 397 372 392 404 378 412 404 383 429 390 454 402 427 376 448 402 424 408 428 383
1142.0C83l8K0K8J07j80J0P1q4O9m3J23n6O4m2nk6n6M2J6Nk1rK2j6L5o1%KJ9K2j5q
$$ 383 345 365 393 500 320 330 401 317 386 343 466 410 474 432 427 401 345 387 403 408 387 378 400 384 419 358 358 360 379 401 386 378
1131.9C78%JqK2j9j3O7l4LRK0m0j6J9K6j6k%J3j6M3k5%m2Q9o6Qk6N2m5K7k4nJ2kKj9
$$ 378 378 379 371 393 374 361 428 394 397 406 426 386 370 389 415 399 397 397 410 394 437 412 412 370 459 393 401 375 427 382 409 385 380 392 390 392 373
1120.2C73oRJ4l6M6n9N8pmQk3pK7m1N8K4l8j2lkL8Pk4Qk8RM5k8omk0J9J0j8M7m3k6
$$ 373 367 376 390 354 400 341 399 392 388 396 373 366 393 352 410 434 396 384 381 379 417 424 400 408 380 389 434 406 400 396 376 395 405 387 434 391 365
1108.5C65J4m1N3Nj7lj2K8%J0Tk2OJ2J3j9pK0Kj2%J2rRoj2nL9m3K6rj1K7j0k2oL0k0
$$ 365 379 338 391 396 379 376 364 392 392 402 412 390 396 408 421 402 395 415 417 405 405 417 408 417 411 399 394 433 390 416 407 396 423 413 391 385 415 395
1096.5C95qLk1N4m4M6l0%mKK0L8l6Qmql5J8K2k0Rj1J7lK2J9k0l3J9pj3J3mPrj9P0j9
$$ 395 387 390 369 423 379 425 395 395 391 393 413 451 415 423 419 411 376 394 416 396 405 394 411 408 430 449 429 396 415 408 395 408 404 411 402 383 453 434
1084.5D34j6rJ2J8nm0L5J6j0n0N7j8oL0k2Lk6l4L7J7l3l0L3Mk3L9j5M1o1L6K0m8j9
$$ 434 418 409 421 439 434 394 429 445 435 385 442 424 418 448 426 429 403 369 406 423 390 360 393 397 374 413 398 439 378 414 434 386 367
1074.0C67mL2o8K8J7nJl3RM0k8j3L8j3kO1p8N5j6Pj0J3Tk7j9J7k4K2j3L7m2PMl1j8
$$ 367 363 395 327 355 372 367 368 335 344 384 356 343 381 368 366 427 349 404 388 395 385 398 411 384 365 382 358 380 367 404 362 369 373 342 324
1063.0C24N4j3J7pJ4l7K6L3n7kN1o2N5J8m4L1k4L1JoJ6k6K9k9n2M2Rj2j0J1nJ9K4l3
$$ 324 378 365 382 375 389 352 378 411 354 352 403 341 396 414 370 401 377 408 409 403 419 393 422 393 341 383 392 380 370 381 376 395 419 386
1052.2C86k5OK8%o2P6m5rNk2K2k2Nj9J4pkK0k0J1TJ2J5rK2k6l8K6Tl6j9QKM0K5o5L9
$$ 386 361 367 395 395 333 409 364 355 360 338 360 338 343 324 338 331 329 349 329 340 351 363 378 369 391 365 327 353 379 343 324 332 334 374 399 334 373
1040.5C73k8J4K0PK3m5L5j8J2k0JnL1m5l6j6L2Ok8K4m6J6L7k8K4m4O1l6k9P5l2j7P
$$ 373 345 359 379 386 409 364 399 381 393 373 374 369 400 355 319 303 335 341 313 337 291 307 344 316 340 296 357 321 292 367 335 318 325
1030.1C25M0n3O4j6J0lK6l3%OMl4J3k0Q7m7k7J3J1j9j2J8J%M9n8J3k1K4m0K9J0k0J1
$$ 325 365 312 376 360 370 367 393 360 360 366 370 336 349 329 416 369 342 355 366 347 335 353 354 354 403 345 358 337 361 321 350 360 340 351
1019.3C51j8k7K9L8m3qLTK6mj4K0Tl8pM4rqJ0nJ0K8K2j6N5p5O6m0k7L2nmMk8jM7Qk8
$$ 351 333 306 335 373 330 322 325 328 354 350 336 356 376 338 331 375 366 358 368 363 373 401 423 407 462 387 453 413 386 418 413 409 413 385 384 431 439 411
1007.3D11L6k2kLl6M8n0P1k3k2L5n4K3J2l6OJ4NM0qPk6Rk9QJ4MpL0l1%nQ%J0nk3Q0
$$ 411 447 425 423 426 390 438 388 459 436 414 449 395 418 430 394 400 414 419 459 451 458 432 441 412 420 434 438 431 461 430 430 425 433 433 443 438 415 495
995.3D95q2J6J8Rjm1J9K3o9L8j2J6ol5J8J1LoKLL4m6M8l7Jj3M1k2J8n6N2o0K9k4kk9
$$ 495 413 429 447 456 455 414 433 456 387 425 413 429 423 388 406 417 420 414 416 419 453 407 455 418 419 406 447 425 443 387 439 379 408 384 382 353
983.9C53M0ll0l8P7l0K5kl5Pk2K9n8L6j4nKqk1Rj9M3k4K7k5K5j3%J9k6ML6k2jPJ6j1
$$ 353 393 390 360 322 399 369 394 392 357 364 342 371 313 349 335 330 332 324 303 312 293 336 312 339 314 339 326 326 345 319 323 359 337 336 343 359 348
972.2C48L5rK3%K4k4M8K3m9L7kL7K8m6kO0rJ8J4N7R5j6l7O1o0l0j5j9rl6kJq6M2k4
$$ 348 383 374 397 397 421 397 445 468 419 456 454 491 519 473 471 531 522 540 554 611 706 690 653 714 654 624 609 590 581 545 543 544 458 500 476
961.1D76j9K7k5j9j5K0L3nj5J2Kn5M5oj8j6kJ7j2K1n1K1L6n7J1LJjm0K8j0J8j0Pk3
$$ 476 457 484 459 440 425 445 478 473 458 470 472 417 462 456 438 422 420 437 425 446 395 416 452 395 406 409 410 409 369 397 387 405 395 402 379
950.1C79QK8n0K7kL5j1ML7MJ5k5l5J8J3l8J6N9k1m6M1n8N4l2N1k3mL1m5J3j1j4J4j2
$$ 379 387 415 365 392 390 425 414 418 455 459 474 449 414 432 445 407 423 482 461 415 456 398 452 420 471 448 444 475 430 443 432 418 432 420
939.3D20k4L1Lk3jpl9O3j6JJ0j3L2j2KM1jJ9j7J3k2J8J3qn7J9rj3pL1j3j0QK8k4k8
$$ 420 396 427 430 407 406 399 360 423 407 408 418 405 437 425 427 468 467 486 469 482 460 478 491 483 426 445 436 423 416 447 434 424 432 460 436 408
927.9D08N0JJ3K0l6K3m3M4Q1j02KJqK4L0l6j0M6m1L2m3rK2kk4jJ2kK3k1Lk8N0j1pL
$$ 408 458 459 472 492 456 479 436 480 561 459 461 462 454 478 508 472 462 508 467 499 456 447 469 467 443 442 454 452 475 454 457 429 479 468 461 464
916.6D64L9m6J2o4M7J6j0Tj6L0L6Lk6l8K2J9Rm4LJ0J2k2j1PJ4J6l4QL4l1j0j3J2K8
$$ 464 503 457 469 405 452 468 458 448 432 462 498 501 475 437 459 478 487 443 446 456 468 446 435 442 456 472 438 446 480 449 439 426 438 466
905.8D66L9Mj8j1TJ1j4J9J7k0L1n4k4LK9T%kpj0j2J5J4qK0J8k3Rk8j7P8l2L0rnKK5
$$ 466 505 509 491 480 469 480 466 485 502 482 513 459 435 438 467 496 496 494 487 477 465 480 494 486 506 524 501 510 482 465 543 511 541 532 527 529 554
894.1E54Kj9K3J7k9P2n9N3j7M3J4n2O0m8M5m6J2Mj2J33J71L72L56Rk40j91j72p3j34
$$ 554 556 537 560 577 548 620 561 614 597 640 654 602 662 614 659 613 625 629 617 750 921 1293 1649 1658 1418 1227 1055 982 848
884.9H48k0m8J0l0p4J0n1%l0Nj2J9J7n0J6J2j8Ql3MJj1O0m6J1L1M0l1oK4k5k9l8L9
$$ 848 828 780 790 760 686 696 645 645 615 620 608 627 644 594 610 622 604 612 579 583 584 573 633 587 598 629 669 638 632 656 631 602 564 603
874.2F03l0nNToJ4j8koOKK7J1p5L4J9qK4j2l2L1NrK4rK0m5J6nl0M0l1JJ5K5L9n8L5
$$ 603 573 568 573 578 572 586 568 566 560 566 568 595 606 531 565 584 576 600 588 556 587 592 583 607 598 618 573 589 584 554 594 563 564 579 604 643 585 620
862.2F20j9k1j9j5M6K2Lm5K9k9jj6L4k5L3k8K2k4M6m6L2Mj6Nk9J4J6mlL8n2L9omj2
$$ 620 601 580 561 546 592 614 617 572 601 572 571 555 589 564 597 569 591 567 613 567 599 603 587 592 563 577 593 589 586 624 572 611 605 601 589
851.1E89j1K3k1OL4Pl1N3l8J3J6n9K2M7l0L1n6J7K9Kl0NK7j4J7J5J6k7J5Ql1roL2r
$$ 589 578 601 580 586 620 627 596 649 611 624 640 581 603 650 620 651 595 612 641 643 613 618 645 631 648 663 679 652 667 675 644 635 629 661 652
840.0F52Q1j0J2pN1o8k0MK8k5J6J2l2N9l8L2Jj0l3M2K5l9O1J4nL8j1J7n5Jjm5m4O8
$$ 652 733 723 735 728 779 711 691 695 723 698 714 726 694 753 715 747 748 738 705 747 772 733 794 808 803 841 830 847 792 793 792 747 703 771
829.3G71N9j0J7M3N7j8K9jk3J0K5l0m2L0j4K8k7m5J3J7M8K2Q6N5J8L8J5j1jmlK7N8
$$ 771 830 820 837 880 937 919 948 947 924 934 959 929 887 917 903 931 904 859 872 889 937 959 1045 1100 1118 1156 1171 1160 1159 1155 1152 1179 1237
818.8A237K7J00Q5N0O0j7j1%N7M2J12J00J24J17J51J54K08M36J114L188P845J0621
$$ 1237 1264 1364 1449 1499 1559 1542 1531 1531 1588 1630 1742 1842 1966 2083 2234 2388 2596 3032 4146 7334 15179 25800
811.9B5800O200l109o911n025l670l508k679j500p98n11m00l42k87k16k22j49j29j05
$$ 25800 32000 28891 21980 16955 13285 9777 7098 5598 4800 4289 3889 3547 3260 3044 2822 2673 2544 2439
806.2B439j07l6j37j16r1j38p8m9n6nj7j1L4Jo4m3p6j07l8l3mm3ln4j6j9l6p0M6m3
$$ 2439 2332 2296 2159 2043 1952 1814 1736 1687 1631 1626 1609 1598 1632 1633 1569 1526 1450 1343 1305 1272 1268 1225 1222 1168 1152 1133 1097 1027 1073 1030
796.7A030L8m8K3N0L4M8J2J1n3o6o5r6n5q2O1m1L8JQ5J2Mj8K4o3pn4J5kOK7p9O3j0
$$ 1030 1068 1020 1043 1093 1127 1175 1187 1198 1145 1079 1014 918 863 781 842 801 839 840 925 937 941 923 947 884 877 823 838 836 842 869 790 853 843
786.3H43n2pk7n1pl6nJ8M9M1l2j7l7Kj8j9M3j6j9K1PJ7Jj6TJ0j3k8oO4k2J7k2j9J6
$$ 843 791 784 757 706 699 663 658 676 725 766 734 717 680 682 664 645 688 672 653 674 681 698 699 683 667 677 664 636 630 694 672 689 667 648 664
775.2F64k3K7j9M1j0k7L2l3%J5J0k3J2k9k6L4Mmj2l9KRoJ4L2qk5K3l2J3Ok9pkJk4k0
$$ 664 641 668 649 690 680 653 685 652 652 667 677 654 666 637 611 645 649 645 633 594 596 605 599 613 645 637 612 635 603 616 622 593 586 584 585 561 541
763.5E41M5j3l7N1l4j3rJ1N2o3QmTj5oL5L9k2j9kK2m4K6j8kK2kk2j2K0j2KNJ2j0K4
$$ 541 586 573 536 587 553 540 531 542 594 531 539 535 531 516 510 545 584 562 543 541 563 519 545 527 525 547 545 523 511 531 519 521 526 538 528 552
752.1E52k0M9l7k5K7ok1K6k4J8jLj3Tk5N1j6J3L8j4l6J1k7j3k1k4N8l2j1J2l3QjqL4
$$ 552 532 581 544 519 546 540 519 545 521 539 538 541 528 515 490 541 525 538 576 562 526 537 510 497 476 452 510 478 467 479 446 454 453 445 479
741.1D79J3j8Rm3J7%N6L6j4m0Pj7j2MOK0l1lj1KL1j4m4J7J2k5Kl5K8j2ORJ8j2JM2k9
$$ 479 492 474 483 440 457 457 513 549 535 495 502 485 473 477 483 503 472 469 458 460 491 477 433 450 462 437 439 404 432 420 426 435 453 441 442 484 455
729.4D55M7k0l6J2K8J8j9KJl5K5J9m5M8rlJ1j7pN0j1po7K6rl2Prk3K3Kj1pJ4Pk8K1
$$ 455 502 482 446 458 486 504 485 487 488 453 478 497 452 500 491 488 499 482 475 525 514 507 440 466 457 425 432 423 400 423 425 414 407 421 428 400 421
717.7D21J4M4lK3j0kK0l1OLJ7lk6L2k4j0j6k5K2K6n1J3J5J6OJ6k1l7J4J3J5k0J9K4
$$ 421 435 479 476 499 489 487 507 476 482 485 502 499 473 505 481 471 455 430 452 478 427 440 455 471 477 493 472 435 449 462 477 457 476 500
706.9E00J8o7Q8l8n1K9L5j2Mn8J7m%Ok4J6Tl6LkM3l6K4j3J0P0J38J64M8NK3j26p0p3
$$ 500 518 451 539 501 450 479 514 502 506 448 465 461 461 467 443 459 475 439 442 440 483 447 471 458 468 538 676 840 888 893 916 790 720 647
696.2F47q7n0L1l0kK2m0K3m6L3m7mL1J7l0Ml5J7oK5l2K6l5QK9k5k3K3K7J1m0L1jj0
$$ 647 560 510 541 511 509 531 491 514 468 501 454 450 481 498 468 472 437 454 448 473 441 467 432 440 469 444 421 444 471 482 442 473 472 462
685.4D62J6l8K0K5n7rJ9qK2Jpm9QJ6J2NRMj8K1OKk8oK8k7M9p1L5k9N5k6k2j3J3j3K3
$$ 462 478 440 460 485 428 419 438 430 452 453 446 397 405 421 433 438 447 451 433 454 460 462 434 428 456 429 478 407 442 413 468 442 420 407 420 407 430
673.7D30l4qM5nRQ%J6l2PK6m0M2l8L4Tqj8j7K7j2J9qm1J0l2K3l4rMj4j2N4l5JL8l4
$$ 430 396 388 433 428 437 445 445 461 429 436 462 422 464 426 460 494 486 468 451 478 466 485 477 436 446 414 437 403 394 398 384 372 426 391 392 430 396
662.0C96M3k9L7m6j7%JJ4J1K5l9M0j4k6k4L1mN3p7P5oj8j7M9n9j0J3M1p5Nj9K5qj7
$$ 396 439 410 447 401 384 384 385 399 410 435 396 436 422 396 372 403 399 452 375 450 444 426 409 458 399 389 402 443 368 373 354 379 371 354
651.2C54K4J8k0J9J1j9N2K2j2k1m4P6Kj6j3j4K3%qM8n1k9K5l0m1K3J2rJ4K0m3M0Lm5
$$ 354 378 396 376 395 406 387 439 461 449 428 384 460 462 446 433 419 442 442 434 482 431 402 427 397 356 379 391 382 396 416 373 413 416 371
640.5C71%L0J5j5K9l9%N0k3%JKJ7m7L1j3K2l9%L4m0N2l4k2L7j6lK2QoOm0K9RJ9j6K3
$$ 371 371 401 416 401 430 391 391 441 418 418 419 421 438 391 422 409 431 392 392 426 386 438 404 382 419 403 400 422 430 424 430 390 419 428 447 431 454
628.8D54k5Rn0oN2KTJj3L3l3j1M8k9K6K3p3L6J7j9L0l0L3k6j7L0j7K0l2L1n4J0kJ5
$$ 454 429 438 388 382 434 436 438 439 426 459 426 415 463 434 460 483 410 446 463 444 474 444 477 451 434 464 447 467 435 466 412 422 420 435
618.0D35k9K8klm4J2O0rj8j4oRk4K2qj8N9l6K0k1j0M4m1K4J8m7KoLJ8J7l8PJ1l8jO0
$$ 435 406 434 432 429 385 397 457 448 430 416 410 419 395 417 409 391 450 414 434 413 403 447 406 430 448 401 403 397 400 418 435 397 404 415 377 376 436
606.3D36ql0NK3Rk8pK0KJl3M6m4O1l3K1J3n0J6N0n3J8J0k7j8K5K2m0l4L2j8O4n1Pk9
$$ 436 428 398 403 426 435 407 400 420 422 423 390 436 392 453 420 441 454 404 420 470 417 435 445 418 400 425 447 407 373 405 387 451 400 407 378
595.3C78Pm7P5J1k0L6j1k5L9k3Njk0K1L6QrJ9L0j5J5l8JM6mJ4L9%l9%L4j1L2o0J0K0
$$ 378 385 338 413 424 404 440 429 404 443 420 425 424 404 425 461 469 460 479 509 494 509 471 472 518 514 528 567 567 528 528 562 551 583 523 533 553
583.9E53k2RJ8OnNkk9Kj1J2k0Rk4Rml0rlJ1k2PJj9MJ5j1l3M1l1J0K5o0K2L0mM5n2%
$$ 553 531 540 558 564 559 564 562 533 535 524 536 516 525 501 510 506 476 467 464 475 453 460 461 442 446 461 450 417 458 427 437 462 402 424 454 450 495 443 443
571.6D43JpMNk9LJlk7J1J6l3NJ7jMk3nK5m0N8jj7M0l6rK9L4n0J4njM6m6K0lk9MOl6
$$ 443 444 437 441 446 417 420 421 418 391 402 418 385 390 407 406 410 387 382 407 367 425 424 407 447 411 402 431 465 415 429 424 423 469 423 443 440 411 415 421 385
558.9C85jM5j0k5J6J0l7j2M8m9J4KqJ8M5k8j5L8M1l5k2L1rL4l0K6l6J1OJ9j9n1N3R
$$ 385 384 429 419 394 410 420 383 371 419 370 384 386 378 396 441 413 398 436 477 442 420 451 442 476 446 472 436 447 453 472 453 402 455 464
548.2D64J2l9QnrRNj9J7j9M5npk8N2Rl0J5nK8q%k2pN5k8J0l8L6jn2KRTj5qk3O2m3M2
$$ 464 476 437 445 440 431 440 445 426 443 424 469 464 457 429 481 490 460 475 470 498 490 490 468 461 516 488 498 460 496 495 443 445 454 463 448 440 417 479 436 478
535.5D78p1O5l7L5k3k0K3pPk4L1k7M0J3Jo5K5rMM4j9N2n6mj0J4L6j6l1N5m6K9k3j1
$$ 478 407 472 435 470 447 427 450 443 450 426 457 430 470 483 484 419 444 435 439 483 464 516 460 456 446 460 496 480 449 504 458 487 464 453
524.8D53K3l7J1j9JK9j7j0L0Ql6KL0jl3JL1j5L6m8KJ2K1J1l8%JK0J2j0j7kJ6LJ5K0
$$ 453 476 439 450 431 432 461 444 434 464 472 436 438 468 467 434 435 466 451 487 439 441 453 474 485 447 447 448 468 480 470 453 451 467 470 485 505
513.4E05pl7L4M4l9qNL5l2k8J4L6l1j1nJ8j0J5J3qk2Nk8J6LJ3k1J8j5j0k0K7o2M2J0
$$ 505 498 461 495 539 500 492 497 532 500 472 486 522 491 480 475 493 483 498 511 503 481 486 458 474 477 490 469 487 472 462 442 469 407 449 459
502.3D59J4lj7K1j1J5k7j1J7K5j2J6j2J3Mj5J1J4m7J9L9j1nn3J7L0j3l3L4K6j7rKP
$$ 459 473 470 453 474 463 478 451 440 457 482 470 486 474 487 491 476 487 501 454 473 512 501 496 443 460 490 477 444 478 504 487 478 480 487
491.6D87j0l3K7j1ORQnPk2l8J8j8K8K5k3L6k4K3K2k8L6l5j6O2n5N7k9%J4J8k3K3j3
$$ 487 477 444 471 460 466 475 483 478 485 463 425 443 425 453 478 455 491 467 490 512 484 520 485 469 531 476 533 504 504 518 536 513 536 523
480.8E23J9j3J9J8np1L3J4K1k7L9j2m3kj0J8l3L4m3RJ8k0L4n3L7o9L2kK6L1n2j6N0
$$ 523 542 529 548 566 561 490 523 537 558 531 570 558 515 513 503 521 488 522 479 488 506 486 520 467 504 435 467 465 491 522 470 454 504
470.4E04j2ljJ5Jkk2Qk5kK2L0J7n3L5m3K6k0M4j3l8J3j4M1j9k2j0P1o2ml0N6l1M4k4
$$ 504 492 489 488 503 504 502 480 488 463 461 483 513 530 477 512 469 495 475 519 506 468 481 467 508 489 467 457 528 466 462 432 488 457 501 477
459.3D77J9k7%K5Roj0j9kTPN2j8JJ2l3L6J1K3p6J1M2nK1jJ1l4N5n0K8n1K5j8J1j6K8
$$ 477 496 469 469 494 503 497 487 468 466 464 471 523 505 506 518 485 521 532 555 479 490 532 527 548 547 558 524 579 529 557 506 531 513 524 508 536
447.9E36k7L2j6LOJ7q9J05q1N2%j2l9K4mJ4k9K7OM1l8kL7J2Kj0l1O3QJ9j6opM7j5j0
$$ 536 509 541 525 528 534 551 462 567 486 538 538 526 487 511 507 521 492 519 525 566 528 526 563 575 577 567 536 599 607 626 610 604 597 644 629 619
436.5F19Ql0M0p0N2k7j0M0o4NM5k8l9K6J1m9J3N1l4JK0Kj8PlQL2j5j6lPol2M8lL2k5
$$ 619 627 597 637 567 619 592 582 622 558 563 608 580 541 567 578 529 542 593 559 560 580 582 564 571 568 576 608 593 577 574 581 575 543 591 588 620 595
424.8E95J4k4PJ9kK1l9J5J9k5N1m8N6%k9k5P2o5k3N0m1K8qk8K5k4L2j3J2joK5rTK8
$$ 595 609 585 592 611 609 630 591 606 625 600 651 603 659 659 630 605 677 612 589 639 598 626 618 590 615 591 623 610 622 621 615 640 631 622 650
413.8F50k7Qk7P1p8O4m9j9M8j4l8OnO4j2m0M1L6k8Pk7NnM1Qoj7k0lO3mk6J8QO2m3k0
$$ 650 623 631 604 675 597 661 612 593 641 627 589 595 590 654 642 602 643 679 651 658 631 636 631 672 680 674 657 637 634 697 693 667 685 693 755 712 692
402.1F92J2%RPK3k9j6mj8L9lk8M0j8M5m4KLnJkrRL9o6N2n2O4k2jlK5k7l4K6M0m6L0
$$ 692 704 704 713 720 743 714 698 694 676 715 712 684 724 706 751 707 709 712 707 708 706 697 706 745 679 731 679 743 721 720 717 742 715 681 707 747 701 731
390.0G31J0TNpL1m4L5M3j6j7Nk3N3l3K5nm4N1n4O8j2k0j9k1J2j0l8L4J8l8L0k0M7m8
$$ 731 741 751 756 749 780 736 771 814 798 781 786 763 816 783 808 803 759 810 756 824 812 792 773 752 764 754 716 750 768 730 760 740 787 739
379.3G39N1k4JNJM9Qm2K6pj3R7l5Mj0J0J1k8j1%OJ0Jj7NL1l6l3K6M5r3P2JnK3l6L2
$$ 739 790 766 767 772 773 822 830 788 814 807 794 891 856 860 850 860 871 843 832 832 838 848 849 832 837 868 832 799 825 870 777 849 850 845 868 832 864
367.6H64JMTJ3K0J5l0K6OL5j5J4l5nQ3J0m6J8k7L0m8OM1l2J5k6qJ7L4J6o2K3K7Nk7
$$ 864 865 869 873 886 906 921 891 917 923 958 943 957 922 917 1000 1010 964 982 955 985 937 943 984 952 967 941 933 950 984 1000 938 961 988 993 966
356.5I66J9j8L1k0OJ2J0j1J4l0K3lL0Pk2N8n7M0j5k3O2l7K1J4l1M6K7m4N6j7J6Rn2
$$ 966 985 967 998 978 984 996 1006 995 1009 979 1002 999 1029 1036 1014 1072 1015 1055 1040 1017 1079 1042 1063 1077 1046 1092 1119 1075 1131 1114 1130 1139 1087
346.1A087K2M6l1k3K6l4N3k7J2%j6J4Tl0K6L1n4P4o3O6oPJ1R%TK9Qlj0K5j5L7K1j5
$$ 1087 1109 1155 1124 1101 1127 1093 1146 1119 1131 1131 1115 1129 1143 1113 1139 1170 1116 1190 1127 1193 1187 1194 1205 1214 1214 1214 1243 1251 1248 1238 1263 1248 1285 1306 1291
335.0A291kJ2M5k6J3j4M2NJ6k7N0j9L0J4KM4l7K1O1k0L8j4M4jl8K9mL0j5M2J8k6L1
$$ 1291 1289 1301 1346 1320 1333 1319 1361 1366 1382 1355 1405 1386 1416 1430 1432 1476 1439 1460 1521 1501 1539 1525 1569 1568 1530 1559 1555 1585 1570 1612 1630 1604 1635
324.6A635L1m9L7L5j7N8k0L5L1nM9l7O2j7N1J3nL0N2%Q1J7J2M9M4o5P1P7j2N4PK6L0
$$ 1635 1666 1617 1654 1689 1672 1730 1710 1745 1776 1771 1820 1783 1845 1828 1879 1892 1887 1917 1969 1969 2050 2067 2079 2128 2172 2107 2178 2255 2243 2297 2304 2330 2360
314.1B360mpQ1J3l9P5K1N8R3K6P2N6Q9M4P1P8P6Q4O4Q6L3O3J25J00R6J09Q0J47J35
$$ 2360 2356 2349 2430 2443 2404 2479 2500 2558 2651 2677 2749 2805 2894 2938 3009 3087 3163 3247 3311 3397 3430 3493 3618 3718 3814 3923 4003 4150 4285
305.0D285Q1J77J91J33K14J47K65K23J99L39L04L05L21M91M01N01N21O33O71Q08Q15
$$ 4285 4366 4543 4734 4867 5081 5228 5493 5716 5915 6254 6558 6863 7184 7675 8076 8577 9098 9731 10402 11210 12025
298.3A2025R15J023J085J089J098J152R83P98N84K63n4l69n89q70r69j034j102j043
$$ 12025 12940 13963 15048 16137 17235 18387 19370 20168 20752 21015 20961 20592 20003 19133 18164 17130 16028 14985
292.6A4985j055r63q63q29p57o93n71n86n04m62m15m01l59l07l16k65k25k59j98j89
$$ 14985 13930 12967 12104 11275 10518 9825 9254 8668 8164 7702 7287 6886 6527 6220 5904 5639 5414 5155 4957 4768
286.3D768k00j32k02j27q8j72j41p8j32j05q0r9m7j19o6n4j04r4o9p7r8l1r9m1p5l5
$$ 4768 4568 4436 4234 4107 4019 3847 3706 3628 3496 3391 3311 3212 3165 3046 2980 2926 2822 2728 2659 2582 2484 2453 2354 2313 2238 2203
278.1B203o2k0l0j7n8mTm0J3q4N1q7j5l0l1Ql1q3J1o0k2k0J7l8q5K5qK1n0j0l0m6K9
$$ 2203 2141 2121 2091 2074 2016 2012 2008 1968 1981 1897 1948 1861 1846 1816 1785 1793 1762 1679 1690 1630 1608 1588 1605 1567 1482 1507 1499 1520 1470 1460 1430 1384 1413
267.6A413k0L3m5k2Nrm2Pkj0k0K2j7j3pK2OJ5m2j8O8j1l4J9N7jK8J1J63J17K55R5m3
$$ 1413 1393 1426 1381 1359 1364 1355 1313 1320 1318 1308 1288 1310 1293 1280 1273 1295 1301 1316 1274 1256 1324 1313 1279 1298 1355 1354 1382 1393 1556 1673 1928 2023 1980
257.2A980j94k01r9j02j26p0l0j5l5qm1k8l7K0Nl8K0k9j9OJ0k2m5nrK8m3J5j3k0Jm
$$ 1980 1786 1585 1486 1384 1258 1188 1158 1143 1108 1100 1059 1031 994 1014 1019 981 1001 972 953 959 969 947 902 897 888 916 873 888 875 855 856 852
247.1H52nKk2j5j6k6PoK8Jk6ll1Mm9MJ3K3j6rK7k0qj7k0J3J4k5nj9RKrK7ql3KK7k4
$$ 852 847 849 827 812 796 770 777 771 799 800 774 771 740 744 695 699 712 735 719 710 737 717 709 692 672 685 699 674 669 650 659 661 652 679 671 638 640 667 643
234.8F43nm0j2O8K1J6k6J1N6r4M8k2o3J1RPj8kMK0m2O0m7nj4K7k2mpRk7M8l9j0mNm0
$$ 643 638 598 586 654 675 691 665 676 732 638 686 664 601 612 621 628 610 608 612 632 590 650 603 598 584 611 589 585 578 587 560 608 569 559 555 560 520
223.1E20J5l4k4LL6l7N4l0j4pP8qj8N9qMj0m8nK2k7l5k8TK7K9k6P9k6j7O6j8M1m5k7
$$ 520 535 501 477 480 516 479 533 503 489 482 560 552 534 593 585 589 579 531 526 548 521 486 458 430 457 486 460 539 513 496 562 544 585 540 513
212.0E13j9Qm1Oj9Nk1rJ4K3k6k9P0l8k9M5L0k7J8j7K1m2L5rm2L0k2l4k3nL1J8j4J4
$$ 513 494 502 461 467 448 453 432 423 437 460 434 405 475 437 408 453 483 456 474 457 478 436 471 462 420 450 428 394 371 366 397 415 401 415
201.2D15nL3k3L4PJ4m6J6K5k0mQn8k5L4m0k1N9k8pj2JM5nM4l4qK0k9Kj1%J8M5k9l1
$$ 415 410 443 420 454 461 475 429 445 470 450 446 454 396 371 405 365 344 403 375 368 356 357 402 397 441 407 399 419 390 392 381 381 399 444 415 384
189.8C84M4K1l3m5Q6m9J8l7M2m8M0kk4Nm5kM6j3k0N9mK1jJ4J8m6J5q0RlJ0j1j0OTj0
$$ 384 428 449 416 371 457 408 426 389 431 383 423 421 397 402 357 355 401 388 368 427 423 444 443 457 475 429 444 364 373 370 380 369 359 365 371 361
178.5C61m2L0J1JNj0K2J1LOk9J4p0J1k3L4K1l9QJ0P9p7L6k2ok3l9K0K1k8M6n6RK9k6
$$ 361 319 349 360 361 366 356 378 389 392 398 369 383 313 324 301 335 356 317 325 335 414 337 373 351 345 322 283 303 324 296 342 286 295 324 298
167.4B98J9KK0j2ML5K9Nl3j7j1n6oK2o5L5j3K2L9k4r%M0m0%Jk9ok5L1mL1Pj7M5l2O8
$$ 298 317 319 339 327 331 366 395 400 367 350 339 283 277 299 234 269 256 278 317 293 284 284 324 284 284 285 256 250 225 256 252 283 290 273 318 286 354
155.7C54k8l9j5J3mk7l6P8p9L6j0N3j8M5n9QPl8j2K7l2M0j7O9L1J9M4o1j8pj12r3j4
$$ 354 326 287 272 285 281 254 218 296 217 253 243 296 278 323 264 272 279 241 229 256 224 264 247 316 347 366 410 349 331 324 212 119 105
145.3A05q2L9K2O5J68L7J26O3l0m0n8r2n8j1o6J7L4j2K1J0L0TL9p9K1l1J2K0K6l7M9
$$ 105 23 62 84 149 317 354 480 543 513 473 415 323 265 254 188 205 239 227 248 258 288 318 357 278 299 268 280 300 326 289 338
135.5C38l4Tk6K0o4L2o6J9N2k3K3J2Pj3Lj4J4j6k1k5NL0m8K9R5m2L5k6K3rTJ2m0l2
$$ 338 304 270 244 264 200 232 166 185 237 214 237 249 256 243 246 232 246 230 209 184 189 219 171 200 295 253 288 262 285 276 267 279 239 207
124.7B07L2K7p2PJ1Tl0K5j4J6JkM3JoL0J7o1L6l6lk0lJ9k4KK4m9J0L5j6l5k0K1l2M6
$$ 207 239 266 194 201 212 223 193 218 204 220 221 219 262 263 257 287 304 243 279 243 240 220 217 236 212 214 238 189 199 234 218 183 163 184 152 198
113.3A98lPp1J4J6K8l1j1J8nJ8J7Kl2K6nL2k7Oj8m0K5RJPk9K3J2m2L8J2j8P1n2JJ6
$$ 198 195 202 131 145 161 189 158 147 165 160 178 195 197 165 191 186 218 191 197 179 139 164 173 174 181 152 175 187 145 183 195 177 248 196 197 213
101.9B13l1N1l2J3l3lK0%jTJ5kl3J4j2L1L6q1M2ok2KK7n3N7n1K8lJk8j1N8k1J9k4N
$$ 213 182 233 201 214 181 178 198 198 197 196 211 209 176 190 178 209 245 164 206 200 178 180 207 154 211 160 188 185 186 158 147 205 184 203 179 184
90.5A84j7j6RjM8q0P7n0J3j1Kn4K4K0rJ3j3j7n3L5L2K5l7L4l2L3l4l1K6L6m1l1K3m5
$$ 184 167 151 160 159 207 127 204 154 167 156 158 104 128 148 139 152 139 122 69 104 136 161 124 158 126 159 125 94 120 156 115 84 107 62
79.8F2L6k9J2K8l5K4k0K1m8L9%pKm5Q4k1J0KK1Tk7M5j7O5o7L0J9J6K5m5J6%J6nK9m3
$$ 62 98 69 81 109 74 98 78 99 51 90 90 83 85 40 124 103 113 115 136 157 130 175 158 223 156 186 205 221 246 201 217 217 233 228 257 214
68.4B14N1Po1L3K5K1k4N3ql4m2M8N8j04l6J1rj6k7rO5o9Lm4L1J5j4TJ3K0p9N9OrKL6
$$ 214 265 272 211 244 269 290 266 319 311 277 235 283 341 237 201 212 203 187 160 151 216 147 150 106 137 152 138 124 137 157 78 137 143 134 136 172
57.0A72j0j1rJ0j1J2j3M2j5m7L6j4l3OJ5j1J7l4K8lj8J3jj8J5K2m6L4J6j2mL9m8O3
$$ 172 162 151 142 152 141 153 140 182 167 120 156 142 109 115 130 119 136 102 130 127 109 122 121 103 118 140 94 128 144 132 128 167 119 182
46.3A82p2K8Jk9L1m7N7Kk8M0k1LK1KQo5l2O8l4J7On0OK5j1Ql4L9k2J4K7JK5l0M1m3
$$ 182 110 138 139 110 141 94 151 153 125 165 144 147 168 170 178 113 81 149 115 132 138 88 94 119 108 116 82 121 99 113 140 141 166 136 177 134
34.9A34L5L8l3l4nK9%K4lm6k9K2N3o0L1k3M2%J1j9k5L0Jk4OK4JJ9j8k8m1O5j1TJ5m
$$ 134 169 207 174 140 135 164 164 188 185 139 110 132 185 125 156 133 175 175 186 167 142 172 173 149 155 179 180 199 181 153 112 177 166 155 170 166
23.5A66Jprj3qMPJRj1k5P4m1K2Om0l0N8l5nK6k2J9L5l2L2k5K%NJ8m5n2O2rPMjrpL5
$$ 166 167 160 151 138 130 134 141 142 151 140 115 189 148 170 176 136 106 164 129 124 150 128 147 182 150 182 157 159 159 164 182 137 85 147 138 145 149 148 139 132 167
10.5A67l4k1J6L7qk0L4j1K6j1J53J19R3k00n9pn9j6k4k3J5l0N5m0m5L5l5K0J7p1J5
$$ 167 133 112 128 165 157 137 171 160 186 175 328 447 540 340 281 274 215 199 175 152 167 137 192 152 107 142 107 127 144 73 88
0.7H8J5Nj08%V87
-154.2@
##END = $$ End of the data block
