##TITLE= ackee oil
##JCAMP-DX= 4.24   $$ ISAS JCAMP-DX check program V1.1/a
##DATA TYPE= INFRARED SPECTRUM
##ORIGIN= Department of Chemistry, UWI, JAMAICA
##OWNER= public domain
##DATE= 99/11/24
##TIME= 12:55:00
##SPECTROMETER/DATASYSTEM= PERKIN-ELMER 1000 FT-IR
##INSTRUMENT PARAMETERS=
##DATAPROCESSING=
##RESOLUTION=   2.000000
##DELTAX=  -1.000002    
##XUNITS= 1/CM
##YUNITS= TRANSMITTANCE
##XFACTOR=   .1342817    
##YFACTOR=   .2491260E-04
##FIRSTX=   4400.007    
##LASTX=   450.0000    
##MAXY=   .8163110    
##MINY=  -.1907340E-02
##NPOINTS=   3951
##FIRSTY=   .6825836    
##XYDATA=(X++(Y..Y))
$$ plain form
32767 27399 27378 27332 27321 27334 27331 27293 27285 27302 27312 27326 27340 27340 27296 27235 27231 27238 27215 27203 27190 27173 27180 27150 27168 27180 27127 27103 27125 27102 27065 27072 27065 27046 27038 26997 26969 26974 26942
32491 26942 26888 26872 26858 26831 26801 26773 26730 26697 26676 26607 26547 26534 26482 26444 26420 26321 26261 26280 26254 26158 26065 26031 26051 26001 25908 25864 25831 25771 25725 25774 25820
32261 25820 25805 25801 25816 25866 25952 26002 26043 26127 26212 26297 26411 26502 26566 26664 26718 26719 26758 26796 26823 26834 26853 26902 26967 27011 27028 27059 27059 27026 27028 27029 27027 27076 27090 27045
32007 27045 27060 27078 27087 27103 27100 27098 27097 27064 27067 27048 27032 27048 27051 27040 27030 26984 26923 26914 26922 26898 26825 26768 26781 26755 26692 26662 26635 26603 26549 26464 26438 26436 26373 26349 26329 26240
31739 26240 26201 26197 26193 26202 26242 26294 26343 26405 26455 26490 26525 26588 26668 26715 26787 26847 26887 26936 26948 26959 27011 27030 27001 26983 27049 27088 27056 27018 27007 27057 27065 27019 27016 27018 27015
31479 27015 27029 27041 27046 27010 26984 27007 27014 26989 26989 27041 27061 27035 27013 26994 26981 27001 27021 27013 26983 26997 27002 26977 27002 26981 26953 26993 27023 27017 26994 26955 26995 27042 27025 27032 27057
31218 27057 27047 27067 27101 27084 27058 27080 27095 27056 27048 27051 27040 27048 27032 27018 27063 27095 27079 27071 27077 27084 27079 27082 27098 27070 27059 27086 27082 27103 27142 27143 27138 27143 27132 27112 27138 27144 27142 27172
30935 27172 27185 27182 27164 27144 27139 27130 27146 27176 27190 27197 27229 27234 27231 27212 27174 27217 27259 27258 27245 27225 27247 27270 27279 27298 27278 27244 27245 27277 27327 27327 27295 27291 27291 27290 27307 27312 27311 27334 27348
$$ packed form
32767B7399k1m6j1J3ll8qJ7J0J4T%m4o1mPk3j2j3j7Pl0J8J2n3k4K2k3l7Ppj9qm1k8Nl2
32491B6942n4j6j4k7l0k8m3l3k1o9o0j3n2l8k4r9o0J9k6r6r3l4K0n0r3m4l3o0m6M9M6
32261B5820j5mJ5N0Q6N0M1Q4Q5TJ14R1O4R8N4JL9L8K7J1J9M9O5M4J7L1%l3KJkM9J4m5
32007B7045J5J8RJ6lkjl3Lj9j6J6Lj1j0m6o1rQk4p3n7J3k6o3l0k7l2n4q5k6ko3k4k0q9
31739B6240l9mTRM0N2M9O2N0L5TO3Q0M7P2O0M0M9J2J1N2J9k9j8O6L9l2l8j1N0Qm6lKl
31479B7015J4J2Nl6k6K3Pk5%N2K0k6k2j9j3K0Tql0J4Nk5K5k1k8M0L0ok3l9M0M7j7PK5
31218B7057j0K0L4j7k6K2J5l9qLj1Qj6j4M5L2j6qOPnLJ6k8j1K7mK1L9JnNj1k0K6OkL0
30935B7172J3lj8k0nrJ6L0J4PL2Nlj9l8M3M2jj3k0K2K3RJ9k0l4JL2N0%l2m%jJ7NjK3J4
$$ plain form
30645 27348 27345 27332 27346 27381 27381 27373 27387 27384 27367 27374 27381 27393 27413 27427 27441 27423 27406 27422 27405 27393 27432 27455 27440 27457 27476 27481 27482 27465 27468 27506 27517 27501 27507 27511 27502 27514 27533 27572
30362 27572 27575 27548 27520 27520 27558 27566 27560 27562 27547 27537 27556 27586 27589 27571 27570 27609 27618 27585 27621 27685 27688 27668 27655 27673 27693 27694 27702 27718 27729 27746 27735 27717 27746 27791 27798 27754 27760 27788
30079 27788 27790 27798 27817 27820 27811 27816 27841 27830 27828 27853 27841 27837 27882 27897 27884 27862 27844 27846 27863 27877 27889 27909 27913 27893 27885 27893 27910 27942 27958 27970 27983 27985 28001 28030 28030 28025 28039 28020
29796 28020 28019 28066 28072 28031 28024 28064 28105 28096 28070 28092 28118 28145 28130 28107 28136 28137 28125 28125 28129 28140 28151 28154 28140 28160 28213 28209 28205 28222 28233 28224 28210 28191 28183 28201 28232 28243 28241 28250 28260
29505 28260 28244 28258 28295 28287 28294 28320 28328 28320 28314 28315 28350 28369 28352 28361 28369 28342 28351 28386 28421 28428 28399 28361 28347 28348 28338 28355 28397 28443 28483 28490 28478 28459 28439 28420 28435 28463 28480 28496
29222 28496 28489 28469 28482 28499 28502 28537 28557 28536 28462 28431 28475 28496 28496 28488 28472 28501 28554 28612 28696 28732 28718 28669 28630 28702 28685 28585 28549 28526 28507 28520 28584 28680 28664
28976 28664 28589 28569 28568 28612 28697 28657 28631 28664 28692 28761 28734 28607 28591 28613 28627 28711 28755 28679 28675 28782 28871 28766 28638 28646 28712 28734 28732 28738 28747 28676 28636 28691
28738 28691 28726 28710 28763 28859 28907 28979 28919 28807 28774 28707 28652 28676 28704 28747 28800 28773 28761 28823 28848 28864 28912 28856 28848 28848 28777 28804 28887 28812 28714 28711 28782 28852
$$ packed form
30645B7348lj3J4L5%qJ4lj7PTJ2K0J4Tj8j7J6j7j2L9K3j5J7J9NJj7LL8J1j6OMrJ2J9L9
30362B7572Lk7k8%L8QoKj5j0J9L0Lj8jL9Rl3L6O4Lk0j3J8K0JQJ6J1J7j1j8K9M5Pm4OK8
30079B7788KQJ9LrNK5j1kK5j2mM5J5j3k2j8KJ7J4J2K0Mk0qQJ7L2J6J2J3KJ6K9%nJ4j9
29796B8020jM7Om1pM0M1rk6K2K6K7j5k3K9Jj2%MJ1TLj4K0N3mTJ7J1rj4j9qJ8L1J1kRJ0
29505B8260j6J4L7qPK6QqoJL5J9j7RQk7RL5TPk9l8j4Jj0J7M2M6M0Pj2j9k0j9J5K8J7J6
29222B8496pk0J3J7LL5K0k1p4l1M4K1%qj6K9N3N8Q4L6j4m9l9P2j7j00l6k3j9J3O4R6j6
28976B8664p5k0jM4Q5m0k6L3K8O9k7j27j6K2J4Q4M4p6mJ07Q9j05j28QO6K2kORp1m0N5
28738B8691L5j6N3R6M8P2o0j12l3o7n5K4K8M3N3k7j2O2K5J6M8n6q%p1K7Q3p5r8lP1P0
$$ plain form
28500 28852 28824 28782 28790 28837 28951 29012 28875 28804 28834 28915 28933 28815 28766 28791 28777 28734 28756 28818 28882 28929 28848 28789 28813 28890 29000 28988 28878 28815 28842
28284 28842 28899 28867 28805 28754 28753 28774 28769 28774 28772 28789 28807 28815 28857 28859 28826 28828 28867 28919 28919 28864 28834 28812 28791 28777 28777 28838 28914 28971 28927 28861 28875 28946 28940 28856 28829 28857
28016 28857 28921 28994 28940 28908 28961 28935 28892 28949 29090 29183 29172 29205 29112 29008 28998 29064 29200 29148 28990 28970 28978 28973 28987 29005 29069 29171 29248 29186 29155 29063
27792 29063 28949 28927 28929 28949 28999 29002 28965 28966 29010 29004 28940 28929 28942 28911 28869 28871 28892 28935 29050 29107 29050 29055 28985 28862 28842 28840 28827 28820 28852 28893 28835 28756 28706 28691
27539 28691 28693 28676 28666 28654 28638 28714 28776 28775 28843 28767 28598 28569 28570 28535 28521 28535 28536 28549 28540 28537 28622 28764 28763 28573 28475 28525 28628 28603 28544 28404 28290 28249
27301 28249 28214 28195 28195 28212 28219 28192 28159 28183 28258 28220 28110 28086 28095 28181 28282 28298 28253 28269 28266 28076 27959 27913 27913 27923 27887 27876 27849 27828 27814 27781 27772 27784
27063 27784 27746 27743 27811 27907 27952 27782 27648 27585 27520 27483 27478 27478 27427 27369 27364 27401 27393 27397 27448 27456 27441 27376 27327 27251 26987 26915 27138 27258 27258 27263 27287 27312 27318 27324
26809 27324 27319 27254 27206 27218 27203 27184 27177 27112 27066 27057 27048 26992 26892 26588 26267 26043 25988 26144 26345 26513 26613 26643 26676 26697 26698 26700 26689 26676 26657 26628
$$ packed form
28500B8852k8m2QM7J14O1j37p1L0Q1J8j18m9K5j4m3K2O2O4M7q1n9K4P7J10j2j10o3K7
28284B8842N7l2o2n1jK1nNkJ7J8QM2Kl3KL9N2%n5l0k2k1j4%O1P6N7m4o6J4P1oq4k7K8
28016B8857O4P3n4l2N3k6m3N7J41R3j1L3r3j04j0O6J36n2j58k0QnJ4J8O4J02P7o2l1r2
27792B9063j14k2KK0N0Ll7JM4oo4j1J3l1m2KK1M3J15N7n7Np0j23k0kj3pL2M1n8p9n0j5
27539B8691Kj7j0j2j6P6O2jO8p6j69k9Jl5j4J4JJ3rlQ5J42jj90r8N0J03k5n9j40j14m1
27301B8249l5j9%J7Pk7l3K4P5l8j10k4RQ6J01J6m5J6lj90j17m6%J0l6j1k7k1j4l3rJ2
27063B7784l8lO8R6M5j70j34o3o5l7n%n1n8nL7qMN1Qj5o5m9p6k64p2K23J20%NK4K5OT
26809B7324no5m8J2j5j9po5m6rTn6j00l04l21k24n5J56K01J68J00L0L3K1JKj1j3j9k9
$$ plain form
26586 26628 26686 26764 26774 26694 26592 26559 26508 26468 26460 26466 26459 26428 26387 26376 26374 26378 26389 26390 26343 26307 26317 26330 26336 26296 26246 26218 26200 26195 26159 26120 26114 26126 26144 26125 26082
26325 26082 26079 26087 26087 26107 26123 26125 26112 26091 26079 26049 26042 26061 26022 25997 26015 26014 26004 26014 26014 25997 25959 25938 25969 25988 25965 25941 25925 25924 25919 25922 25919 25875 25823 25827 25832 25784 25726 25699
26042 25699 25701 25670 25624 25584 25564 25547 25512 25491 25459 25401 25344 25312 25293 25268 25214 25151 25080 25048 25053 25048 25025 25001 24993 25010 25005 24981 24976 24948 24941 24975 25015 25052 25072 25099 25116
25782 25116 25130 25159 25179 25187 25212 25253 25268 25277 25314 25326 25339 25368 25375 25388 25401 25404 25408 25420 25441 25450 25453 25466 25463 25438 25429 25440 25439 25436 25443 25460 25467 25483 25485 25474 25474 25496 25511 25532 25541 25515
25484 25515 25502 25519 25518 25496 25500 25516 25516 25509 25516 25511 25508 25513 25494 25485 25497 25513 25519 25510 25513 25519 25515 25489 25494 25522 25522 25503 25514 25524 25520 25542 25549 25532 25520 25516 25525 25535 25530 25535 25546 25549 25549 25547 25549 25543 25530
25149 25530 25544 25568 25560 25568 25583 25586 25585 25587 25588 25593 25584 25594 25608 25582 25587 25602 25584 25596 25649 25662 25641 25641 25649 25654 25659 25690 25697 25678 25683 25695 25704 25693 25680 25715 25746 25756 25748 25759 25780 25793
24851 25793 25797 25785 25774 25776 25773 25782 25821 25861 25861 25866 25869 25857 25878 25905 25902 25908 25919 25918 25936 25959 25943 25959 25995 26013 26018 26017 26032 26057 26073 26051 26017 26036 26074 26081 26093 26120 26092 26103
24568 26103 26137 26134 26141 26136 26120 26143 26193 26200 26200 26211 26224 26230 26231 26234 26261 26274 26267 26290 26308 26303 26308 26317 26344 26371 26378 26383 26392 26405 26398 26385 26390 26401 26440 26464 26469 26480 26471 26481 26511 26529 26527 26534
$$ packed form
26586B6628N8P8J0q0j02l3n1m0qOpl1m1j1kMJ1Jm7l6J0J3Om0n0k8j8nl6l9oJ2J8j9m3
26325B6082lQ%K0J6Kj3k1j2l0pJ9l9k5J8jj0J0%j7l8k1L1J9k3k4j6jnLlm4n2MNm8n8k7
26042B5699Kl1m6m0k0j7l5k1l2n8n7l2j9k5n4o3p1l2Nnk3k4qJ7nk4nk8pL4M0L7K0K7J7
25782B5116J4K9K0QK5M1J5RL7J2J3K9PJ3TLMJ2K1RLJ3lk5rJ1jlPJ7PJ6Kj1%K2J5K1Rk6
25484B5515j3J7jk2MJ6%pPnlNj9rJ2J6OrLOmk6NK8%j9J1J0mK2Pj7j2mRJ0nNJ1L%kKoj3
25149B5530J4K4qQJ5LjKJNrJ0J4k6NJ5j8J2N3J3k1%QNTL1Pj9NJ2Rj1j3L5L1J0qJ1K1J3
24851B5793Mj2j1KlRL9M0%NLj2K1K7lOJ1jJ8K3j6J6L6J8NjJ5K5J6k2l4J9L8PJ2K7k8J1
24568B6103L4lPnj6K3N0P%J1J3OJLK7J3pK3J8nNRK7TPNRJ3pj3NJ1L9K4NJ1rJ0L0J8kP
$$ plain form
24255 26534 26550 26537 26532 26555 26564 26561 26579 26599 26597 26616 26651 26670 26647 26618 26650 26689 26681 26687 26707 26716 26714 26721 26714 26704 26714 26723 26739 26771 26790 26795 26781 26767 26777 26812 26839 26822 26807 26830
23972 26830 26841 26818 26804 26830 26854 26863 26857 26849 26861 26853 26850 26871 26905 26920 26899 26902 26912 26902 26907 26926 26926 26915 26929 26954 26946 26934 26952 26972 26973 26964 26975 26990 27000 26998 27002 27043 27068 27044
23689 27044 27055 27103 27115 27117 27132 27142 27140 27138 27158 27165 27154 27179 27202 27201 27205 27230 27245 27228 27239 27255 27278 27293 27277 27288 27309 27326 27328 27332 27349 27352 27354 27372 27381 27389 27405 27425 27435
23414 27435 27416 27422 27445 27444 27443 27451 27462 27464 27440 27443 27485 27495 27467 27484 27493 27476 27484 27489 27474 27478 27504 27514 27490 27471 27481 27489 27485 27496 27495 27458 27431 27432 27442 27445 27441 27435 27420 27399 27408 27399 27358
23108 27358 27368 27394 27391 27362 27333 27331 27333 27325 27343 27339 27296 27293 27302 27260 27222 27223 27219 27192 27152 27137 27127 27093 27060 27032 27005 26958 26902 26853 26811 26769 26728 26674 26627 26610 26600 26581 26540
22833 26540 26504 26496 26483 26458 26443 26452 26447 26407 26380 26365 26335 26305 26284 26253 26218 26177 26137 26090 26046 25995 25960 25911 25842 25772 25696 25619 25538 25450 25383 25312 25206 25097
22594 25097 25006 24874 24716 24568 24394 24200 24002 23800 23545 23234 22908 22567 22170 21742 21269 20729 20162 19602 19026 18424 17819
22438 17819 17235 16700 16208 15759 15405 15155 15001 14939 14956 15049 15209 15465 15772 16108 16459 16777 17049 17280 17449 17540 17557 17503 17370
$$ packed form
24255B6534J6j3nK3RlJ8K0kJ9L5J9k3k9L2L9qOK0RkPpj0J0RJ6L2J9Nj4TJ0L5K7j7j5K3
23972B6830J1k3j4K6K4RoqJ2qlK1L4J5k1LJ0j0NJ9%j1J4K5qj2J8K0JrJ1J5J0kMM1K5k4
23689B7044J1M8J2KJ5J0kTK0Pj1K5K3jMK5J5j7J1J6K3J5j6J1K1J7KMJ7LKJ8RQJ6K0J0
23414B7435j9OK3jTQJ1Kk4LM2J0k8J7Rj7QNj5MK6J0k4j9J0QmJ1jl7k7JJ0Lmoj5k1Rrm1
23108B7358J0K6lk9TkKqJ8mm3lRm2l8Jmk7m0j5j0l4l3k8k7m7n6m9m2Tm1n4m7j7j0j9m1
22833B6540l6qj3k5j5Rnm0k7j5l0Tk1l1l5m1m0m7m4n1l5m9o9p0p6p7q1q8o7p1j06j09
22594B5097r1j32j58j48j74j94j98k02k55l11l26l41l97m28m73n40n67n60n76o02o05
22438A7819n84n35m92m49l54k50j54o2J7R3J60K56L07L36L51L18K72K31J69R1J7n4j33
$$ plain form
22267 17370 17189 16957 16673 16359 16009 15607 15163 14702 14221 13684 13097 12489 11878 11247 10578 9886 9189 8458 7737 7034 6344
22110 6344 5679 5045 4468 3959 3524 3152 2835 2566 2339 2158 2030 1942 1872 1842 1857 1908 1964 1990 2018 2053 2045 2002 1905 1780 1640 1470
21917 1470 1289 1126 969 830 703 589 484 403 333 261 204 180 163 148 133 110 96 82 85 87 87 104 146 185 225 291 372 462 568 685
21693 685 813 951 1101 1266 1435 1582 1735 1918 2117 2300 2457 2632 2855 3072 3261 3465 3693 3934 4181 4442 4724 5003
21529 5003 5285 5587 5874 6132 6376 6600 6788 6938 7021 7006 6913 6770 6535 6214 5833 5427 5079 4787 4547 4417 4390 4356 4264
21358 4264 4094 3829 3485 3103 2699 2274 1878 1554 1264 1031 856 720 649 611 615 710 858 1075 1406 1856 2426 3130 3989
21187 3989 4988 6050 7126 8212 9276 10282 11174 11977 12729 13448 14116 14742 15349 15914 16475 17030 17545 18031 18505 18961
21038 18961 19374 19747 20117 20472 20775 21070 21389 21685 21936 22181 22430 22662 22892 23116 23325 23538 23715 23866 24025 24179 24330
$$ packed form
22267A7370j81k32k84l14l50m02m44m61m81n37n87o08o11o31o69o92o97p31p21p03o90
22110F344o65o34n77n09m35l72l17k69k27j81j28q8p0l0J5N1N6K6K8L5qm3r7j25j40j70
21917A470j81j63j57j39j27j14j05q1p0p2n7k4j7j5Tk3j4TLK%J7M2L9M0O6Q1R0J06J17
21693F85J28J38J50J65J69J47J53J83J99J83J57J75K23K17J89K04K28K41K47K61K82K79
21529E003K82L02K87K58K44K24J88J50Q3j5r3j43k35l21l81m06l48k92k40j30k7l4r2
21358D264j70k65l44l82m04m25l96l24k90k33j75j36p1l8MR5J48K17L31M50N70P04Q59
21187C989R99J062J076J086J064J006Q92Q03P52P19O68O26O07N65N61N55N15M86M74M56
21038A8961M13L73L70L55L03K95L19K96K51K45K49K32K30K24K09K13J77J51J59J54J51
$$ plain form
20882 24330 24490 24637 24787 24916 25047 25195 25297 25393 25523 25634 25737 25851 25949 26042 26152 26253 26342 26432 26521 26617 26713 26797 26883 26975 27056
20695 27056 27125 27210 27286 27350 27404 27452 27487 27530 27597 27656 27681 27695 27730 27761 27781 27818 27851 27876 27885 27890 27912 27932 27949 27965 27980 27975 27977 27998 28008 27990 27992 28026 28037 28029
20442 28029 28030 28021 28015 28021 28007 27981 27974 27954 27920 27892 27865 27842 27821 27790 27803 27854 27877 27885 27936 28011 28051 28081 28142 28198 28219 28233 28241 28265 28289 28299 28318 28350 28391 28431 28450
20181 28450 28462 28477 28495 28512 28499 28495 28511 28514 28494 28470 28467 28439 28399 28365 28344 28311 28265 28230 28192 28158 28121 28081 28061 28045 28029 28003 27980 27975 27981 27979 27963 27972 27979 27974 27989 28010
19913 28010 28015 28023 28050 28080 28115 28155 28183 28216 28269 28313 28348 28393 28434 28477 28508 28532 28551 28587 28622 28637 28676 28709 28724 28769 28794 28808 28826 28845 28859 28867 28880 28926 28948
19668 28948 28955 28960 28973 29002 29025 29043 29072 29103 29110 29126 29158 29186 29201 29215 29237 29254 29290 29309 29311 29332 29351 29372 29391 29406 29426 29445 29459 29480 29493 29493 29500 29520 29548 29561
19414 29561 29576 29597 29597 29620 29648 29664 29681 29709 29743 29760 29763 29762 29791 29815 29829 29848 29863 29865 29884 29916 29923 29929 29940 29952 29988 30020 30037 30052 30062 30073 30091 30114 30143 30166
19161 30166 30190 30220 30231 30237 30238 30257 30296 30308 30318 30329 30354 30370 30368 30370 30385 30389 30392 30420 30427 30426 30451 30464 30463 30463 30473 30477 30475 30470 30473 30492 30504 30511 30525 30526 30525 30534 30542 30558 30568 30556 30553
$$ packed form
20882B4330J60J47J50J29J31J48J02R6J30J11J03J14R8R3J10J01Q9R0Q9R6TQ4Q6R2Q1
20695B7056O9Q5P6O4N4M8L5M3O7N9K5J4L5L1K0L7L3K5RNK2K0J7J6J5nKK1J0j8KL4J1q
20442B8029JroOj4k6pk0l4k8k7k3k1l1J3N1K3QN1P5M0L0O1N6K1J4QK4TJ0J9L2M1M0J9
20181B8450J2J5J8J7j3mJ6Lk0k4lk8m0l4k1l3m6l5l8l4l7m0k0j6Tk6k3nOkj6RPnJ5K1
19913B8010NQK7L0L5M0K8L3N3M4L5M5M1M3L1K4J9L6L5J5L9L3J5M5K5J4J8J9J4QJ3M6K2
19668B8948PNJ3K9K3J8K9L1PJ6L2K8J5J4K2J7L6J9KK1J9K1J9J5K0J9J4K1J3%PK0K8J3
19414B9561J5K1%K3K8J6J7K8L4J7LjK9K4J4J9J5KJ9L2POJ1J2L6L2J7J5J0J1J8K3K9K3
19161C0166K4L0J1OJJ9L9J2J0J1K5J6kKJ5MLK8PjK5J3j%J0MknLJ9J2PJ4JjRQJ6J0j2l
$$ plain form
18856 30553 30584 30599 30588 30590 30619 30645 30660 30676 30680 30680 30705 30745 30746 30732 30745 30768 30777 30777 30791 30796 30805 30830 30851 30839 30833 30857 30876 30879 30903 30917 30917 30928 30945 30934 30933 30956 30969
18580 30969 30968 30969 30973 30977 30990 30994 31012 31037 31045 31048 31068 31069 31072 31090 31096 31102 31118 31123 31124 31130 31133 31131 31141 31149 31152 31154 31156 31164 31167 31169 31190 31191 31182 31193 31215 31231 31226 31216 31224 31234 31249 31249 31239 31233 31218 31222
18238 31222 31244 31252 31245 31247 31256 31269 31278 31277 31276 31268 31263 31262 31265 31277 31282 31271 31277 31293 31286 31272 31281 31287 31274 31282 31298 31304 31301 31304 31293 31281 31282 31279 31280 31280 31281 31296 31292 31273 31294 31315 31293 31287 31301 31299 31293 31296 31307
17888 31307 31303 31299 31303 31314 31317 31307 31309 31299 31289 31299 31297 31307 31325 31325 31327 31331 31344 31378 31407 31439 31494 31532 31571 31606 31644 31700 31752 31802 31876 31930 32000 32100 32169 32262 32347 32385
17620 32385 32396 32431 32453 32407 32414 32445 32453 32434 32396 32335 32267 32224 32177 32099 31965 31849 31789 31804 31925 32057 32083 32052 32043 32090 32150 32136 32102 32085 32042 32028 32020
17389 32020 32009 32019 32019 32029 32019 31976 31940 31886 31860 31870 31864 31871 31829 31778 31756 31758 31712 31671 31629 31620 31617 31633 31611 31608 31604 31586 31551 31543 31522 31513 31496 31515 31518 31510 31505 31489 31486 31470
17106 31470 31464 31470 31486 31473 31460 31469 31483 31494 31493 31497 31484 31470 31475 31472 31477 31510 31517 31522 31550 31557 31546 31546 31563 31559 31540 31546 31567 31588 31596 31595 31595 31606 31611 31606 31599 31606 31628 31631 31625 31622 31647 31663 31640 31633 31634
16771 31634 31646 31673 31662 31647 31656 31668 31671 31674 31687 31695 31691 31687 31687 31695 31704 31702 31716 31728 31723 31710 31718 31725 31728 31736 31733 31738 31750 31761 31761 31750 31744 31757 31748 31733 31751 31765 31768 31750 31741 31739 31734 31745 31756 31764
$$ packed form
18856C0553L1J5j1KK9K6J5J6M%K5M0Jj4J3K3R%J4NRK5K1j2oK4J9LK4J4%J1J7j1jK3J3
18580C0969jJMTJ3MJ8K5QLK0JLJ8OTJ6NJOLkJ0QLKTQLKK1JrJ1K2J6nj0QJ0J5%j0oj5M
18238C1222K2QpKRJ3RjTqnjLJ2Nj1OJ6pj4ROj3QJ6OlLj1j2JlJ%JJ5mj9K1Tk2oJ4koLJ1
17888C1307mTMJ1Lj0Kj0TJ0kJ0J8%KMJ3L4K9L2N5L8L9L5L8N6N2N0P4N4P0J00O9R3Q5L8
17620C2385J1L5K2m6PL1Qj9l8o1o8m3m7p8j34j16o0J5J21J32K6l1rM7O0j4l4j7m3j4q
17389C2020j1J0%J0j0m3l6n4k6J0oPm2n1k2Km6m1m2rlJ6k2lmj8l5qk1rj7J9Lqnj6lj6
17106C1470oOJ6j3TRJ4J1jMj3j4NlNL3PNK8Pj1%J7mj9OK1TQj%J1NnpPK2LolK5J6k3pJ
16771C1634J2K7j1j5RJ2LTJ3QmT%QRkJ4J2nj3QPLQlNJ2J1%j1oJ3rj5J8J4Lj8rknJ1TQ
$$ plain form
16443 31764 31761 31748 31737 31748 31760 31773 31772 31756 31755 31742 31725 31721 31736 31741 31742 31743 31753 31761 31742 31739 31751 31741 31726 31726 31736 31737 31738 31742 31733 31734 31750 31748 31739 31736 31734 31747 31756 31746 31742 31753 31764 31763 31742
16123 31742 31729 31741 31755 31769 31758 31747 31751 31744 31749 31755 31758 31763 31763 31763 31773 31777 31774 31786 31805 31813 31811 31816 31823 31838 31850 31837 31839 31853 31843 31826 31843 31865 31865 31851 31861 31873 31879 31884 31880 31880 31869 31858 31863
15803 31863 31865 31861 31872 31865 31840 31854 31867 31876 31875 31858 31842 31838 31840 31827 31824 31848 31868 31864 31855 31835 31831 31829 31827 31823 31821 31832 31819 31800 31813 31829 31824 31813 31800 31789 31783 31769 31769 31777 31787 31785 31785 31796
15490 31796 31791 31775 31758 31755 31748 31738 31746 31748 31739 31735 31737 31731 31720 31731 31734 31719 31714 31699 31690 31686 31680 31676 31655 31653 31666 31650 31627 31622 31617 31614 31620 31620 31609 31608 31612 31633 31643 31629 31625 31631 31640 31639 31619 31599 31613
15155 31613 31618 31621 31625 31610 31601 31606 31611 31628 31630 31623 31620 31624 31642 31669 31685 31705 31733 31751 31759 31748 31751 31778 31812 31831 31834 31853 31875 31870 31862 31867 31878 31892 31908 31907 31902 31908 31913 31923 31942 31957 31963 32008
14842 32008 32042 31997 31981 32006 32006 31994 31995 32009 32015 32008 32006 32015 32030 32039 32042 32039 32035 32035 32042 32063 32066 32055 32052 32069 32090 32110 32102 32080 32073 32088 32091 32077 32093 32110 32094 32093 32106 32113 32102 32087 32087
14537 32087 32105 32108 32107 32113 32102 32094 32105 32133 32179 32159 32117 32119 32121 32125 32121 32118 32125 32134 32139 32131 32130 32133 32136 32146 32155 32158 32172 32195 32230 32223 32215 32216 32243 32266 32237 32210 32206 32208 32207 32208 32232 32245 32245 32248 32229
14202 32229 32207 32204 32209 32213 32214 32221 32221 32204 32217 32259 32276 32255 32246 32236 32226 32245 32308 32302 32257 32248 32228 32216 32213 32211 32200 32196 32200 32198 32201 32205 32199 32196 32186 32175 32172 32194 32272 32322 32275 32195 32159
$$ packed form
16443C1764lj3j1J1J2J3jj6jj3j7mJ5NJTJ0Qj9lJ2j0j5%J0JTMrJJ6krlkJ3Rj0mJ1Tjk1
16123C1742j3J2J4Tj1TMpNOLN%TJ0MlJ2J9QkNPJ5J2j3KJ4j0j7J7K2%j4J0J2ONm%j1TN
15803C1863KmJ1pk5J4J3Rjj7j6mKj3lK4K0mrk0mkTmkJ1j3j9J3J6nj1j3j1oj4%QJ0k%J1
15490C1796nj6j7lpj0QKrmKoj1J1Lj5nj5rmomk1kJ3j6k3nTlO%j1jMK1J0j4mORjk0TJ4
15155C1613NLMj5rNTJ7KplMJ8K7J6K0K8J8Qj1LK7L4J9LJ9K2nqNJ1J4J6jnONJ0J9J5OM5
14842C2008L4m5j6K5%j2JJ4OpkRJ5RLlm%PK1Lj1lJ7K1K0qk2pJ5Lj4J6J7j6jJ3Pj1j5%
14537C2087J8LjOj1qJ1K8M6k0m2KTMmlPRNqjLTJ0RLJ4K3L5pqJK7K3k9k7mKjJK4J3%Lj9
14202C2229k2lNMJP%j7J3M2J7k1rj0TJ9O3om5rk0j2lkj1mMkLMolj0j1lK2P8N0m7q0l6
$$ plain form
13896 32159 32143 32106 32091 32082 32075 32075 32069 32050 32036 32032 32015 31980 31972 31970 31946 31924 31933 31944 31926 31939 32006 31974 31850 31812 31778 31744 31715 31698 31655 31610 31580 31579 31557 31534 31589 31662
13628 31662 31563 31429 31375 31386 31353 31260 31199 31141 31089 31052 31014 30980 30954 30893 30813 30754 30741 30719 30687 30578 30494 30444 30373 30289 30209 30144 30117 30046 29953 29910
13405 29910 29791 29640 29569 29487 29346 29277 29246 29107 28940 28747 28564 28399 28251 28120 27944 27698 27479 27299 27120 26805 26470 26177
13241 26177 25870 25539 25110 24769 24418 23735 22950 22240 21639 20640 19440 18396 17180 15818 14544 12978 10915 9427
13107 9427 8025 6728 5467 4204 3355 2690 2136 1790 1399 1145 1008 902 870 903 949 1042 1206 1448 1739 2122 2642
12950 2642 3190 3896 4692 5542 6703 7940 8961 9982 11084 12197 13160 14095 14947 15752 16489 17160 17724 18272 18776 19272
12801 19272 19675 19825 19985 20184 20250 20285 20412 20626 20884 21161 21523 21988 22480 22910 23359 23772 24256 24818 25464 25611 25924 26323
12638 26323 26734 26942 27108 27307 27539 27777 27994 28163 28306 28445 28644 28943 29177 29047 28940 28998 29095 29099 29120 29227 29424 29492 29387
$$ packed form
13896C2159j6l7j5rp%oj9j4mj7l5qkk4k2RJ1j8J3O7l2j24l8l4Tk9j7m3m5l0jk2k3N5P3
13628C1662r9j34n4J1l3r3o1n8n2l7l8l4k6o1q0n9j3k2l2j09q4n0p1q4q0o5k7p1r3m3
13405B9910j19j51p1q2j41o9l1j39j67j93j83j65j48j31j76k46k19j80j79l15l35k93
13241B6177l07l31m29l41l51o83p85p10o01r99j200j044j216j362j274j566k063j488
13107I427j402j297j261j263q49o65n54l46l91k54j37j06l2L3M6R3J64K42K91L83N20
12950B642N48P06P96Q50J161J237J021TJ102J113R63R35Q52Q05P37O71N64N48N04M96
12801A9272M03J50J60J99O6L5J27K14K58K77L62M65M92M30M49M13M84N62O46J47L13L99
12638B6323M11K08J66J99K32K38K17J69J43J39J99K99K34j30j07N8R7MK1J07J97O8j05
$$ plain form
12466 29387 29422 29508 29573 29659 29705 29561 29506 29486 29485 29528 29553 29407 29269 29153 29034 28933 28851 28868 29053 29399 29540 29131 29061 29131 29302 29570
12273 29570 29739 29801 29732 29749 29816 29885 29953 30016 30074 30204 30341 30524 30511 30274 30223 30237 30280 30338 30403 30480 30471 30436 30534 30715 30749 30647 30628 30656
12064 30656 30732 30877 31045 30977 30904 30902 30931 30978 31024 31082 31114 31159 31227 31223 31212 31258 31329 31371 31377 31385 31396 31431 31475 31514 31546 31546 31546 31577 31587 31611 31642 31646 31642 31660
11811 31660 31690 31717 31734 31746 31745 31757 31791 31884 32047 32068 31908 31845 31823 31848 31946 32087 32098 31974 31917 31925 31980 31957 31935 31965 32129 32520 32767 32476
11602 32476 32101 32021 32069 32046 31940 31892 31941 32003 31907 31826 31835 31957 32060 32063 32108 32129 32222 32464 32298 31950 31805 31788 31849 31989 31938 31799 31725
11401 31725 31701 31728 31756 31778 31830 31792 31712 31786 31924 31941 31718 31570 31644 31765 31596 31431 31317 31352 31342 31290 31325 31394 31506 31680 31521 31122
11208 31122 30931 30893 30829 30720 30712 30724 30634 30636 30531 30299 30176 30039 29989 29999 29927 29682 29559 29324 29017 28745 28484 28184 27893 27478 26975
11022 26975 26407 25786 25130 24017 22839 21739 19897 17139 14177 12008 10167 8914 8399 8367 8525 8680 8861 8988
$$ packed form
12466B9387L5Q6O5Q6M6j44n5k0jM3K5j46j38j16j19j01q2J7J85L46J41m09p0P0J71K68
12273B9570J69O2o9J7O7O9O8O3N8J30J37J83j3k37n1J4M3N8O5P7rl5R8J81L4j02j9K8
12064C0656P6J45J68o8p3kK9M7M6N8L2M5O8mj1M6P1M2OQJ1L5M4L9L2%TL1J0K4L1MmJ8
11811C1660L0K7J7J2jJ2L4R3J63K1j60o3k2K5R8J41J1j24n7QN5k3k2L0J64L91K47k91
11602C2476l75q0M8k3j06m8M9O2r6q1RJ22J03LM5K1R3K42j66l48j45j7O1J40n1j39p4
11401C1725k4K7K8K2N2l8q0P4J38J7k23j48P4J21j69j65j14L5j0n2L5O9J12J74j59l99
11208C1122j91l8o4j09qJ2r0Kj05k32j23j37n0J0p2k45j23k35l07k72k61l00k91m15n03
11022B6975n68o21o56j113j178j100j842k758k962k169j841j253n15l2J58J55J81J27
$$ plain form
10888 8988 9159 9353 9528 9570 9675 9850 10363 11038 11773 12526 13200 13747 14231 14634 14929 15181 15410 15620 15845 16091 16353 16636
10724 16636 16946 17303 17710 18085 18419 18824 19306 19821 20347 20904 21351 21676 21953 22116 22184 22130 21882 21600 21376 21209 20858 20638
10560 20638 20679 20891 21256 21739 22318 22896 23384 23744 23975 24068 24036 23947 23774 23551 23501 23562 23675 23844 24003 24069 24113 24139 24118 23940
10381 23940 23730 23503 23194 22831 22456 22072 21489 20864 20275 19630 18915 18125 17262 16413 15737 15433 15581 16060 16640 17173 17531
10225 17531 17771 17940 18056 18163 18242 18318 18432 18547 18677 18793 18840 18889 18935 18990 19045 19074 19089 19095 19077 19092 19125 19194 19288 19385 19474 19600 19726 19831
10016 19831 19912 19982 20071 20207 20384 20577 20771 20965 21148 21281 21380 21445 21466 21455 21422 21339 21200 21042 20877 20700 20532 20393 20273 20147 20049
9830 20049 19987 19941 19908 19871 19849 19845 19847 19832 19801 19765 19714 19650 19579 19503 19416 19320 19249 19203 19173 19150 19136 19127 19116 19104 19070 19011 18968 18942 18915 18843 18753 18656 18491
9584 18491 18277 18055 17833 17637 17464 17294 17173 17112 17074 17041 17013 17006 17025 17017 16989 16927 16847 16726 16586 16478 16401 16314 16232 16146 16049 15935 15805 15695
$$ packed form
10888H988J71J94J75M2J05J75N13O75P35P53O74N47M84M03K95K52K29K10K25K46K62K83
10724A6636L10L57M07L75L34M05M82N15N26N57M47L25K77J63O8n4k48k82k24j67l51k20
10560B0638M1K12L65M83N79N78M88L60K31R3l2q9j73k23n0O1J13J69J59O6M4K6k1j78
10381B3940k10k27l09l63l75l84n83o25n89o45p15p90q63q49o76l04J48M79N80N33L58
10225A7531K40J69J16J07P9P6J14J15J30J16M7M9M6N5TK9J5Oj8J5L3O9R4R7Q9J26TJ05
10016A9831Q1P0Q9J36J77J93J94TJ83J33R9O5K1j1l3q3j39j58j65j77j68j39j20j26r8
9830B0049o2m6l3l7k2mKj5l1l6n1o4p1p6q7r6p1m6l0k3j4rj1j2l4n9m3k6k7p2r0r7j65
9584A8491k14k22Tj96j73j70j21o1l8l3k8pJ9qk8o2q0j21j40j08p7q7q2q6r7j14j30j10
$$ plain form
9376 15695 15582 15466 15389 15317 15233 15134 15010 14836 14613 14367 14119 13894 13684 13481 13309 13205 13118 13036 12976 12944 12916 12927 12983 13033 13085 13154
9182 13154 13218 13291 13377 13467 13565 13685 13799 13911 14002 14081 14183 14237 14270 14331 14386 14381 14358 14348 14327 14282 14253 14205 14158 14104 14022 13953 13892 13783 13660
8966 13660 13526 13365 13188 13003 12804 12587 12354 12118 11895 11686 11455 11204 10984 10763 10553 10325 10083 9841 9611 9360 9118 8880
8802 8880 8618 8347 8109 7867 7637 7429 7196 6964 6774 6600 6427 6291 6173 6062 5968 5888 5839 5833 5826 5860 5925 5996 6083 6190 6323
8616 6323 6481 6639 6816 7000 7164 7323 7497 7662 7787 7919 8094 8262 8458 8735 9053 9448 9945 10529 11166 11842 12558 13311
8452 13311 14002 14651 15204 15609 15834 15896 15791 15542 15180 14744 14255 13807 13412 13062 12774 12588 12537 12562 12641 12824 13084 13355 13661
8281 13661 13960 14220 14443 14651 14774 14786 14701 14583 14461 14330 14201 14114 14055 14020 14011 14053 14147 14298 14539 14840 15154 15477 15806 16143
8102 16143 16486 16812 17142 17440 17740 18065 18372 18667 18999 19292 19551 19788 20001 20190 20365 20500 20611 20703 20758 20796 20851 20923 20977
$$ packed form
9376A5695j13j16p7p2q4r9j24j74k23k46k48k25k10k03j72j04q7q2o0l2k8J1N6N0N2O9
9182A3154O4P3Q6R0R8J20J14J12R1P9J02N4L3O1N5nk3j0k1m5k9m8m7n4q2o9o1j09j23
8966A3660j34j61j77j85j99k17k33k36k23k09k31k51k20k21k10k28k42Tk30k51k42k38
8802H880k62k71k38k42k30k08k33k32j90j74j73j36j18j11r4q0m9opL4O5P1Q7J07J33
8616F323J58TJ77J84J64J59J74J65J25J32J75J68J96K77L18L95M97N84O37O76P16P53
8452A3311O91O49N53M05K25O2j05k49l62m36m89m48l95l50k88j86n1K5P9J83K60K71L06
8281A3661K99K60K23K08J23J2q5j18j22j31j29q7n9l5rM2R4J51K41L01L14L23L29L37
8102A6143L43L26L30K98L00L25L07K95L32K93K59K37K13J89J75J35J11R2N5L8N5P2N4
$$ plain form
7931 20977 21019 21123 21256 21375 21490 21610 21750 21893 22057 22215 22373 22560 22712 22856 23032 23162 23271 23376 23437 23468 23485 23472 23438 23395
7752 23395 23325 23251 23200 23152 23107 23084 23077 23077 23106 23137 23156 23234 23341 23393 23441 23526 23613 23678 23759 23873 23964 24048 24136 24229 24326 24440 24533 24588 24663 24759 24839
7522 24839 24917 25003 25068 25132 25238 25339 25395 25451 25519 25613 25693 25766 25853 25917 25964 26027 26080 26145 26177 26188 26220 26249 26287 26329 26370 26406 26442 26493 26548 26597 26632 26650
7283 26650 26656 26668 26687 26685 26686 26665 26648 26638 26646 26660 26667 26670 26677 26712 26766 26803 26844 26913 27005 27097 27174 27260 27346 27419 27508 27607 27691 27772 27873 27947 28023 28132 28203 28276 28368
7023 28368 28494 28555 28592 28701 28816 28876 28940 29033 29144 29227 29260 29316 29396 29452 29497 29564 29603 29598 29579 29594 29611 29585 29548 29567 29581 29555 29529 29512 29509 29482 29471
6792 29471 29488 29469 29420 29394 29360 29313 29306 29316 29309 29261 29259 29325 29368 29377 29343 29307 29308 29306 29253 29191 29161 29142 29140 29172 29195 29241 29267 29257 29283 29328 29319 29300 29281 29302 29311 29287 29291
6516 29291 29294 29294 29258 29194 29223 29298 29318 29270 29273 29343 29376 29419 29439 29436 29458 29531 29582 29547 29534 29556 29573 29599 29625 29632 29648 29695 29753 29825 29880 29920 29970 30019 30075 30150 30247
6256 30247 30326 30370 30427 30443 30425 30507 30555 30582 30651 30656 30632 30648 30688 30686 30712 30767 30772 30776 30789 30791 30820 30857 30872 30903 30923 30931 31002 31020 30959 30993 31063 31092 31044 31034 31092
$$ packed form
7931B0977M2J04J33J19J15J20J40J43J64J58TJ87J52J44J76J30J09J05O1L1J7j3l4m3
7752B3395p0p4n1m8m5k3p%K9L1J9P8J07N2M8Q5Q7O5Q1J14R1Q4Q8R3R7J14R3N5P5R6Q0
7522B4839P8Q6O5O4J06J01N6TO8R4Q0P3Q7O4M7O3N3O5L2J1L2K9L8M2M1L6TN1N5M9L5J8
7283B6650OJ2J9kJk1j7j0QJ4PLPL5N4L7M1O9R2TP7Q6TP3Q9R9Q4Q1J01P4P6J09P1P3R2
7023B8368J26O1L7J09J15O0O4R3J11Q3L3N6Q0N6M5O7L9nj9J5J7k6l7J9J4k6Tj7lk7j1
6792B9471J7j9m9k6l4m7pJ0pm8kO6M3Rl4l6Jkn3o2l0j9kL2K3M6K6j0K6M5rj9TK1Rk4M
6516B9291L%l6o4K9P5K0m8LP0L3M3K0lK2P3N1l5j3K2J7K6TPJ6M7N8P2N5M0N0M9N6P5R7
6256C0247P9M4N7J6j8Q2M8K7O9Nk4J6M0kK6N5NMJ3KK9L7J5L1K0QP1J8o1L4P0K9m8j0N8
$$ plain form
5995 31092 31086 31077 31083 31091 31112 31072 31017 31026 31018 30963 30917 30913 30927 30904 30825 30794 30781 30658 30574 30542 30458 30368 30312 30221 30117 30024 29969 29887 29779 29658 29521 29400
5757 29400 29330 29234 29129 29033 28919 28749 28623 28595 28517 28447 28379 28316 28265 28187 28091 28027 27963 27871 27798 27715 27615 27464 27272 27085 26898 26700 26411 26124
5548 26124 25876 25634 25393 25108 24817 24477 24108 23748 23405 23032 22650 22300 21915 21449 20943 20417 19859 19298 18782 18263 17803
5392 17803 17517 17461 17668 18114 18676 19297 19875 20320 20690 21043 21354 21647 21941 22170 22392 22628 22840 22948 23058 23194 23253 23322
5228 23322 23377 23405 23433 23463 23536 23548 23548 23496 23455 23525 23585 23608 23588 23607 23680 23687 23690 23714 23781 23857 23777 23682 23686 23732 23716 23678 23687 23728 23709 23642 23578 23606 23817 23733
4975 23733 23087 22893 22778 22848 22918 22865 22845 22813 22685 22533 22372 22207 22133 22065 21905 21781 21690 21633 21544 21336 21113 20947 20870 20709 20500
4788 20500 20315 20216 20099 19897 19698 19512 19346 19153 18936 18727 18468 18276 18179 17974 17741 17499 17231 16975 16829 16665 16499 16304
4625 16304 16165 16001 15731 15511 15367 15195 14995 14716 14513 14366 14174 13897 13653 13497 13298 13055 12791 12584 12440 12299 12065
$$ packed form
5995C1092orOQK1m0n5Rqn5m6mJ4k3p9l1j3j23q4l2q4r0n6r1j04r3n5q2j08j21j37j21
5757B9400p0r6j05r6j14j70j26k8p8p0o8o3n1p8r6o4Tr2p3q3j00j51j92j87Tj98k89k87
5548B6124k48k42k41k85k91l40l69l60l43l73l82l50l85m66n06n26n58n61n16n19m60
5392A7803k86n6K07M46N62O21N78M45L70L53L11K93K94K29K22K36K12J08J10J36N9O9
5228B3322N5K8TL0P3J2%n2m1P0O0K3k0J9P3PLK4O7P6q0r5MM6j6l8RM1j9o7o4K8K11q4
4975B3733o46j94j15P0Tn3k0l2j28j52j61j65p4o8j60j24r1n7q9k08k23j66p7j61k09
4788B0500j85r9j17k02j99j86j66j93k17k09k59j92r7k05k33k42k68k56j46j64j66j95
4625A6304j39j64k70k20j44j72k00k79k03j47j92k77k44j56j99k43k64k07j44j41k34
$$ plain form
4468 12065 11806 11581 11412 11178 10953 10724 10477 10235 10080 9843 9596 9410 9241 9051 8879 8664 8402 8187 8097 7961 7752 7614
4304 7614 7453 7270 7093 6928 6802 6695 6442 6225 6130 6020 5798 5660 5529 5389 5155 5021 4875 4706 4561 4456 4262 4066
4141 4066 3922 3823 3703 3498 3358 3285 3170 2998 2836 2740 2726 2557 2343 2218 2206 2075 1947 1820 1736 1727 1683 1510 1427 1352 1221
3954 1221 1158 1132 1057 1041 1001 896 841 777 719 704 710 622 586 567 567 519 507 431 396 321 312 268 251 175 211 231 200 103 122 91 120 208 148
3709 148 59 50 118 164 161 73 54 31 42 -4 -52 -68 69 14 6 51 6 7 88 41 -17 5 118 140 72 82 78 99 164 111 43 81 43 -76
3455 -76 -75 35 45 -50 -77 3 118 25 -12 -10 122 123 27 31
$$ packed form
4468A2065k59k25j69k34k25k29k47k42j55k37k47j86j69j90j72k15k62k15r0j36k09j38
4304G614j61j83j77j65j26j07k53k17r5j10k22j38j31j40k34j34j46j69j45j05j94j96
4141D066j44r9j20k05j40p3j15j72j62r6j4j69k14j25j2j31j28j27q4rm4j73q3p5j31
3954A221o3k6p5j6m0j05n5o4n8j5Oq8l6j9%m8j2p6l5p5rm4j7p6L6K0l1r7J9l1K9Q8o0
3709A48q9rO8M6lq8j9k3J1m6m8j6J37n5qM5m5JQ1m7n8K2J13K2o8J0mK1O5n3o8L8l8j19
3455g6JJ10J0r5k7Q0J15r3l7KJ32Jr6M
3351C1
##END=
