##TITLE= ginger oil
##JCAMP-DX= 4.24   $$ ISAS JCAMP-DX check program V1.1/a
##DATA TYPE= INFRARED SPECTRUM
##ORIGIN= Department of Chemistry, UWI, JAMAICA
##OWNER= public domain
##DATE= 99/11/24
##TIME= 13:56:00
##SPECTROMETER/DATASYSTEM= PERKIN-ELMER 1000 FT-IR
##INSTRUMENT PARAMETERS=
##DATAPROCESSING=
##RESOLUTION=   2.000000  
##DELTAX=  -1.000002    
##XUNITS= 1/CM
##YUNITS= TRANSMITTANCE
##XFACTOR=   .1342817    
##YFACTOR=   .2256886E-04
##FIRSTX=   4400.007    
##LASTX=   450.0000    
##MAXY=   .7395139    
##MINY=   .7455411E-01
##NPOINTS=   3951
##FIRSTY=   .6367922    
##XYDATA=(X++(Y..Y))
32767B8216j5k2l0m9PJ4Qnl8M%l5k9l6mL1K3qNJ6j6m6l8j7Ol1n9k5o7m6L8%p6m7j3k2
32499B7594j3k2o5q0j5J5k6m7k2pl2q3o2l6k2o4q7k5l3n4o0m8o8q0l9k7j1m4n2j5J9N4
32261B6443K2K0O7M3OM4M2QM0P6M1J4L9K5K2N3L7L9l0pL0j2oM6K4m2m3K0O1j1l9Ljk9
32007B7045j5j9K8K5pL8J6RK0J5K9PJ8O1N5L8K7LJ6N5L5J1M8J5j4j1K3K4NOM0M1Jrk3
31747B7656k4J0K0J0ll0j0J9TK0K3L6K1j0k4K1N4K1nj5PRK9J0j2LOmM9N3j5KM0K7K5M4
31479B8082M9L5J9L7M6M4L2M0L3K0M9M1Pk2J3N0Q4L9J7l0j1M1L6M3K2oJ5K1L7Tl9l4M6
31233B8893M4k7j5J4L8kn7nM0J2j8j7J0JKj1PJ7l8l0K3Npj7n1NM6Jj7m8j0M5K2m1o0J3
30965B8767M0QJ6N1J0NN3K1n0rP3K1kN7K5K1K5J9J6oK3K9J5L4km5j3L8L5J2K1L8nl9J6
$$ y = [28216, 28201, 28179, 28149, 28100, 28107, 28121, 28129, 28124, 28086, 28090, 28090, 28055, 28026, 27990, 27986, 28017, 28040, 28032, 28037, 28053, 28037, 27991, 27953, 27936, 27942, 27911, 27852, 27827, 27760, 27714, 27752, 27752, 27676, 27629, 27616, 27594, 27581, 27559, 27494, 27414, 27399, 27414, 27388, 27341, 27319, 27312, 27280, 27197, 27135, 27099, 27077, 27013, 26926, 26901, 26868, 26814, 26754, 26706, 26638, 26558, 26519, 26492, 26481, 26437, 26385, 26370, 26389, 26443, 26465, 26485, 26552, 26595, 26601, 26645, 26687, 26695, 26735, 26811, 26852, 26866, 26905, 26930, 26952, 27005, 27042, 27081, 27051, 27044, 27074, 27062, 27056, 27102, 27126, 27084, 27041, 27061, 27122, 27111, 27072, 27075, 27074, 27045, 27030, 27011, 27039, 27064, 27057, 27095, 27111, 27120, 27140, 27155, 27184, 27191, 27209, 27270, 27325, 27363, 27390, 27393, 27409, 27464, 27499, 27510, 27558, 27573, 27559, 27548, 27571, 27595, 27600, 27606, 27646, 27687, 27688, 27679, 27656, 27632, 27642, 27662, 27672, 27669, 27639, 27629, 27648, 27667, 27687, 27710, 27746, 27767, 27757, 27733, 27754, 27808, 27829, 27824, 27809, 27816, 27825, 27854, 27864, 27852, 27855, 27861, 27857, 27906, 27959, 27944, 27946, 27986, 28013, 28038, 28082, 28131, 28166, 28185, 28222, 28268, 28312, 28344, 28384, 28417, 28437, 28486, 28527, 28534, 28512, 28525, 28575, 28659, 28698, 28715, 28685, 28674, 28715, 28751, 28794, 28816, 28810, 28825, 28846, 28883, 28920, 28881, 28847, 28893, 28937, 28910, 28895, 28909, 28947, 28945, 28888, 28883, 28923, 28935, 28917, 28900, 28910, 28911, 28913, 28902, 28909, 28926, 28888, 28858, 28881, 28886, 28879, 28862, 28811, 28816, 28862, 28863, 28846, 28798, 28788, 28833, 28855, 28814, 28754, 28767, 28807, 28815, 28831, 28882, 28892, 28897, 28950, 28971, 28921, 28912, 28985, 29006, 29004, 29061, 29086, 29107, 29132, 29151, 29167, 29161, 29184, 29213, 29228, 29262, 29260, 29215, 29202, 29240, 29275, 29287, 29308, 29346, 29341, 29302, 29318]
30704B9318L6j0k7mL2L9Jj7lmpMPj6k1j0J5j4k2mQkl8j8J4K1qk2l6j3Tk9MOk2j5ol8l3
30414B9053j7k9j1on0n8m0k0m3l5n0o3k1k9m2Tl3j0jkl1l7J6J5j2J0J9QL3K2K7L5K0K1
30161B8597J3J5M6P1M9J7L9M4N3O0M2L2M3K6J8L9L2J7M3L2mK9L4K7L7J4lJ5L3j1j9N1
29922B9531L2J5J0rJ0L9L0k2k7j7nqjK8kl6k9kJ5J4J2K7Nk5k6L3L7m6k9N0J3j9L0K2l4
29662B9616m3k3J2TJ7J0qjL5rk9K9M6Pk4K3J8j9pK9L2nJ1TMj0mRK0K6R%rJ8L7l0j3J1
29379B9808kJ5NnQJ7J6Pk5k0L0N6K2kk5m4jL4K9lrj6k6K4L2JK0j7l5KK5oj9jJ8K4oNP9
29088C0015J04J1Nl3TO1j7o9l8l7j4K3P5Q0n0p2j5mL6M7l5nj0K2N9l1n3k9LM6M8Mk0J5
28835C0089P9L0r5m6K1R2M1q1kTm8jL2L7J9P4J41K4k6l6p3k8j3j7k2L2P8L8OL1K9K5O5
$$ y = [29318, 29354, 29344, 29317, 29313, 29345, 29384, 29385, 29368, 29365, 29361, 29354, 29358, 29365, 29349, 29328, 29318, 29333, 29319, 29297, 29293, 29301, 29299, 29261, 29243, 29257, 29278, 29270, 29248, 29212, 29199, 29186, 29157, 29161, 29167, 29145, 29130, 29124, 29086, 29053, 29036, 29007, 28996, 28990, 28940, 28882, 28842, 28822, 28779, 28744, 28694, 28631, 28610, 28581, 28539, 28497, 28464, 28454, 28453, 28451, 28420, 28383, 28399, 28414, 28402, 28412, 28431, 28439, 28472, 28494, 28521, 28556, 28576, 28597, 28610, 28625, 28671, 28742, 28791, 28808, 28847, 28891, 28944, 29004, 29046, 29078, 29121, 29147, 29165, 29204, 29236, 29253, 29296, 29328, 29324, 29353, 29387, 29414, 29451, 29465, 29462, 29477, 29510, 29499, 29480, 29531, 29563, 29578, 29588, 29579, 29589, 29628, 29658, 29636, 29609, 29592, 29587, 29579, 29578, 29606, 29604, 29568, 29539, 29537, 29552, 29566, 29578, 29605, 29610, 29585, 29559, 29592, 29629, 29583, 29554, 29604, 29617, 29598, 29628, 29650, 29616, 29573, 29550, 29562, 29574, 29591, 29601, 29593, 29592, 29627, 29618, 29589, 29618, 29664, 29671, 29647, 29670, 29688, 29669, 29662, 29691, 29723, 29718, 29729, 29740, 29744, 29734, 29730, 29739, 29759, 29785, 29794, 29794, 29785, 29803, 29840, 29810, 29797, 29808, 29806, 29821, 29826, 29821, 29829, 29846, 29862, 29869, 29844, 29824, 29854, 29910, 29932, 29930, 29905, 29861, 29860, 29894, 29923, 29920, 29911, 29895, 29869, 29893, 29925, 29926, 29946, 29929, 29894, 29896, 29921, 29915, 29896, 29895, 29913, 29937, 29931, 29936, 30015, 30119, 30130, 30135, 30102, 30069, 30130, 30113, 30044, 30006, 29969, 29955, 29978, 30053, 30133, 30083, 30011, 29996, 29992, 30028, 30075, 30040, 30035, 30025, 30047, 30106, 30075, 30022, 29993, 29996, 30042, 30090, 30094, 30074, 30089, 30168, 30198, 30103, 30057, 30078, 30170, 30211, 30130, 30128, 30126, 30078, 30077, 30109, 30146, 30165, 30239, 30380, 30404, 30378, 30342, 30269, 30241, 30228, 30211, 30189, 30221, 30299, 30337, 30343, 30374, 30403, 30428, 30493]
28589C0493k8j06J7Km9J1K0m9kL1N7K4j8QJ3O6J22M9j18p8L0Q9l4r5k7j8Mj4J6N8J00
28358C0574J5r8j5P0J29Q9q7r9pJ8K9on7j1L1Qnj8rOL4L9L8Kl8rO1P4on7k1Pk0j0LM3
28090C0697R1K6m3m6JM4j2k2PNL9P8Ql2j2k3j4O6J19K3J3P2q7q1J4N7J06o0j15K9J2k9
27852C0931QK5L5O9P7j3Kp3r1m0lL3K7L2m3l2K2j4Qkn6j2j6k4J2O8J01K3k5k9n8k8k6
27606C0888k5m2oO4K3p1n9o0l0l1l7Lk7l1L0j7k4lj60j40o5n5m7n5n3N9L2q4LJ20J24
27375C0224q1k51o3R3L7n1nr7q0m7pOql5jJ4j8L5N2n4m9l5j5O3O8J7j29l9o6j80p8m0
27137B9180j3k1q1p5m1l9r7p9k6p5j27o8J9M1j11l28k07j71j51j08j35j34j38j87j75
26951B6653q5j33o4n4p9q1j85j21j30l77j75Q0%m5p1r7p5j06j55j18Tj04p5j50j20j38
$$ y = [30493, 30465, 30359, 30376, 30378, 30329, 30340, 30360, 30311, 30309, 30340, 30397, 30421, 30403, 30411, 30424, 30490, 30612, 30661, 30543, 30465, 30495, 30584, 30550, 30455, 30428, 30410, 30414, 30400, 30416, 30474, 30574, 30589, 30491, 30476, 30546, 30675, 30764, 30677, 30578, 30571, 30589, 30618, 30612, 30555, 30544, 30575, 30583, 30578, 30560, 30551, 30557, 30591, 30630, 30668, 30670, 30632, 30623, 30684, 30758, 30752, 30695, 30674, 30681, 30661, 30651, 30654, 30697, 30788, 30814, 30771, 30725, 30726, 30770, 30758, 30736, 30743, 30748, 30787, 30865, 30873, 30841, 30829, 30806, 30792, 30858, 30977, 31000, 31013, 31085, 30998, 30917, 30931, 30988, 31094, 31034, 30919, 30948, 30960, 30931, 30939, 30964, 30999, 31068, 31145, 31132, 31134, 31061, 30970, 30930, 30927, 30960, 30987, 31019, 30976, 30944, 30966, 30952, 30960, 30958, 30902, 30890, 30874, 30850, 30862, 30930, 31031, 31054, 31029, 31000, 30942, 30914, 30888, 30863, 30821, 30815, 30879, 30902, 30831, 30772, 30712, 30682, 30651, 30614, 30617, 30590, 30559, 30589, 30572, 30548, 30545, 30385, 30245, 30180, 30125, 30078, 30023, 29970, 30029, 30061, 29977, 29980, 30100, 30224, 30143, 29892, 29829, 29922, 29959, 29908, 29903, 29806, 29726, 29679, 29672, 29678, 29670, 29635, 29634, 29648, 29630, 29665, 29717, 29663, 29614, 29579, 29564, 29627, 29695, 29712, 29583, 29544, 29478, 29298, 29220, 29180, 29167, 29146, 29065, 28990, 28949, 28910, 28813, 28734, 28708, 28633, 28506, 28438, 28457, 28498, 28387, 28059, 27852, 27681, 27530, 27422, 27287, 27153, 27015, 26828, 26653, 26568, 26435, 26371, 26317, 26238, 26157, 25972, 25851, 25721, 25344, 25169, 25249, 25249, 25204, 25133, 25036, 24961, 24855, 24700, 24582, 24464, 24360, 24285, 24135, 24015, 23877]
26757B3877j45j17o9j15k21k02l97l18j99j58j6M0m9j10r3j09j24Tj59j46j03j26j60
26586B0657o8j53j94k09k02j23j57j50r4j33j57j36j15r7j16j12p5j43j89j05q3q4j08
26415A7654j16j41j54r6j14j08j19j22p7m7j28j56r6r0q3q2r0q3r3j07j05q6o7r9j25
26228A5070j05r6j00r5p6p1q3p6n8q0p6n6j13j18o4m9m6p7j00q0p2o8o0o1n4o5o6o7p2
26013A2866o8n3m6n1o6o0n3m5n6n2n1n9l7m4n1l4l3l7n2n0l4l2j6l1m7l5l4k4k3l6l5
25782A1521l8k7qj1qk9m2l9j3%l7j7j3j6j5j8j9rj8k7qj2k7OK3Pl4qJ5j0nNLlpJ0NKJ1
25491A1090jj4rJ3L1K1rk1J7L6K1MJ4K4lKJ0K8L7L1Q%K9L2RJ3J2QK0L7RK4M6K7J1L0M5
25216A1682OkL2N7L0K7L7K2K9L3J7K1M0M6N3M0J9M2N3K6K7L5L1M3N0M5M3O0L6J0L7N0
$$ y = [23877, 23732, 23615, 23546, 23431, 23210, 23008, 22611, 22293, 22094, 21936, 21920, 21960, 21911, 21801, 21708, 21599, 21475, 21351, 21192, 21046, 20943, 20817, 20657, 20589, 20436, 20242, 20033, 19831, 19708, 19551, 19401, 19307, 19174, 19017, 18881, 18766, 18669, 18553, 18441, 18366, 18223, 18034, 17929, 17846, 17762, 17654, 17538, 17397, 17243, 17147, 17033, 16925, 16806, 16684, 16607, 16560, 16432, 16276, 16180, 16090, 16007, 15925, 15835, 15752, 15659, 15552, 15447, 15361, 15294, 15195, 15070, 14965, 14869, 14769, 14674, 14598, 14527, 14444, 14368, 14310, 14230, 14154, 14098, 13985, 13867, 13803, 13754, 13708, 13631, 13531, 13451, 13379, 13311, 13251, 13190, 13136, 13071, 13005, 12938, 12866, 12798, 12745, 12699, 12648, 12582, 12522, 12469, 12424, 12368, 12316, 12265, 12206, 12169, 12125, 12074, 12040, 12007, 11970, 11918, 11868, 11834, 11802, 11786, 11755, 11708, 11673, 11639, 11615, 11592, 11556, 11521, 11483, 11456, 11448, 11437, 11429, 11400, 11358, 11319, 11306, 11306, 11269, 11252, 11239, 11223, 11208, 11190, 11171, 11162, 11144, 11117, 11109, 11097, 11070, 11076, 11099, 11106, 11072, 11064, 11079, 11069, 11064, 11069, 11072, 11069, 11062, 11072, 11077, 11079, 11090, 11089, 11075, 11066, 11079, 11110, 11131, 11122, 11101, 11118, 11154, 11175, 11179, 11193, 11217, 11214, 11216, 11226, 11254, 11291, 11322, 11330, 11330, 11359, 11391, 11400, 11413, 11425, 11433, 11453, 11490, 11499, 11523, 11569, 11596, 11607, 11637, 11682, 11688, 11686, 11718, 11775, 11805, 11832, 11869, 11891, 11920, 11953, 11970, 11991, 12031, 12077, 12130, 12170, 12189, 12231, 12284, 12310, 12337, 12372, 12403, 12446, 12496, 12541, 12584, 12644, 12680, 12690, 12727, 12777]
24977A2777M5O3L2K1N9L4M1N9M1M4N8M8M0L2N2O7M9L6O5N9M5N4O3P2N5M7N8O4O7N0O7
24747A4364O5N0N3N7O5P9N6N1P7O5N0O4Q4P3N3O0O6P2O4N6P1P4N5P6P1N0N3P7R2P0N8
24516A6371P6Q0N6O0P7P4P1P9O7P3P5M9N9Q6P1M6P9J04Q5N3M2O9R0Q1P0P8O7O5R1P8N8
24285A8580N5O6P8Q9O1M6Q4R1O2N0P4Q5N5O9R2O3N5P7P3N8N7N4O8P3N6Q0O8M0O9Q0N2
24054B0660N4N3N9N5M1O1M6M8Q1P4L9TQ4Q6N8L0L5N7P0O4N1L5N0P8N4N2O6M6L4N1N7N2
23816B2420M1M6P1O0N9M5TN5UN1TK6N7P1M7L3L7O4M8L4O6N9M7L6M0N0TK8L5M2N0M8K9
23562B4051O3M2K9K0J6O4L9K0K9K7N2L5KK4K7mJ0M1L3LOK1K2K6Qokqk7k5LMnj6rJ9N1
23287B4685J3qJ5L1NjJ8J2j2pjk5l0j1k8m5k7k1n7p8q0r9r6j19j59j73k00k42k80l22
$$ y = [12777, 12822, 12885, 12917, 12938, 12997, 13031, 13072, 13131, 13172, 13216, 13274, 13322, 13362, 13394, 13446, 13513, 13562, 13598, 13663, 13722, 13767, 13821, 13884, 13956, 14011, 14058, 14116, 14180, 14247, 14297, 14364, 14429, 14479, 14532, 14589, 14654, 14733, 14789, 14840, 14917, 14982, 15032, 15096, 15180, 15253, 15306, 15366, 15432, 15504, 15568, 15624, 15695, 15769, 15824, 15900, 15971, 16021, 16074, 16151, 16243, 16313, 16371, 16447, 16527, 16583, 16643, 16720, 16794, 16865, 16944, 17011, 17084, 17159, 17208, 17267, 17353, 17424, 17470, 17549, 17653, 17738, 17791, 17833, 17902, 17992, 18073, 18143, 18221, 18288, 18353, 18444, 18522, 18580, 18635, 18701, 18779, 18868, 18929, 18975, 19059, 19150, 19212, 19262, 19336, 19421, 19476, 19545, 19637, 19700, 19755, 19832, 19905, 19963, 20020, 20074, 20142, 20215, 20271, 20351, 20419, 20459, 20528, 20608, 20660, 20714, 20767, 20826, 20881, 20922, 20983, 21029, 21077, 21158, 21232, 21271, 21310, 21394, 21480, 21538, 21568, 21603, 21660, 21730, 21794, 21845, 21880, 21930, 22008, 22062, 22114, 22180, 22226, 22260, 22311, 22368, 22420, 22461, 22507, 22578, 22638, 22697, 22742, 22787, 22842, 22897, 22952, 23003, 23054, 23080, 23137, 23208, 23255, 23288, 23325, 23389, 23437, 23471, 23537, 23596, 23643, 23679, 23719, 23769, 23819, 23847, 23882, 23924, 23974, 24022, 24051, 24114, 24156, 24185, 24205, 24221, 24285, 24324, 24344, 24373, 24400, 24452, 24487, 24489, 24513, 24540, 24536, 24546, 24587, 24620, 24623, 24629, 24650, 24672, 24698, 24706, 24700, 24698, 24690, 24663, 24638, 24641, 24645, 24640, 24624, 24615, 24634, 24685, 24698, 24690, 24705, 24736, 24741, 24740, 24758, 24770, 24758, 24751, 24750, 24725, 24695, 24684, 24656, 24611, 24584, 24563, 24506, 24428, 24348, 24249, 24153, 24034, 23875, 23702, 23502, 23260, 22980, 22658]
23063B2658l60l77l48k92k46k33k35k25k29k36k24k25k27k18j95j48r7p3n2k1J9J8L1
22892A8465K6k9o9o7r4j05j16j09p7n2m4m7o3p8j13j51j72j59j65j84j72j51j36j21j03
22706A5914p8m8j8k0m1l4n3j10j42j48j78k23k54k96l12l20l32l55l54l30l20l08k86T
22527A1068k68k32j99j63j17r1q4m2j6n6q2p6j18j30j23j48j39j36Tj34j19Tj57j73k00
22341G810k19k20k26k49k75k87k65k34k17k02k03j79j36j15r2q0n4m4m6l2Tm5k8Mj2k3
22148D299opj9k7ToT%RJ4KJ0RKMoj8oJ9K2KTLoR%QJ5nj8%Rj1j7mQmj5QLj2JJ1oj7koM
21790D222NokJ1J5j1j4K4J0pmJ7OnRPJJ0J4L2J7j7oJ0J7PMJ4K6K0jlNOJ2oQTNMj7j8O
21470D435J4J3j9k3J1%jj0mkn%jJ5RkJ6LJ0MnQOj8j7j3J2L4%qL7M6N4O5O6J10J24J19
$$ y = [22658, 22298, 21921, 21573, 21281, 21035, 20802, 20567, 20342, 20113, 19877, 19653, 19428, 19201, 18983, 18788, 18640, 18543, 18470, 18418, 18397, 18416, 18434, 18465, 18491, 18462, 18393, 18326, 18232, 18127, 18011, 17902, 17825, 17773, 17729, 17682, 17619, 17541, 17428, 17277, 17105, 16946, 16781, 16597, 16425, 16274, 16138, 16017, 15914, 15836, 15788, 15770, 15750, 15709, 15675, 15622, 15512, 15370, 15222, 15044, 14821, 14567, 14271, 13959, 13639, 13307, 12952, 12598, 12268, 11948, 11640, 11354, 11068, 10800, 10568, 10369, 10206, 10089, 9998, 9914, 9872, 9856, 9800, 9718, 9642, 9524, 9394, 9271, 9123, 8984, 8848, 8712, 8578, 8459, 8340, 8183, 8010, 7810, 7591, 7371, 7145, 6896, 6621, 6334, 6069, 5835, 5618, 5416, 5213, 5034, 4898, 4783, 4691, 4611, 4557, 4513, 4467, 4435, 4403, 4358, 4330, 4334, 4322, 4299, 4293, 4286, 4267, 4240, 4213, 4207, 4201, 4201, 4210, 4224, 4226, 4236, 4245, 4247, 4251, 4245, 4227, 4221, 4240, 4262, 4264, 4266, 4269, 4263, 4272, 4272, 4280, 4295, 4290, 4272, 4272, 4281, 4270, 4253, 4249, 4257, 4253, 4238, 4246, 4249, 4237, 4238, 4249, 4243, 4226, 4224, 4218, 4222, 4227, 4221, 4219, 4230, 4245, 4234, 4220, 4244, 4254, 4247, 4243, 4260, 4266, 4261, 4270, 4277, 4278, 4288, 4302, 4334, 4351, 4334, 4328, 4338, 4355, 4362, 4366, 4380, 4406, 4426, 4425, 4422, 4427, 4433, 4445, 4439, 4447, 4455, 4460, 4464, 4447, 4429, 4435, 4449, 4462, 4443, 4420, 4431, 4431, 4430, 4420, 4416, 4414, 4409, 4409, 4408, 4423, 4432, 4430, 4446, 4449, 4459, 4463, 4458, 4466, 4472, 4454, 4437, 4424, 4436, 4470, 4470, 4462, 4499, 4545, 4599, 4664, 4730, 4840, 4964, 5083]
21187E083J45J58J55J46J41J37J20TJ36TJ43J87K20K45L23L80M17M99N23N16N26N14M99
21016A1469N01M74M25M29M24L91L66L54L46L37L17L02L06L30L44L57L36L40L47L49L47
20859A9191L30L03L22L34K99K77TK59K36K37K32K15J86J89J90J63J52TJ35J45J41J27
20695B4092R1Q3J05J09P3M1P1Q6P1N0L3QK1J8J1T%KTkKJ3Mm%k0l3l1l4m7o3n0o0p3q0
20435B4500r4r5j05j26j50j88k25k21k38k68k37k03j61j00p1m2L4R2J52K05K47K53K79
20263B3238L08K96K93K68K14K10K12J89J45J35J46J48J26J18J41J18R8R5P9P3P9N5M2
20092B6826M9L7L4L8M9K7J1K9M3J6KL0J2kM1M4L3JQM8J9J0J8lRK0K4J3NJ3L0K2J0%J7
19831B7583L0K2L8L7J9K5M3M4M6K9K5N7O6L0M0L9J7K0L6K5K0K3K6K8OJ5L1J1KK1K3j3
$$ y = [5083, 5228, 5386, 5541, 5687, 5828, 5965, 6085, 6205, 6341, 6477, 6620, 6807, 7027, 7272, 7595, 7975, 8392, 8891, 9414, 9930, 10456, 10970, 11469, 11970, 12444, 12869, 13298, 13722, 14113, 14479, 14833, 15179, 15516, 15833, 16135, 16441, 16771, 17115, 17472, 17808, 18148, 18495, 18844, 19191, 19521, 19824, 20146, 20480, 20779, 21056, 21333, 21592, 21828, 22065, 22297, 22512, 22698, 22887, 23077, 23240, 23392, 23544, 23679, 23824, 23965, 24092, 24183, 24266, 24371, 24480, 24553, 24594, 24665, 24751, 24822, 24872, 24905, 24913, 24934, 24952, 24963, 24974, 24974, 24976, 24978, 24976, 24978, 24991, 24995, 24991, 24991, 24971, 24938, 24907, 24873, 24826, 24763, 24713, 24653, 24580, 24500, 24406, 24311, 24206, 24080, 23930, 23742, 23517, 23296, 23058, 22790, 22553, 22350, 22189, 22089, 22018, 21976, 22010, 22102, 22254, 22459, 22706, 22959, 23238, 23546, 23842, 24135, 24403, 24617, 24827, 25039, 25228, 25373, 25508, 25654, 25802, 25928, 26046, 26187, 26305, 26403, 26498, 26577, 26650, 26729, 26784, 26826, 26875, 26912, 26946, 26984, 27033, 27060, 27071, 27100, 27143, 27159, 27161, 27191, 27203, 27201, 27242, 27286, 27319, 27320, 27328, 27376, 27395, 27405, 27423, 27420, 27429, 27449, 27473, 27486, 27491, 27504, 27534, 27556, 27566, 27566, 27583, 27613, 27635, 27673, 27710, 27729, 27754, 27797, 27841, 27887, 27916, 27941, 27998, 28064, 28094, 28134, 28173, 28190, 28210, 28246, 28271, 28291, 28314, 28340, 28368, 28374, 28389, 28420, 28431, 28433, 28454, 28477, 28464]
19593B8464MK8J7RKJ1J5OJ8J7jNJ7L8L1NTJ5K4TRJ8jk7J4L5LjJ2J7J4J8TJ6J8L3L9J1
19310B9000KL6L8K0KJ8L8M0L4J4K0L8L4J9J8L6K8J4J0TK0K3QJ6K6J7NPJ1L3K1J9K9J2
19057B9716K1J5J1J9J0J3K5J4J6K5J6TJ0J7K7J3KQK2L0K4j3lL1PjJ9K2J2J8NKjQM1L2
18789C0249j5oK5J2PJ6K3LQL9lk9jK3K5J2j0NL0K6RlK3K9jrQJ8K3K4MnMJ1K2J9k0qJ4
18498C0601J1J7RqOL1J2j8oK2J5j0qK5K0roMJ9K5K3%JJ6K2JqJ4K3KnrJ8K9J3KK8K0rK5
18201C0958M6L4K0J1OJ2K0lJROK0J9J6pRJ0%jrRJ9nj6OK4J8j1%Rj5opj1JkTnTk1j5NR
17880C1156j5mK1J1k3j1M0L0rJ9K5K1J7L9TJ2K0P2O5M3L7N5R0N4N0O7J0O8Q9P6R7O6O2
17635C2389J14J23N4J7mn1L4R1l5k9Oq5m1m0p7q8j19q4n9L9R8J04R0k2PM4Kl6l1OJ8j6
$$ y = [28464, 28468, 28496, 28513, 28522, 28524, 28535, 28550, 28556, 28574, 28591, 28590, 28595, 28612, 28650, 28681, 28686, 28691, 28706, 28730, 28754, 28763, 28781, 28780, 28753, 28767, 28802, 28805, 28804, 28816, 28833, 28847, 28865, 28883, 28899, 28917, 28950, 28989, 29000, 29002, 29038, 29076, 29096, 29098, 29116, 29154, 29194, 29228, 29242, 29262, 29300, 29334, 29353, 29371, 29407, 29435, 29449, 29459, 29469, 29489, 29512, 29520, 29536, 29562, 29579, 29584, 29591, 29602, 29635, 29656, 29675, 29704, 29716, 29737, 29752, 29763, 29782, 29792, 29805, 29830, 29844, 29860, 29885, 29901, 29917, 29927, 29944, 29971, 29984, 29986, 29994, 30016, 30046, 30070, 30057, 30054, 30085, 30092, 30091, 30110, 30132, 30144, 30162, 30167, 30169, 30168, 30176, 30217, 30249, 30234, 30228, 30253, 30265, 30272, 30288, 30311, 30314, 30322, 30361, 30358, 30329, 30328, 30351, 30376, 30388, 30378, 30383, 30413, 30439, 30448, 30445, 30468, 30497, 30496, 30487, 30495, 30513, 30536, 30560, 30564, 30559, 30563, 30574, 30596, 30615, 30595, 30587, 30601, 30612, 30629, 30638, 30630, 30636, 30667, 30679, 30661, 30655, 30677, 30692, 30682, 30674, 30699, 30719, 30710, 30704, 30708, 30727, 30752, 30775, 30775, 30776, 30792, 30814, 30815, 30807, 30821, 30844, 30846, 30841, 30832, 30850, 30879, 30892, 30894, 30922, 30942, 30933, 30958, 31004, 31038, 31058, 31069, 31075, 31087, 31107, 31104, 31105, 31114, 31120, 31140, 31159, 31175, 31168, 31177, 31187, 31187, 31186, 31177, 31186, 31205, 31200, 31184, 31190, 31214, 31232, 31221, 31221, 31230, 31215, 31209, 31202, 31191, 31192, 31190, 31188, 31183, 31178, 31157, 31142, 31147, 31156, 31141, 31137, 31158, 31169, 31146, 31135, 31175, 31205, 31196, 31215, 31240, 31261, 31278, 31317, 31356, 31368, 31388, 31460, 31525, 31568, 31605, 31660, 31750, 31804, 31854, 31921, 31931, 31999, 32088, 32164, 32261, 32327, 32389, 32503, 32626, 32680, 32697, 32693, 32642, 32676, 32767, 32732, 32703, 32709, 32624, 32583, 32543, 32466, 32378, 32259, 32175, 32116, 32155, 32253, 32357, 32447, 32425, 32432, 32476, 32478, 32442, 32411, 32417, 32435, 32419]
17396C2419n6j5M3K0Kk1l4k8pn8j0M8M1o2l3m3l5l7j5l5Ok1kTOj3K3k1m1q%k8Mj0j4j3T
17121C1937%PJ6j6MljLRK9J0j5jMQRJ0J1NK0K1rPL1J6j0j7KK4%J4J5mMJ4J3j0k0j2kO
16815C2129J5Oj2j7oOJ5J0qnqoK5K0J5TMRk%J8L3J5j2qlLJ0Mkj9oMK%oK2J5j6NTj0PK
16488C2268j2RJ2j5JQk3nK2mj8OJ5PJ0KplTLJ2J8Kj3k%KmQRk5j9Mpj1MOj8JK7K0K2K3
16168C2332J2OJ7J5qpJ5K8J8J1j1MTj3oj0oK6Qj5J2kj1QOJ%qk2j2RrmK5K4J3OTJ3Pj2
15862C2470MJ7J1RnJ0K6J1J3RljROJ2K4%KPj3mKMj3j6j5ORj1jK5lj8J4Rj4KJ5K%mKjL
15535C2611K6Kk5j3Kj2nTQTqj1%j0MJ0j9j8OPLj2k4j0J0LMRMJ1Ll4j8J3jk1K3M7MmOp
15222C2567LJ4Kj0POj5jJ3j6QK8nrJ0LMRJ5QJ2ojKlK5K1k2k9LJ0nJJ1lj3j1J5Pj8nj6
$$ y = [32419, 32363, 32348, 32391, 32411, 32413, 32392, 32358, 32330, 32323, 32265, 32255, 32303, 32344, 32282, 32249, 32206, 32171, 32134, 32119, 32084, 32090, 32069, 32067, 32065, 32071, 32058, 32081, 32060, 32019, 32011, 32011, 31983, 31987, 31977, 31963, 31950, 31937, 31937, 31944, 31960, 31944, 31948, 31945, 31944, 31947, 31956, 31985, 31995, 31980, 31979, 31983, 31991, 32000, 32010, 32021, 32026, 32046, 32067, 32058, 32065, 32096, 32112, 32102, 32085, 32087, 32111, 32111, 32125, 32140, 32136, 32140, 32154, 32167, 32157, 32137, 32125, 32123, 32129, 32144, 32150, 32138, 32121, 32115, 32121, 32136, 32146, 32138, 32133, 32125, 32119, 32144, 32164, 32179, 32194, 32198, 32207, 32205, 32205, 32223, 32256, 32271, 32259, 32251, 32248, 32251, 32261, 32265, 32263, 32244, 32238, 32242, 32244, 32244, 32238, 32260, 32275, 32259, 32264, 32269, 32259, 32266, 32268, 32256, 32265, 32277, 32262, 32263, 32271, 32248, 32243, 32265, 32261, 32243, 32249, 32264, 32271, 32281, 32283, 32276, 32273, 32270, 32273, 32285, 32303, 32305, 32292, 32290, 32290, 32292, 32288, 32296, 32305, 32280, 32261, 32265, 32258, 32247, 32251, 32257, 32239, 32240, 32267, 32287, 32309, 32332, 32344, 32350, 32367, 32382, 32374, 32367, 32382, 32410, 32428, 32439, 32428, 32432, 32436, 32423, 32417, 32407, 32401, 32427, 32435, 32420, 32432, 32430, 32419, 32427, 32433, 32434, 32434, 32426, 32404, 32392, 32401, 32392, 32388, 32413, 32437, 32450, 32456, 32462, 32475, 32482, 32470, 32474, 32491, 32502, 32511, 32506, 32516, 32542, 32553, 32566, 32575, 32572, 32571, 32580, 32586, 32598, 32622, 32622, 32624, 32631, 32618, 32614, 32616, 32620, 32607, 32591, 32576, 32582, 32591, 32580, 32579, 32604, 32601, 32583, 32597, 32606, 32592, 32594, 32609, 32611, 32611, 32607, 32609, 32608, 32611, 32637, 32639, 32614, 32601, 32603, 32591, 32586, 32581, 32589, 32597, 32589, 32578, 32578, 32568, 32572, 32582, 32563, 32545, 32551, 32558, 32561, 32549, 32525, 32515, 32525, 32528, 32532, 32541, 32545, 32556, 32559, 32525, 32507, 32520, 32519, 32498, 32521, 32568, 32572, 32568, 32574, 32567, 32570, 32584, 32586, 32576, 32583, 32589, 32574, 32573, 32586, 32570, 32578, 32606, 32601, 32592, 32602, 32605, 32609, 32618, 32633, 32641, 32653, 32647, 32646, 32648, 32645, 32670, 32691, 32669, 32640, 32643, 32653, 32648, 32649, 32660, 32657, 32644, 32633, 32648, 32655, 32637, 32632, 32616]
14909C2616j7J6%j2JKLJL0Jl8j4Oj9k8j0TkKj0j7k2j5l0j9Kj9l7l1k6pj1j9j5K9J5j1
14633C2285nQJ0NQK3J2MJ6L3K9K0j%L0K4kKJ7K0J3K7j5m6MRjNRLlkjNOnj0qoLK5L4l4
14313C2550n2j2M1K0n7j0ql8l2j6qj8k7l6p2p8m9n7q7j02r8r0j12j32j29q6q8Tk9K2Q4
14082C1106J60J49J31J29R9J18J17Q0N3M3L8L2K0noK1L4POO1R5K7n4l2k6k3T%kj1J5J0
13844C2369j2k3j8j2k3kOplJ7Jl6K2R9j2j33n9n2j6J7j2m1m3l1l2l1j8O2N4j29j24%N1
13598C1829l4r0k0l8p3m2pol6m1m0Tm7m8k7r0j04o3q5p6j00r7r2j29j43j42k52k42j72
13382B9453k27k80j61j58l66l08k89k16j51j27q3q2j42n9k4lq9r4o8m5k3n2J0M4j45k26
13189B6089j47j8j38k18j19j37j49q0j63m06k31k02k01l11n03l71l59l60k73o12n54l47
$$ y = [32616, 32599, 32615, 32615, 32603, 32604, 32606, 32609, 32610, 32640, 32641, 32603, 32589, 32595, 32576, 32548, 32538, 32528, 32526, 32528, 32518, 32501, 32479, 32464, 32434, 32415, 32417, 32398, 32361, 32330, 32304, 32297, 32286, 32267, 32252, 32281, 32296, 32285, 32280, 32288, 32298, 32303, 32311, 32334, 32346, 32350, 32366, 32399, 32428, 32448, 32447, 32447, 32477, 32501, 32499, 32501, 32518, 32538, 32551, 32578, 32563, 32517, 32521, 32530, 32529, 32534, 32543, 32546, 32543, 32541, 32540, 32545, 32551, 32546, 32536, 32528, 32522, 32525, 32550, 32584, 32550, 32498, 32486, 32527, 32547, 32490, 32480, 32472, 32434, 32402, 32386, 32378, 32360, 32333, 32297, 32225, 32147, 32098, 32041, 31954, 31852, 31754, 31664, 31552, 31420, 31291, 31205, 31117, 31029, 31000, 31022, 31106, 31266, 31415, 31546, 31675, 31774, 31892, 32009, 32089, 32142, 32185, 32223, 32255, 32275, 32270, 32264, 32285, 32319, 32326, 32332, 32393, 32488, 32515, 32461, 32429, 32403, 32380, 32357, 32357, 32355, 32344, 32359, 32369, 32357, 32334, 32316, 32304, 32281, 32279, 32285, 32278, 32275, 32292, 32293, 32257, 32279, 32378, 32366, 32233, 32174, 32122, 32106, 32123, 32111, 32070, 32027, 31996, 31964, 31933, 31915, 31977, 32031, 31902, 31778, 31778, 31829, 31795, 31705, 31685, 31647, 31574, 31532, 31525, 31519, 31483, 31442, 31402, 31362, 31315, 31267, 31240, 31150, 31046, 30983, 30898, 30822, 30722, 30625, 30533, 30404, 30261, 30119, 29867, 29625, 29453, 29226, 28946, 28785, 28627, 28261, 27953, 27664, 27448, 27297, 27170, 27087, 27005, 26863, 26804, 26780, 26777, 26688, 26594, 26526, 26481, 26458, 26406, 26416, 26460, 26315, 26089, 25942, 25924, 25786, 25568, 25449, 25312, 25163, 25083, 24920, 24514, 24283, 24081, 23880, 23569, 23066, 22695, 22336, 21976, 21703, 21091, 20537, 20190]
13025B0190n28m42m10l59l49m67m20k28m35p85m97n07m14k98r28j015m55l76n50n60l31
12868I836k75j80q9k5K9J08J76K47K81J54Q4K39J89J33K13K55K64K49K66L40L69L36L26
12697A3525K85L37M62M98k7oL03K53Nm34Lrj05q3j00j20j87k02k4p9p70o44k20j48l31
12511A2182l00j54o9J1k20m3K37K43K56L39L08K42L22K91K63K33J46j5O4J23J42J60J63
12340A4924K24K93L63R4k64J41R3m1k39m22n45n85r0k7M2J71L07L97N10N78N75O70O39
12168A7808O74P17O44N86N47M62L42L24L78TK08J61K19K15K21K43K35q9M8J13O9P9J07
11997B4689Q4Mk6%P0J84K13J61R2l1j65k34k18j43L7K34L72M16M19L84L07K04J79J38
11818B7370J05P3N7K8J0LpJ1R0K06Q0o3O4J07J04J59J98l3m2N4P4P8l3j2P3J94K97O2
$$ y = [20190, 19662, 19220, 18810, 18451, 18102, 17635, 17215, 16987, 16552, 15767, 15270, 14763, 14349, 14051, 13123, 12108, 11653, 11277, 10727, 10167, 9836, 9561, 9381, 9292, 9267, 9296, 9404, 9580, 9827, 10108, 10262, 10346, 10585, 10774, 10907, 11120, 11375, 11639, 11888, 12154, 12494, 12863, 13199, 13525, 13810, 14147, 14609, 15107, 15080, 15074, 15377, 15630, 15635, 15201, 15204, 15195, 15090, 15007, 14907, 14787, 14600, 14398, 14374, 14295, 13525, 12881, 12661, 12513, 12182, 11882, 11728, 11659, 11670, 11450, 11407, 11644, 11887, 12143, 12482, 12790, 13032, 13354, 13645, 13908, 14141, 14287, 14272, 14336, 14459, 14601, 14761, 14924, 15148, 15441, 15804, 15898, 15634, 15775, 15868, 15827, 15588, 15166, 14621, 14036, 13946, 13919, 13961, 14132, 14439, 14836, 15346, 15924, 16499, 17169, 17808, 18482, 19199, 19843, 20429, 20976, 21438, 21780, 22104, 22482, 22860, 23068, 23229, 23448, 23663, 23884, 24127, 24362, 24273, 24321, 24434, 24503, 24582, 24689, 24773, 24777, 24751, 24751, 24821, 25005, 25218, 25379, 25471, 25440, 25275, 25041, 24823, 24680, 24717, 24951, 25323, 25739, 26158, 26542, 26849, 27053, 27232, 27370, 27475, 27548, 27605, 27633, 27643, 27646, 27639, 27650, 27740, 27946, 28026, 27963, 28027, 28134, 28238, 28397, 28595, 28562, 28520, 28574, 28648, 28726, 28693, 28681, 28754, 28948, 29245, 29307]
11610B9307l07l96k4Q2j42j63K5Q1Kj37l7L6P7Ok3P7P%R5l23l19r3k9K8O4k11j98j60
11401B7325j50j03j80k26j83m28l63k38n01j083j649j257j331l054l184j500k1J327K309
11260A5510J915J303J040Q52P90M71L29L22K39J60J15J16J6j49j0k18k84o9j63j60j77
11104B1948m54n92l82p02o82m50m03m10m37n69o47o81o68o23r99q58n93r11j040r19o28
10947H300n93n06l60k40k59k84j60j61j58j27p0j01j56j21L0l1m5k8LRL1L9L6M5Q4P4
10754E251N6O6M6L0L8O2L0R3J59K00K68L44M03M44N19N54N27M95M53L64K67K35K18K09
10575A1331Q9J24K34K24K06K23K38K27J84J72J48J04R7R5J0n0Rj3l1j3j25j74j03j31
10396A3075k55m63l94m35o27p32p19p40r19o62m42l88l30k34j63j56j80j42q2L6J29K51
$$ y = [29307, 29000, 28604, 28580, 28662, 28520, 28357, 28382, 28463, 28465, 28328, 28291, 28327, 28404, 28410, 28387, 28464, 28471, 28471, 28566, 28243, 27924, 27831, 27802, 27830, 27894, 27683, 27485, 27325, 27175, 27072, 26892, 26666, 26483, 26055, 25692, 25454, 24953, 23870, 22221, 20964, 19633, 16579, 13395, 11895, 11874, 13201, 15510, 17425, 18728, 19768, 20620, 21410, 21881, 22210, 22532, 22771, 22931, 23046, 23162, 23178, 23029, 23019, 22801, 22517, 22448, 22285, 22125, 21948, 21494, 20902, 20520, 19818, 19136, 18686, 18283, 17873, 17436, 16867, 16220, 15539, 14871, 14248, 13249, 12391, 11798, 10887, 9847, 8928, 8300, 7707, 7201, 6841, 6601, 6342, 6058, 5898, 5737, 5579, 5452, 5382, 5281, 5125, 5004, 5034, 5003, 4958, 4930, 4933, 4942, 4973, 5012, 5048, 5093, 5177, 5251, 5307, 5373, 5419, 5449, 5487, 5549, 5579, 5672, 5831, 6031, 6299, 6643, 7046, 7490, 8009, 8563, 9090, 9585, 10038, 10402, 10669, 10904, 11122, 11331, 11420, 11544, 11778, 12002, 12208, 12431, 12669, 12896, 13080, 13252, 13400, 13504, 13601, 13696, 13706, 13656, 13665, 13652, 13621, 13608, 13483, 13309, 13206, 13075, 12820, 12357, 11963, 11528, 10901, 10169, 9450, 8710, 7791, 7129, 6687, 6299, 5969, 5735, 5572, 5416, 5236, 5094, 5012, 5048, 5177, 5428]
10232E428M07M69M45L81K62J47J15J59J91J92J64J22J48L17N12N09L88K95K53K76K86
10076A1466K46K27K15K10J99J97J66J79J86J74J57J89K02J45J12J22J26J05Q1J02R0L6
9912A4932J9J6MK3L5K2L1L3J8J0J6Ol6n0o5r5p9o2p0o4o8r6Tn9l9kM0O1J09K00K15J47
9674A5056Q8N3K1K0nm6k0J5L6L4J6K1L1nTKj7j8n9j16j28j40j76k08k05j29m4j8m1o9
9450A3944p6r1o5l1j2j6j7j0lj8m7q6j13r8m6j2k6l7n4q8r0m3Tn1j0Mqj0m3o6q0r8r2
9205A2368n0jN3J16J30J00O6M2L3%n4p7p6q1j03j07j28j58j93j86j21MJ09J76K12J73
9011A2247J24P3Mn8p8l8K4L8Nj9k7n1o3n9q9r4p5j10j29j56j82k13k31k30Tk17j57j25
8802I884j37r8q4j16j12r5o1l1rj2k1OK3K7J4JQN0O8J03J41J48J36J29R6J10J54J84J69
$$ y = [5428, 5835, 6304, 6749, 7130, 7392, 7539, 7654, 7813, 8004, 8196, 8360, 8482, 8630, 8947, 9459, 9968, 10356, 10651, 10904, 11180, 11466, 11712, 11939, 12154, 12364, 12563, 12760, 12926, 13105, 13291, 13465, 13622, 13811, 14013, 14158, 14270, 14392, 14518, 14623, 14704, 14806, 14896, 14932, 14951, 14967, 14971, 14994, 15029, 15051, 15082, 15115, 15133, 15143, 15159, 15165, 15129, 15079, 15014, 14919, 14840, 14778, 14708, 14644, 14576, 14480, 14384, 14325, 14286, 14284, 14324, 14385, 14494, 14694, 14909, 15056, 15144, 15197, 15218, 15238, 15233, 15187, 15167, 15182, 15218, 15252, 15268, 15289, 15320, 15315, 15310, 15312, 15295, 15277, 15218, 15102, 14974, 14834, 14658, 14450, 14245, 14116, 14072, 14054, 14013, 13944, 13868, 13777, 13712, 13681, 13669, 13653, 13636, 13626, 13623, 13605, 13558, 13472, 13359, 13261, 13215, 13203, 13177, 13140, 13086, 12998, 12908, 12865, 12822, 12771, 12761, 12765, 12757, 12747, 12704, 12638, 12558, 12460, 12368, 12318, 12317, 12370, 12486, 12616, 12716, 12782, 12824, 12857, 12857, 12803, 12726, 12650, 12569, 12466, 12359, 12231, 12073, 11880, 11694, 11573, 11577, 11686, 11862, 12074, 12247, 12371, 12444, 12448, 12390, 12312, 12274, 12298, 12336, 12341, 12322, 12295, 12244, 12181, 12122, 12033, 11939, 11864, 11754, 11625, 11469, 11287, 11074, 10843, 10613, 10383, 10166, 10009, 9884, 9747, 9649, 9565, 9449, 9337, 9242, 9181, 9150, 9141, 9129, 9108, 9114, 9137, 9164, 9178, 9179, 9187, 9237, 9305, 9408, 9549, 9697, 9833, 9962, 10058, 10168, 10322, 10506, 10675]
8586A0675J38J27J47J38J17J44J55J47J31J04Q3M0Nnl3m7k5kJ2Kn4p8q2j24j72j91j83
8385A1169j75j60j65j85j90j95j79j44j35j09r9j06j44j87j97j23M1J91K31K15J80J61
8222I695J32J41R4K7L0OJ%o5q5q9o7J1N2M1J7k3k7m8j34j62j72j41r9J7J42J98J52R7
8006I741M3K0rm2l6o0n8l0n2o1l3k4j7Ojk3l5l9q2q8n0j6N4P1J05J00Q4Q3J12J01N0j4
7767I800l7k1N1Q5N1K9L5Qk4pL9N4N0P8P7M9L7J0p9j50j86k19j17R4J58J61J51J41J74
7551A0492K08K05K11K05J77J80J90J66J22R4Q9N4Rkj8l3j08j44j87k44l04l24l36l44
7373A0358l48k83k05r8K5J22J96K72L46L26K99K73K57K49K39J88J53J64K05J63J52K57
7209A3310L31L20L00K79K50J92J36R0N0L7K6M1Q2Q5Q9Q6R3N9L0L8M8J5L9Q3J2M4M2OK2
$$ y = [10675, 10813, 10940, 11087, 11225, 11342, 11486, 11641, 11788, 11919, 12023, 12106, 12146, 12151, 12146, 12113, 12066, 12041, 12039, 12051, 12053, 11999, 11921, 11839, 11715, 11543, 11352, 11169, 10994, 10834, 10669, 10484, 10294, 10099, 9920, 9776, 9641, 9532, 9433, 9327, 9183, 8996, 8799, 8676, 8717, 8908, 9139, 9354, 9534, 9695, 9827, 9968, 10062, 10089, 10119, 10125, 10126, 10126, 10061, 9976, 9887, 9820, 9831, 9883, 9924, 9941, 9918, 9891, 9843, 9709, 9547, 9375, 9234, 9135, 9152, 9294, 9492, 9644, 9741, 9784, 9804, 9795, 9753, 9717, 9657, 9599, 9569, 9517, 9456, 9423, 9399, 9382, 9388, 9387, 9364, 9329, 9290, 9208, 9120, 9070, 9054, 9108, 9179, 9284, 9384, 9468, 9551, 9663, 9764, 9814, 9800, 9763, 9742, 9793, 9878, 9929, 9958, 9993, 10001, 9977, 9970, 10009, 10063, 10113, 10191, 10268, 10317, 10354, 10364, 10285, 10135, 9949, 9730, 9613, 9707, 9865, 10026, 10177, 10318, 10492, 10700, 10905, 11116, 11321, 11498, 11678, 11868, 12034, 12156, 12250, 12339, 12393, 12402, 12400, 12382, 12349, 12241, 12097, 11910, 11666, 11362, 11038, 10702, 10358, 10010, 9727, 9522, 9424, 9449, 9571, 9767, 10039, 10385, 10711, 11010, 11283, 11540, 11789, 12028, 12216, 12369, 12533, 12738, 12901, 13053, 13310, 13641, 13961, 14261, 14540, 14790, 14982, 15118, 15208, 15258, 15295, 15321, 15362, 15444, 15529, 15618, 15704, 15797, 15856, 15886, 15924, 15972, 15987, 16026, 16109, 16121, 16165, 16207, 16213, 16235]
6993A6235K4K1L6M3K9J7pl1j06k14k16k11k31j57p5q7j40j30r2k3n2j31j38j32o2P5J59
6792A4404J71J10Q2O0J2l7r1j36j70j98k71l50l97m33m88n22n86o28n45m54m40l66k64
6620H463j87j57l6J05J85K17J78M4j8jN1J56K78M19O38Q50R96J061J006Q32O80N49M29
6449A6738L62L07K77K28J26N8R2Q6M3N5J10R8P7N5J0n0j03k35l30l52m21l80k41j07q7
6263A6416j12r4j40l04l65l53l83l39k76k22r9r3j34q8m4p3k16l12l55m21m33m76n45
6092A0539m62k63O6M95Q41R72J038R79Q52P56O94N51M07K42R1OJ5L0Q3J64K22L31M34
5920A9083M59M18L57K88J69J09J52J73L25L45K55J94J25po6j40k16j63j51j33o9l3M7
5749B1521M6l3j5Jl8o0p8n8m8j24j58K5J99J37O0K3pk0k4j04k11k64k05k23k38r0J26
$$ y = [16235, 16259, 16280, 16316, 16359, 16388, 16405, 16398, 16367, 16261, 16047, 15831, 15620, 15389, 15232, 15157, 15070, 14930, 14800, 14708, 14685, 14633, 14502, 14364, 14232, 14170, 14245, 14404, 14575, 14685, 14767, 14827, 14839, 14802, 14711, 14575, 14405, 14207, 13936, 13586, 13189, 12756, 12268, 11746, 11160, 10532, 9987, 9533, 9093, 8727, 8463, 8276, 8119, 8083, 8188, 8373, 8590, 8768, 8812, 8794, 8793, 8844, 9000, 9278, 9697, 10335, 11185, 12181, 13242, 14248, 15080, 15760, 16309, 16738, 17100, 17407, 17684, 17912, 18038, 18096, 18188, 18274, 18317, 18372, 18482, 18580, 18657, 18712, 18722, 18672, 18569, 18334, 18004, 17652, 17231, 16851, 16610, 16503, 16416, 16304, 16210, 16070, 15766, 15401, 15048, 14665, 14326, 14050, 13828, 13729, 13636, 13502, 13414, 13370, 13297, 13081, 12769, 12414, 11993, 11560, 11084, 10539, 10077, 9814, 9880, 10375, 11216, 12188, 13226, 14205, 15057, 15813, 16507, 17058, 17465, 17707, 17798, 17804, 17819, 17849, 17932, 18096, 18318, 18649, 19083, 19542, 19960, 20317, 20605, 20774, 20883, 21035, 21208, 21533, 21878, 22133, 22327, 22452, 22445, 22379, 22239, 22023, 21860, 21709, 21576, 21507, 21474, 21521, 21567, 21534, 21519, 21520, 21482, 21422, 21344, 21286, 21238, 21114, 20956, 20981, 21180, 21317, 21377, 21400, 21393, 21373, 21349, 21245, 21034, 20770, 20565, 20342, 20104, 20014, 20140]
5548B0140J62L3M8P3K4O7M8pok0m8TK5k8p1m2O6J51O9o2l00o02n20L32J215J179P21M24
5340B3023K50J12Q0M2kl1L7Qj28q3n4p5o3p3j7m4r5lj0p3j15l5j6p2p6p0p3j21j62j32
5116B1929j30k04j82q4q5j05p3j67o3k2j36j32j93k49j86j51P4L30J70k18M4N8R4K2q3
4930B0258o8l6j13j67n6Tj38j31j69j57j27j57j42j54q4p4j48k40j79j77j67j16k28l31
4751A6843k58l05l22p9K3j0l3k8j08j50r2j16j98j84j92j77j98j48j57j18l9j50j96q7
4572A3521j80k02r0o6j53k26k01k3r5k57k35j63j01j38j62p9j35k47j28j03q0j17k46
4401A0094j91n4p1o5j37j72j17j18j65r6Tk03j38j37k03k10r6r0j41j30o3p5j30k40j54
4215F802j44j11n0q8j03o0j00k7p1j77j34m0j10r6l6n4q2j10p7j12q0r0l4nq2o2L7o7
$$ y = [20140, 20302, 20335, 20383, 20456, 20480, 20547, 20595, 20588, 20582, 20562, 20514, 20466, 20491, 20463, 20392, 20350, 20416, 20567, 20636, 20574, 20274, 19672, 19152, 19484, 20699, 21878, 22599, 23023, 23273, 23385, 23465, 23507, 23505, 23474, 23511, 23519, 23391, 23308, 23254, 23179, 23116, 23043, 23026, 22982, 22887, 22884, 22874, 22801, 22686, 22651, 22635, 22563, 22487, 22417, 22344, 22223, 22061, 21929, 21799, 21595, 21413, 21329, 21244, 21139, 21066, 20899, 20836, 20814, 20678, 20546, 20353, 20104, 19918, 19767, 19841, 20171, 20341, 20123, 20167, 20225, 20319, 20341, 20258, 20190, 20154, 20041, 19874, 19818, 19762, 19624, 19493, 19324, 19167, 19040, 18883, 18741, 18587, 18503, 18429, 18281, 18041, 17862, 17685, 17518, 17402, 17174, 16843, 16585, 16280, 15958, 15879, 15902, 15892, 15859, 15831, 15723, 15573, 15481, 15365, 15167, 14983, 14791, 14614, 14416, 14268, 14111, 13993, 13954, 13804, 13608, 13521, 13341, 13139, 13049, 12983, 12830, 12604, 12403, 12380, 12285, 12028, 11793, 11630, 11529, 11391, 11229, 11150, 11015, 10768, 10640, 10537, 10457, 10340, 10094, 9903, 9849, 9778, 9713, 9576, 9404, 9287, 9169, 9004, 8908, 8812, 8609, 8471, 8334, 8131, 7921, 7825, 7735, 7594, 7464, 7401, 7326, 7196, 6956, 6802, 6658, 6547, 6497, 6409, 6306, 6246, 6146, 6119, 6048, 5871, 5737, 5697, 5587, 5491, 5455, 5401, 5319, 5209, 5132, 5020, 4940, 4850, 4816, 4811, 4729, 4667, 4704, 4637]
4007D637j02j36k2K8n4n0J9l8L1K7q1j01j20k8OK3O5j04j57M9M2nj21l1q8r8R8J93q6
3791C796k03PK46%q1N9q7j23K4K0Qkq8o6M0Q3r4n8K2J22Nj03j15J2L6J27j10p5R8O0l5
3560C525l2j9L8M7M9k6q5o0j15j9Q0k0jJ19M0Lr3J62J69q2o8J50j88j82O7j3TJ71
3351C604
$$ y = [4637, 4535, 4399, 4377, 4405, 4351, 4301, 4320, 4282, 4313, 4340, 4259, 4158, 4038, 4010, 4016, 4039, 4104, 4000, 3843, 3892, 3934, 3929, 3808, 3777, 3689, 3591, 3689, 3882, 3796, 3593, 3600, 3846, 3846, 3765, 3824, 3737, 3614, 3638, 3658, 3666, 3664, 3576, 3510, 3550, 3633, 3539, 3481, 3503, 3625, 3630, 3527, 3412, 3424, 3460, 3587, 3477, 3402, 3500, 3560, 3525, 3493, 3474, 3512, 3559, 3608, 3582, 3497, 3437, 3322, 3303, 3383, 3363, 3362, 3481, 3521, 3524, 3431, 3593, 3762, 3680, 3612, 3762, 3574, 3392, 3459, 3446, 3433, 3604]
##END=
