##TITLE=  Indene
$$ FILE TDIL2.JDX (derived from TFIR2.DX)
$$ interpolated from deltax = 1.0 to deltax = 0.96427
$$  TRANSMITTANCE
$$   DIFDUP FORM
$$    INCREASING ABSCISSA
$$     LASER DEFINED ABSCISSA INTERVALS
##JCAMP-DX= 4.24    $$ Encoded by INTTODX 1.04 (RS McDonald)
##DATA TYPE= INFRARED SPECTRUM
##ORIGIN= JCAMP-DX Test Disk 1.04
          R.S.McDonald, 9 Woodside Dr., Burnt Hills, NY 12027,
          TEL 518-399-5145, FAX 518-399-6868, EMail RMCDJCAMP@aol.com
##OWNER= Public Domain
##RESOLUTION= 2.0
##DELTAX= 0.96427
##XUNITS= 1/CM
##YUNITS= TRANSMITTANCE
##XFACTOR= 1.0000
##YFACTOR= 0.010
##FIRSTX= 400.172
##LASTX= 3999.792
##NPOINTS= 3734
##FIRSTY= 44.97
##MAXY= 80
##MINY= 0.5
##$ASDF FORM= DIFDUP
##XYDATA=  (X++(Y..Y))
400.172D497J36R1O8M7J1m1j16k16k99l56m00m45m84m99m75m14l47k71j81p6N3J90
421.386D73L21M39N37O07O40O12N39M48L66K98K35J73J20Q6O0M7L6K9L6N8Q2J02J13
443.564F457J16J12J03Q9P8O6N7N1M6M0L2K7K4TK2J7J4UJ5J2J1J2J5K1K4K7K6K4J9J5
473.457G624J2J0TJ2J4J1ROPLJknonkKQJ1J5J7TJ8J5J4J2J3J4J5TJ3TJ0RPOKjmoprj2
514.920G906j7k1k7Tk5k0j0kPJ0Pjj1k1l8o7r2r8q1m8rJ9L2K0l1o9r7j50k44l71n41
544.813E883p27q84r67r33p68m61n3L64P13R44J016R37P56N60M04K81J84J28J00P5N2
565.062G604M5L4K5K4K1J9J8J5J3QMJmrj7k9m0n4p8j06j42j96k58l09l32l15k43j11
592.062E588N8J98K94L32L22K73K06J51J15Q6O2M6L5K3Rpk3l0k6j5lPJ1Olj3j5j4qL
$$ y = [4497, 4633, 4724, 4792, 4839, 4850, 4809, 4693, 4477, 4178, 3822, 3422, 2977, 2493, 1994, 1519, 1105, 758, 487, 306, 230, 283, 473, 794, 1233, 1770, 2377, 3017, 3629, 4168, 4616, 4982, 5280, 5515, 5688, 5808, 5894, 5954, 6001, 6037, 6066, 6102, 6160, 6242, 6344, 6457, 6573, 6685, 6788, 6877, 6955, 7021, 7078, 7129, 7175, 7215, 7247, 7274, 7298, 7322, 7344, 7361, 7375, 7389, 7403, 7418, 7430, 7441, 7453, 7468, 7489, 7513, 7540, 7566, 7590, 7609, 7624, 7636, 7646, 7656, 7668, 7682, 7693, 7702, 7708, 7715, 7718, 7719, 7717, 7712, 7706, 7701, 7699, 7701, 7709, 7720, 7735, 7752, 7769, 7787, 7802, 7816, 7828, 7841, 7855, 7870, 7885, 7898, 7911, 7921, 7930, 7937, 7943, 7945, 7944, 7940, 7934, 7927, 7918, 7906, 7889, 7868, 7841, 7814, 7789, 7769, 7759, 7757, 7764, 7774, 7781, 7780, 7769, 7748, 7710, 7643, 7551, 7453, 7372, 7324, 7315, 7334, 7366, 7386, 7355, 7286, 7189, 7039, 6795, 6424, 5883, 5156, 4272, 3305, 2372, 1604, 1143, 1090, 1454, 2167, 3111, 4127, 5064, 5820, 6380, 6784, 7065, 7249, 7377, 7477, 7552, 7604, 7649, 7683, 7708, 7732, 7753, 7772, 7790, 7805, 7818, 7826, 7830, 7831, 7827, 7818, 7801, 7772, 7732, 7678, 7600, 7494, 7352, 7156, 6898, 6589, 6257, 5942, 5699, 5588, 5646, 5844, 6138, 6470, 6792, 7065, 7271, 7422, 7537, 7623, 7685, 7731, 7766, 7789, 7798, 7791, 7768, 7738, 7712, 7697, 7694, 7701, 7712, 7718, 7715, 7702, 7687, 7673, 7665, 7668]
620.990G668J2J7J4J5J7J6TJ3J2QOLkoqj1j0rqrj1j7k3k9l6m2m8m9l8k7j4kNRPKoj2
657.632G423j3j1qj0j4j5j0qj9m1o1p0p5p7q2r4j05j29j55j84k26k78l39m13m94n71
682.703C921o26o47o29n65m58l38k36j57j00m9nJ9L5O2J06J78K56L18L62L84L81L44
703.917B556K76J69N4n6j62k67l71m45m59m17l45k54j61q9l7J1P2J53K56L74M82M79
725.131A819L54J77K6p5o5Q5L12M53M42L35K21J08%p9j34j85k45k99l38l59l53l16
746.345A884k57j84j11m9j0Mqm3q5j34j78k03k00j67j23q4n0k2lML%mlJ3M4Q9J54K41
774.309E18L41M24M71M77M60M26L81L25K75K35K10J94J89J80J72J65J57J47J38J25
793.594F010J14J01Q9P5O2M9M0L1K6K1J7J4NJ%JMPRJ7K6L3K9K1J3Nnk1m5q1j18j64
$$ y = [7668, 7680, 7697, 7711, 7726, 7743, 7759, 7775, 7788, 7800, 7808, 7814, 7817, 7815, 7809, 7801, 7790, 7780, 7771, 7763, 7754, 7743, 7726, 7703, 7674, 7638, 7596, 7548, 7499, 7461, 7434, 7420, 7418, 7423, 7432, 7439, 7441, 7435, 7423, 7410, 7399, 7391, 7381, 7367, 7352, 7342, 7334, 7315, 7274, 7213, 7143, 7068, 6991, 6909, 6815, 6710, 6581, 6426, 6242, 6016, 5738, 5399, 4986, 4492, 3921, 3295, 2648, 2019, 1454, 996, 658, 422, 265, 165, 116, 111, 130, 165, 227, 333, 511, 767, 1085, 1447, 1831, 2212, 2556, 2832, 3001, 3055, 2999, 2837, 2570, 2199, 1754, 1295, 878, 533, 279, 118, 29, -8, 3, 75, 228, 484, 858, 1340, 1819, 2173, 2350, 2376, 2301, 2236, 2321, 2633, 3086, 3528, 3863, 4084, 4192, 4192, 4113, 3979, 3794, 3549, 3250, 2912, 2553, 2200, 1884, 1627, 1443, 1332, 1283, 1273, 1277, 1269, 1226, 1141, 1007, 829, 626, 426, 259, 136, 52, 2, -20, -23, -19, -16, -16, -20, -23, -10, 34, 123, 277, 518, 859, 1283, 1754, 2231, 2691, 3117, 3498, 3823, 4098, 4333, 4543, 4737, 4926, 5106, 5278, 5443, 5600, 5747, 5885, 6010, 6124, 6225, 6314, 6389, 6451, 6500, 6540, 6571, 6597, 6618, 6635, 6649, 6654, 6655, 6655, 6656, 6660, 6667, 6676, 6693, 6719, 6752, 6781, 6802, 6815, 6820, 6815, 6794, 6749, 6668, 6550, 6386]
824.451F386k28l04l56l53k94j78k1J42K62L12L04K59J96J32R1P7O4M5K7J7Rkj9m4o6
848.558F458q8j11j31j63k02k38k84l74m94n81n85m95k79N2M34O90P66P04N82M32K85
868.807F378J84J37J07P8N8M9L9L0K1RKoj1j7k4l0l6m4n0o3p1p6p2o7o3To0n9n6m4l2
898.700F148k4k9n3r3j55k34l12l88m72n64o37o72o42n53m24k60p0J34L26M66N56N72
919.914B620N07L86K45J20L0j9l2j9LKqk8p1j34k07k86l53m00m13l83l16k37j47o9l6
944.020G55k5j0M1J38K71M36N89O81P00O56N66M51L37K50J88J37R6O5M3K2Mrk2l1l6T
969.091F257l4k4j2MK2M0N6O8P1O9O6O3N8N1M2L3K8K6K3J5J0TJ3J7J4QLJkpj6k3k5k7
1001.877F898l3n1o9q3r7j04j12j30j58j88k60m04n76p13p77p17m57jM83P83Q66P75
$$ y = [6386, 6158, 5854, 5498, 5145, 4851, 4673, 4652, 4794, 5056, 5368, 5672, 5931, 6127, 6259, 6350, 6427, 6491, 6536, 6563, 6580, 6589, 6587, 6568, 6524, 6458, 6370, 6259, 6128, 5965, 5763, 5525, 5241, 4867, 4373, 3792, 3207, 2712, 2433, 2485, 2919, 3609, 4375, 5079, 5661, 6093, 6378, 6562, 6699, 6806, 6884, 6942, 6991, 7030, 7060, 7081, 7090, 7092, 7086, 7075, 7058, 7034, 7004, 6968, 6924, 6874, 6811, 6740, 6664, 6592, 6525, 6462, 6399, 6339, 6280, 6224, 6180, 6148, 6124, 6095, 6042, 5949, 5794, 5560, 5248, 4860, 4388, 3824, 3187, 2515, 1873, 1320, 896, 636, 566, 700, 1026, 1492, 2048, 2620, 3127, 3513, 3758, 3878, 3908, 3889, 3857, 3838, 3841, 3843, 3835, 3807, 3736, 3602, 3395, 3109, 2756, 2356, 1943, 1560, 1244, 1007, 860, 791, 755, 730, 720, 761, 899, 1170, 1606, 2195, 2876, 3576, 4232, 4798, 5249, 5586, 5836, 6024, 6161, 6257, 6322, 6365, 6387, 6391, 6382, 6360, 6329, 6293, 6257, 6223, 6199, 6187, 6191, 6213, 6253, 6309, 6377, 6448, 6517, 6583, 6646, 6704, 6755, 6797, 6830, 6858, 6884, 6907, 6922, 6932, 6942, 6955, 6972, 6986, 6994, 6997, 6998, 6996, 6989, 6973, 6950, 6925, 6898, 6865, 6814, 6745, 6662, 6565, 6461, 6349, 6219, 6061, 5873, 5613, 5209, 4633, 3920, 3143, 2426, 1969, 1968, 2451, 3234, 4100, 4875]
1023.090D875N93L54J29nn3o7m9J4J01J79K25K17J75J29Q9N0J6j0k4k7k3j9j5j0%QJ5
1049.126F867J2QOMLok3l4n1p6j07j48k23l23m22n00n29m70k87rK61M39N15M96M09
1073.233E812K87J85J33J06P7N5M9M7M0L7K2J4J2J5J2%j3j8j9j7k3l5m3m9o4r8j44
1099.268F380j93k31k47k25j66q4lO1R9R8O5K3j4n1q9j28j84k51l23l87m24m12l31
1121.446B983j85j2J47K81L77M37M53M27L83L19K46J75J20Q0N4L7J8QMkoj3k3k7k9l6
1146.517F216n3p4r0r9r6q7p4n0j7QK4J9j0n9j04j76k83l68l43k01NK09L78M45L82
1170.624E502K33R4K5J6M5J03J64J91J81J53J12O9L7K8K4J1nr%QNj5l2l8m6n3p6j24
1197.623F603j90k67l84n53o88o71m72j59J78M77O46O25M44K56J31N0k6q2j21j65k23
$$ y = [4875, 5468, 5822, 5951, 5946, 5893, 5826, 5777, 5791, 5892, 6071, 6296, 6513, 6688, 6817, 6906, 6956, 6972, 6962, 6938, 6911, 6888, 6869, 6854, 6844, 6844, 6852, 6867, 6879, 6887, 6893, 6897, 6900, 6894, 6871, 6837, 6786, 6710, 6603, 6455, 6232, 5909, 5487, 4987, 4458, 3988, 3701, 3692, 3953, 4392, 4907, 5403, 5812, 6099, 6284, 6417, 6523, 6600, 6655, 6704, 6751, 6791, 6828, 6850, 6864, 6876, 6891, 6903, 6903, 6890, 6872, 6853, 6836, 6813, 6778, 6735, 6686, 6622, 6524, 6380, 6187, 5956, 5709, 5484, 5318, 5234, 5231, 5292, 5391, 5489, 5554, 5577, 5563, 5512, 5423, 5295, 5111, 4860, 4537, 4150, 3726, 3314, 2983, 2798, 2786, 2933, 3214, 3591, 4028, 4481, 4908, 5291, 5610, 5856, 6031, 6151, 6231, 6285, 6322, 6340, 6348, 6352, 6350, 6344, 6331, 6308, 6281, 6252, 6216, 6163, 6089, 5999, 5900, 5804, 5717, 5643, 5593, 5576, 5584, 5608, 5627, 5617, 5558, 5454, 5278, 4995, 4627, 4284, 4083, 4088, 4297, 4675, 5120, 5502, 5735, 5829, 5854, 5870, 5915, 6018, 6182, 6373, 6554, 6707, 6819, 6888, 6925, 6953, 6977, 6988, 6983, 6974, 6974, 6982, 6987, 6972, 6940, 6902, 6856, 6803, 6727, 6603, 6413, 6146, 5762, 5209, 4521, 3850, 3378, 3219, 3397, 3874, 4520, 5145, 5589, 5845, 5976, 6026, 6000, 5918, 5797, 5632, 5409]
1217.873E409k81l29l79m30m53m29l56k16JK79N34O81P09O46N25L79K42J45Q6M2J0q
1239.087F807j2l2m5n9q8j40j98k31k30j80p2Q8K37L10K99K41J73J03L4k0n4q3j05
1261.265F743j01o9k3K1N5P2O9M8K5J5TJ0mj7Uj2j1k6n7r7j65k88m29n02m59l13p7
1288.265D389K10M55N34M51K98J76Q5Pm6p2q9j18j34j46j66j89k12k59l35m20m96n46
1309.479C377n28l92j34J63L98N38N67M96L48J94Q5J6m1p5r1j02j16j17j09r5p7n3k3
1331.657D229J2N1Q9J25J57J82K00K04J87J56J21Q9O0L9J9ROlj2m0q3j26j74k48l45
1355.764D904m38n02n17m60l15r9J22K97M08M48M21L47K61J87J20N4%l9p4j11j35j70
1376.978D709k02k38k82l26l66m01m25m34m20l80l20k58j99j45r8m4KL6Q1J54K67L91
$$ y = [5409, 5128, 4799, 4420, 3990, 3537, 3108, 2752, 2536, 2537, 2816, 3350, 4031, 4740, 5386, 5911, 6290, 6532, 6677, 6763, 6805, 6815, 6807, 6795, 6763, 6718, 6659, 6571, 6431, 6233, 6002, 5772, 5592, 5520, 5608, 5845, 6155, 6454, 6695, 6868, 6971, 7005, 6985, 6931, 6848, 6743, 6642, 6573, 6550, 6571, 6626, 6698, 6767, 6815, 6840, 6855, 6870, 6880, 6876, 6859, 6842, 6825, 6813, 6802, 6776, 6719, 6622, 6457, 6169, 5740, 5238, 4779, 4466, 4389, 4599, 5054, 5588, 6039, 6337, 6513, 6598, 6605, 6559, 6487, 6398, 6280, 6146, 6000, 5834, 5645, 5433, 5174, 4839, 4419, 3923, 3377, 2849, 2457, 2323, 2486, 2884, 3422, 3989, 4485, 4833, 5027, 5112, 5128, 5087, 5012, 4921, 4819, 4703, 4586, 4477, 4382, 4305, 4252, 4229, 4241, 4292, 4381, 4506, 4663, 4845, 5045, 5249, 5436, 5592, 5713, 5802, 5862, 5901, 5920, 5929, 5935, 5932, 5920, 5880, 5797, 5671, 5497, 5249, 4904, 4466, 3964, 3447, 2987, 2672, 2573, 2695, 2992, 3400, 3848, 4269, 4616, 4877, 5064, 5184, 5238, 5238, 5199, 5125, 5014, 4879, 4709, 4507, 4269, 3987, 3661, 3295, 2894, 2469, 2035, 1615, 1235, 915, 657, 458, 313, 215, 171, 173, 209, 290, 444, 711, 1102]
1398.191A102M81N35N46N25M72M02L29K63K05J59J30J11R7Q8P5O3N9TO2O4TO0N6M6L3
1422.298F086J9Pkoj3k3l4l9m3m7n1n6o1o9p6p7q1q7r8j23j57k05k59l11l60l96m17
1448.334C021m20m11l92l63l36l07k65k01j16m5J8P2J18J67J96K05K13K28K62L07L54
1468.583B305L95M18M14L82L35K78K16J61J17Q3N6M0M2N4P3R6J18J24J16R3P3O2N7N8
1491.726F166O2P1Q1R0R4R7R2Q2O7N2M0L0K6K5K6K5K3J8J4QOTPRQRTPNlj1j6k2k5k9
1525.475G149l6m4n1n9o7p3p5p0n9m3k4oJ1J9K1J5kk8o2j07j57k03k39k62k56k11j31
1551.510D950k5R3K04K77K91K53J85J09L6j4l3m0n0o5p2p5q1q8r4Tq0n8l6k4j0MK1L2
1578.510E516L3K6J3kj9l8n6n3k3K4O3Q0Q2P3N6L1Jk9n2p1q6r6j16j41j70k14k82l62
$$ y = [1102, 1583, 2118, 2664, 3189, 3661, 4063, 4392, 4655, 4860, 5019, 5149, 5260, 5357, 5445, 5520, 5583, 5642, 5701, 5763, 5827, 5891, 5951, 6007, 6053, 6086, 6105, 6112, 6110, 6104, 6091, 6068, 6034, 5995, 5952, 5905, 5854, 5798, 5737, 5668, 5592, 5515, 5434, 5347, 5249, 5126, 4969, 4764, 4505, 4194, 3834, 3438, 3021, 2601, 2190, 1798, 1435, 1099, 792, 527, 326, 210, 165, 183, 255, 373, 540, 736, 941, 1154, 1382, 1644, 1951, 2305, 2700, 3118, 3532, 3914, 4249, 4527, 4743, 4904, 5021, 5104, 5160, 5200, 5242, 5296, 5369, 5465, 5583, 5707, 5823, 5916, 5989, 6051, 6108, 6166, 6228, 6299, 6380, 6470, 6564, 6661, 6753, 6835, 6902, 6954, 6994, 7024, 7050, 7075, 7101, 7126, 7149, 7167, 7181, 7189, 7195, 7201, 7208, 7217, 7225, 7234, 7243, 7250, 7255, 7252, 7241, 7225, 7203, 7178, 7149, 7113, 7069, 7018, 6959, 6892, 6819, 6744, 6674, 6615, 6572, 6548, 6542, 6553, 6572, 6593, 6608, 6606, 6578, 6516, 6409, 6252, 6049, 5810, 5548, 5292, 5081, 4950, 4925, 5018, 5222, 5499, 5790, 6043, 6228, 6337, 6373, 6359, 6326, 6286, 6236, 6171, 6099, 6024, 5943, 5855, 5761, 5667, 5587, 5529, 5493, 5469, 5459, 5463, 5484, 5516, 5549, 5575, 5588, 5586, 5567, 5529, 5473, 5420, 5397, 5421, 5484, 5564, 5646, 5719, 5775, 5806, 5807, 5778, 5726, 5655, 5569, 5473, 5357, 5216, 5046, 4832, 4550, 4188]
1605.510D188m18m21l61k35n3J40K68K98K61J97J30P0K7J8TK3L4M7N8P1Q2R5J00J06
1628.652D743J05J02J00R8R9TJ00TR8TR7R6R8J00TJ04J02R5Q1O8O0N2L9K2Kj4k7l7m5
1656.616F735m8m5l5k4j2lRJ9K8L1K9K0J1Kj1k7m2o3q2r8j09j10j06r8q5o8m7k5rLJ1
1686.508E751J4J0Lqj8k3j8j2plLQPJj6l6n2o6q1r6j07j08r5p9p0n6l3KM4Q8J31J61
1717.365E239J75J74J63J50J34J23J14J09R5P4N7L6J2j0l8p4j19j71k09k23k22k16
1738.579E373k00j58q2J2J01J73K22K45TK25J99J72J41J10Q3O6N2M2L4K2J6J5J3Qmj4
1763.650G111j9k0k1k4k5k1j8j6j7k2k6k5k7k9l3l8m1m2m3Ul9l5l2k8Tl1l8m7n6o0n8
1794.506F066m9l3j3PK6M6O2P2P9Q0P7P0O1N2M0K9J5Lqj5k2k7l4l9m4m8n0Tm8m6l9k8
$$ y = [4188, 3770, 3349, 2988, 2753, 2700, 2840, 3108, 3406, 3667, 3864, 3994, 4064, 4091, 4109, 4127, 4150, 4184, 4231, 4289, 4360, 4442, 4537, 4637, 4743, 4848, 4950, 5050, 5148, 5247, 5346, 5446, 5546, 5644, 5742, 5839, 5935, 6033, 6133, 6233, 6337, 6439, 6534, 6615, 6683, 6743, 6795, 6834, 6856, 6858, 6844, 6817, 6780, 6735, 6687, 6642, 6607, 6583, 6571, 6568, 6577, 6596, 6624, 6655, 6684, 6704, 6715, 6717, 6706, 6679, 6637, 6574, 6492, 6394, 6285, 6175, 6069, 5971, 5886, 5818, 5771, 5746, 5737, 5740, 5751, 5765, 5775, 5778, 5770, 5752, 5729, 5711, 5699, 5692, 5689, 5692, 5700, 5707, 5708, 5692, 5656, 5604, 5538, 5457, 5361, 5254, 5146, 5051, 4972, 4902, 4846, 4813, 4815, 4859, 4947, 5078, 5239, 5414, 5588, 5751, 5901, 6035, 6158, 6272, 6381, 6476, 6550, 6607, 6643, 6655, 6645, 6607, 6533, 6414, 6243, 6034, 5811, 5589, 5373, 5173, 5015, 4933, 4945, 5046, 5219, 5441, 5686, 5931, 6156, 6355, 6527, 6668, 6778, 6861, 6927, 6979, 7021, 7055, 7077, 7093, 7108, 7121, 7129, 7125, 7111, 7092, 7072, 7051, 7027, 7002, 6981, 6963, 6947, 6930, 6908, 6882, 6857, 6830, 6801, 6768, 6730, 6689, 6647, 6604, 6561, 6518, 6479, 6444, 6412, 6384, 6356, 6325, 6287, 6240, 6184, 6124, 6066, 6017, 5984, 5971, 5978, 6004, 6050, 6112, 6184, 6263, 6343, 6420, 6490, 6551, 6603, 6643, 6672, 6687, 6690, 6682, 6667, 6645, 6618, 6584, 6545, 6501, 6453, 6403, 6353, 6305, 6259, 6220, 6192]
1825.363F192j6kJ4K9M3N1N4TN1M7M2L2K6K0J6J5J3RLmj3k3l2m1n3o1o8p1o9o3n2l6
1856.220F107j7KJ7K7L3L4L1K5K0J4J3J2J5K0K3K8K9TK5J5Lj1k3l4m4m7m5l7k4qQK2
1887.076F262L6M5N2N6N5N4N2M8M4L7L3K6K0J5RKpj7k8l8m8n7o3o6o2n5m2k8rJ0L1M6
1917.933F413N9O7P2TO8O2M9L8K6J3Jj0k4l3m3n0n5o0Tn8n5n1m4l5k4pPK1L6M9O1P1
1948.790F576P9Q4Q9R2TR0Q4P8P1O5O0N7N2M6L6K8K2J9J6J2QTONLJ%JLMTLONUMLTNTO
1989.289G841POTMLVKLJjlopqpTnmjKJ%jT%KLNOPLlj0j4j5j2p%QJ2J4J0Mlrj2j7k1k4
2038.467G761k6k5Tk1k0j8Tj9j7j2nKJ1J7K3K6K7K5K1J8J4RMK%JNJ1J4J8K1K0J8J4J1
2072.216G887POLJmnpqj0j3j5j8k0k2k4k3j7rJJ3K3K8K7K3K0J4RLknrj3j6j7j9Tj6T
$$ y = [6192, 6176, 6174, 6188, 6217, 6260, 6311, 6365, 6419, 6470, 6517, 6559, 6591, 6617, 6637, 6653, 6668, 6681, 6690, 6693, 6689, 6676, 6653, 6621, 6580, 6527, 6466, 6398, 6327, 6258, 6195, 6143, 6107, 6090, 6092, 6109, 6136, 6169, 6203, 6234, 6259, 6279, 6293, 6306, 6318, 6333, 6353, 6376, 6404, 6433, 6462, 6487, 6502, 6505, 6494, 6471, 6437, 6393, 6346, 6301, 6264, 6240, 6232, 6240, 6262, 6298, 6343, 6395, 6451, 6506, 6560, 6612, 6660, 6704, 6741, 6774, 6800, 6820, 6835, 6844, 6846, 6839, 6822, 6794, 6756, 6708, 6651, 6588, 6522, 6460, 6405, 6363, 6335, 6326, 6336, 6367, 6413, 6472, 6539, 6611, 6683, 6751, 6813, 6862, 6900, 6926, 6939, 6940, 6930, 6906, 6873, 6830, 6780, 6725, 6665, 6605, 6547, 6492, 6441, 6397, 6362, 6338, 6331, 6338, 6359, 6395, 6444, 6505, 6576, 6655, 6739, 6828, 6920, 7012, 7102, 7186, 7264, 7335, 7400, 7460, 7517, 7569, 7615, 7651, 7679, 7701, 7720, 7736, 7748, 7756, 7764, 7770, 7775, 7778, 7779, 7779, 7780, 7783, 7787, 7791, 7794, 7800, 7805, 7810, 7815, 7819, 7822, 7825, 7830, 7835, 7841, 7848, 7854, 7860, 7864, 7867, 7870, 7873, 7876, 7878, 7881, 7882, 7881, 7878, 7872, 7865, 7857, 7850, 7843, 7838, 7834, 7833, 7835, 7836, 7836, 7835, 7834, 7834, 7836, 7839, 7844, 7850, 7857, 7860, 7857, 7847, 7833, 7818, 7806, 7799, 7799, 7807, 7819, 7833, 7843, 7847, 7844, 7835, 7823, 7806, 7785, 7761, 7735, 7710, 7685, 7664, 7644, 7626, 7608, 7589, 7572, 7560, 7555, 7557, 7568, 7585, 7608, 7634, 7661, 7686, 7707, 7725, 7739, 7748, 7752, 7754, 7754, 7755, 7760, 7771, 7785, 7803, 7824, 7844, 7862, 7876, 7887, 7894, 7900, 7903, 7904, 7900, 7895, 7888, 7880, 7870, 7857, 7842, 7824, 7804, 7782, 7758, 7735, 7718, 7709, 7710, 7723, 7746, 7774, 7801, 7824, 7844, 7858, 7867, 7870, 7868, 7863, 7854, 7841, 7825, 7808, 7789, 7770, 7754, 7738]
2108.858G738j4j2qlKOJ0J2J4TJ2J0QTOTMJknj1j7k3k7Tk4j8rLJ1J7K0K1J7J4J0NJkT
2147.429G766jJOQJ1J0TPOL%mprj3j4j8k3k7l0l5l8m0l4k3rOJ8K6K5K1J6J0OTPJ0J5
2184.072G669J8J9J8TJ4J0QJ0TJ2J1J0QNMLKLMNTOMTJ%kmorj1j2j7k0k5k8l1l2l1k8
2222.642G625k6k7k9k8k3j5kJ2K5K8K5J5Nmj3j7k1k0j8j3pJQJ5J9UJ4ROJkmonmJOJ2
2260.249G581J6J7J8J4RMkqrqnKQJ4J6TJ3QNKJjklnoTpnoTnpqj2j5j9k4k9l7m6n2n8
2301.712G353o0n0k9mK2M0M9N1M3L2K3J7J1MJ%OJ2J9K3K6K7K5J7OlqpokJLNTONPJ2J6
2339.319G698K1K3TK2J7J2J1OPUNKJjkJTLNMULjoj0j3j2j0rokJTjnqpnjJNPRTQOLK%k
2389.461G838lU%TKJTjklnpUrUj1j0rponmTkVnoTqrTpmj%KJ%kpj1j7k0k1j9j2mOJ4J9
$$ y = [7738, 7724, 7712, 7704, 7701, 7703, 7709, 7719, 7731, 7745, 7759, 7771, 7781, 7789, 7797, 7803, 7809, 7813, 7814, 7812, 7807, 7796, 7779, 7756, 7729, 7702, 7678, 7660, 7651, 7654, 7665, 7682, 7702, 7723, 7740, 7754, 7764, 7769, 7770, 7768, 7766, 7765, 7766, 7772, 7780, 7791, 7801, 7811, 7818, 7824, 7827, 7827, 7823, 7816, 7807, 7794, 7780, 7762, 7739, 7712, 7682, 7647, 7609, 7569, 7535, 7512, 7503, 7509, 7527, 7553, 7578, 7599, 7615, 7625, 7631, 7637, 7644, 7654, 7669, 7687, 7706, 7724, 7742, 7756, 7766, 7774, 7784, 7794, 7806, 7817, 7827, 7835, 7840, 7844, 7847, 7849, 7852, 7856, 7861, 7866, 7872, 7876, 7880, 7881, 7881, 7879, 7875, 7869, 7860, 7849, 7837, 7820, 7800, 7775, 7747, 7716, 7684, 7653, 7625, 7599, 7572, 7543, 7515, 7492, 7477, 7475, 7487, 7512, 7540, 7565, 7580, 7585, 7581, 7568, 7551, 7530, 7510, 7492, 7479, 7472, 7473, 7481, 7496, 7515, 7534, 7553, 7567, 7576, 7582, 7583, 7581, 7577, 7571, 7566, 7562, 7563, 7569, 7581, 7597, 7614, 7632, 7646, 7655, 7659, 7657, 7649, 7640, 7632, 7627, 7629, 7637, 7651, 7667, 7683, 7696, 7704, 7709, 7711, 7712, 7711, 7709, 7706, 7701, 7695, 7689, 7682, 7677, 7671, 7665, 7660, 7653, 7645, 7633, 7618, 7599, 7575, 7546, 7509, 7463, 7411, 7353, 7293, 7243, 7214, 7210, 7232, 7272, 7321, 7372, 7415, 7447, 7470, 7487, 7498, 7502, 7503, 7503, 7509, 7521, 7540, 7563, 7589, 7616, 7641, 7658, 7664, 7661, 7653, 7646, 7640, 7638, 7639, 7642, 7647, 7652, 7658, 7663, 7670, 7682, 7698, 7719, 7742, 7765, 7787, 7804, 7816, 7827, 7833, 7840, 7847, 7854, 7859, 7861, 7862, 7861, 7859, 7860, 7861, 7864, 7869, 7873, 7877, 7881, 7884, 7883, 7877, 7867, 7854, 7842, 7832, 7823, 7817, 7815, 7816, 7817, 7816, 7811, 7803, 7796, 7791, 7790, 7791, 7796, 7803, 7812, 7821, 7829, 7835, 7838, 7840, 7840, 7838, 7835, 7832, 7829, 7829, 7829, 7831, 7832, 7833, 7832, 7830, 7827, 7822, 7815, 7808, 7801, 7792, 7783, 7774, 7763, 7753, 7744, 7737, 7731, 7726, 7722, 7718, 7716, 7714, 7712, 7710, 7705, 7699, 7693, 7685, 7676, 7667, 7660, 7656, 7655, 7655, 7657, 7658, 7658, 7656, 7649, 7638, 7621, 7601, 7580, 7561, 7549, 7545, 7551, 7565, 7584]
2442.496G584K1J7J3J0PUJ0J1J3J2TQN%mrj1j3j4Tj1omj%JMTOWPTQUPM%moj0j2j4Tj0
2489.745G668njLMVKLMNOTNTJ%npqrj0pn%KONTKkrj5j8j7j4p%PJ1J3TJ0PONTPRJ0RJ0
2539.887G727PLjlorTj1Uj0j1j2Tj1j2j0onjTLORJ2J3J5J4J1QNLJV%klmqj1j4j6j7j4
2584.244G599j2ql%Tmj1k1l0l7m4Tl8k1JK1L9N0N1M4L4K4J6J1OMTKJ%lnTpj1j4j5j3
2620.886G561oKJ3K2K8L0K9K7K0J6J2J0PMKJ%klorj1j3j4j5j3rm%J%Tnqj1j4j6j8j6
2658.492G592j0njLMJjpj2j7j9k0j7j4qjPJ3J8K1TK0J7J5J2RQTPTONLJT%jkj%VJT%UjU
2707.670G662lnpj0Tj2j0rplJOQJ0QRNLJlmTnoTqj0j1j4k0k5l3l8m1l6k7j6oJjrk3l4
2749.134G258m5m9n2n3n0Tn3n9p1q7j02j20j35j44j51j52j46j36j21j00p3l8NN0R2
$$ y = [7584, 7605, 7622, 7635, 7645, 7652, 7659, 7666, 7676, 7687, 7700, 7712, 7724, 7732, 7737, 7737, 7733, 7724, 7713, 7700, 7686, 7672, 7661, 7655, 7651, 7650, 7650, 7651, 7655, 7659, 7665, 7671, 7677, 7683, 7689, 7696, 7703, 7711, 7719, 7727, 7734, 7738, 7738, 7734, 7728, 7718, 7706, 7692, 7678, 7668, 7663, 7662, 7665, 7669, 7673, 7677, 7681, 7683, 7686, 7690, 7695, 7701, 7707, 7712, 7717, 7718, 7718, 7713, 7706, 7698, 7689, 7679, 7672, 7667, 7667, 7669, 7675, 7680, 7685, 7687, 7685, 7676, 7661, 7643, 7626, 7612, 7605, 7605, 7612, 7623, 7636, 7649, 7659, 7666, 7672, 7677, 7682, 7689, 7698, 7708, 7717, 7727, 7734, 7737, 7736, 7733, 7727, 7718, 7709, 7698, 7687, 7676, 7666, 7655, 7643, 7631, 7620, 7608, 7598, 7592, 7587, 7586, 7585, 7588, 7594, 7603, 7615, 7628, 7643, 7657, 7668, 7676, 7681, 7684, 7685, 7686, 7687, 7688, 7688, 7686, 7683, 7679, 7671, 7660, 7646, 7630, 7613, 7599, 7587, 7579, 7576, 7576, 7576, 7572, 7561, 7540, 7510, 7473, 7429, 7385, 7347, 7326, 7327, 7348, 7387, 7437, 7488, 7532, 7566, 7590, 7606, 7617, 7623, 7627, 7631, 7633, 7634, 7634, 7631, 7626, 7621, 7614, 7603, 7589, 7574, 7561, 7555, 7557, 7570, 7592, 7620, 7650, 7679, 7706, 7726, 7742, 7754, 7764, 7771, 7775, 7777, 7778, 7778, 7776, 7773, 7767, 7758, 7747, 7734, 7720, 7705, 7692, 7683, 7679, 7679, 7680, 7680, 7680, 7675, 7667, 7656, 7642, 7626, 7608, 7592, 7582, 7577, 7576, 7579, 7583, 7584, 7583, 7576, 7564, 7547, 7528, 7508, 7491, 7477, 7469, 7468, 7475, 7488, 7506, 7527, 7548, 7568, 7585, 7600, 7612, 7621, 7629, 7637, 7644, 7651, 7657, 7662, 7665, 7666, 7667, 7667, 7666, 7664, 7663, 7663, 7663, 7663, 7663, 7664, 7665, 7665, 7665, 7665, 7664, 7663, 7662, 7659, 7654, 7647, 7637, 7627, 7615, 7605, 7596, 7589, 7586, 7587, 7593, 7601, 7611, 7619, 7628, 7633, 7636, 7637, 7634, 7630, 7626, 7621, 7615, 7609, 7601, 7591, 7580, 7566, 7546, 7521, 7488, 7450, 7409, 7373, 7346, 7330, 7324, 7325, 7324, 7315, 7292, 7258, 7213, 7164, 7112, 7059, 7009, 6959, 6906, 6847, 6776, 6689, 6587, 6467, 6332, 6188, 6037, 5885, 5739, 5603, 5482, 5382, 5309, 5271, 5276, 5326, 5418]
2773.241E418J33J60J79J86J80J70J54J35J17R9Q3P0N7M5L6K9K5K1UK3UK0J7J3QOJmq
2803.133G461j3j7k2k8l0l2l1k5j9j1kLQJ1J0PMjnrj4j8k2k5k8l1l3l4l2Tk9k7Tl0l4
2836.882F843m0m6n2n4n6n7n5n1m9m5m0l8l6l5l4l5l6Tl9m0m2m3m6m7n1n2n6n9o4p1
2865.810E438p5q0q6r2r8j07j17j33j53j78k06k36k62k85l00l04k93k61k12j56r7m1
2887.024A666TL1N0O2P2P9Q8R0Q2O0L5J0j3k8l2k8j3RL6O6R6J27J57J83J97K02J95
2913.060C479J78J55J34J16J02R1P7O9N9N1M2L5K8K3K2K0J7J5J3TJ2J1PN%jpj2j3rL
2942.952D735J8L4M8N7N8N2M3L5K4J5PJmonmj%LNQJ2K2L5M9O3P2P7P6O9O0N0L9K9J8
2976.701E794J0Knj0j4j8k0k6l0l7m7n7p1q5r9j14j23j29j31j28j27j22j23j25j26
$$ y = [5418, 5551, 5711, 5890, 6076, 6256, 6426, 6580, 6715, 6832, 6931, 7014, 7084, 7141, 7186, 7222, 7251, 7276, 7297, 7318, 7339, 7362, 7385, 7408, 7428, 7445, 7458, 7466, 7472, 7473, 7469, 7461, 7448, 7431, 7409, 7381, 7351, 7319, 7288, 7263, 7244, 7233, 7231, 7234, 7242, 7253, 7263, 7270, 7274, 7273, 7268, 7259, 7245, 7227, 7205, 7180, 7152, 7121, 7088, 7054, 7022, 6990, 6961, 6934, 6907, 6877, 6843, 6803, 6757, 6705, 6651, 6595, 6538, 6483, 6432, 6383, 6338, 6298, 6260, 6224, 6189, 6155, 6120, 6084, 6048, 6009, 5969, 5927, 5884, 5838, 5791, 5740, 5688, 5632, 5573, 5509, 5438, 5363, 5283, 5197, 5105, 5007, 4900, 4783, 4650, 4497, 4319, 4113, 3877, 3615, 3330, 3030, 2726, 2433, 2172, 1960, 1804, 1707, 1666, 1666, 1697, 1747, 1809, 1881, 1960, 2048, 2138, 2220, 2280, 2315, 2325, 2312, 2284, 2252, 2224, 2211, 2220, 2256, 2322, 2418, 2545, 2702, 2885, 3082, 3284, 3479, 3657, 3812, 3946, 4062, 4164, 4255, 4332, 4401, 4460, 4511, 4553, 4588, 4616, 4639, 4661, 4681, 4698, 4713, 4726, 4739, 4751, 4762, 4769, 4774, 4774, 4773, 4766, 4754, 4741, 4732, 4735, 4753, 4787, 4835, 4892, 4950, 5002, 5045, 5080, 5104, 5119, 5126, 5127, 5123, 5117, 5112, 5108, 5107, 5107, 5110, 5115, 5123, 5135, 5157, 5192, 5241, 5304, 5376, 5453, 5529, 5598, 5658, 5708, 5747, 5776, 5794, 5804, 5806, 5801, 5791, 5777, 5759, 5739, 5713, 5683, 5646, 5599, 5542, 5471, 5386, 5287, 5173, 5050, 4921, 4790, 4662, 4535, 4413, 4290, 4165, 4039]
3000.808D039j29j32j36j45j58j75j96k19k37k44k34k07j59r9l5J1L9M2J7k0o0r1r7
3022.986A375p5k8L6J04J63J98K07J88J43Q2J6m3r0j21j39j41j29j08q2n4l4k0j3Tk5
3047.093A397m1n8p0p2o7n4l9k7k0k3l1m7n9o3o2n5m7l6k8k2j3jJ9M6Q1J15J44J64
3074.093A031J65J45J14P8N1M5O0J03J66K38L06L54L72L64L37K98K54K13J78J48J22
3094.342E142R8P9N5L5J5ql0n1p3r9j20j35j36j21p6rO8J40J94K22K21J95J62J27R8
3118.449E993P2N0L5K4J3Lmj4j9k6l3m4n8p3q5r4j02j01q7n9j6M1J05J63J95K05J93
3144.484F277J68J36J06Q0O4N0M1L4L1K5K3K0J8TJ5TJ4J3J2J1RPNL%k%JMQJ4J9K2K4
3177.270G285K3K1J9J6J2J1QPTNMLJTj%jJLNOTPTNTLKJ%kmnToTmjMJ0J4J6TJ7J5J2J0
$$ y = [4039, 3910, 3778, 3642, 3497, 3339, 3164, 2968, 2749, 2512, 2268, 2034, 1827, 1668, 1569, 1534, 1545, 1584, 1626, 1643, 1623, 1563, 1472, 1375, 1300, 1272, 1308, 1412, 1575, 1773, 1980, 2168, 2311, 2393, 2409, 2366, 2276, 2155, 2016, 1875, 1746, 1638, 1556, 1502, 1468, 1448, 1435, 1422, 1397, 1356, 1298, 1228, 1156, 1089, 1035, 996, 969, 949, 926, 895, 848, 789, 726, 664, 609, 562, 526, 498, 476, 463, 462, 481, 527, 608, 723, 867, 1031, 1196, 1341, 1455, 1533, 1584, 1629, 1689, 1792, 1958, 2196, 2502, 2856, 3228, 3592, 3929, 4227, 4481, 4694, 4872, 5020, 5142, 5240, 5319, 5374, 5409, 5424, 5416, 5386, 5335, 5262, 5163, 5043, 4908, 4772, 4651, 4575, 4566, 4634, 4774, 4968, 5190, 5411, 5606, 5768, 5895, 5993, 6065, 6115, 6150, 6174, 6187, 6190, 6186, 6172, 6153, 6127, 6094, 6050, 5992, 5919, 5834, 5740, 5638, 5537, 5450, 5391, 5375, 5416, 5521, 5684, 5879, 6084, 6277, 6445, 6581, 6687, 6767, 6831, 6881, 6922, 6956, 6987, 7012, 7035, 7055, 7073, 7091, 7106, 7121, 7135, 7148, 7160, 7171, 7180, 7187, 7192, 7195, 7195, 7193, 7193, 7194, 7198, 7206, 7220, 7239, 7261, 7285, 7308, 7329, 7348, 7364, 7376, 7387, 7395, 7402, 7409, 7414, 7418, 7421, 7422, 7423, 7422, 7422, 7421, 7422, 7425, 7430, 7436, 7442, 7449, 7456, 7461, 7466, 7469, 7471, 7472, 7472, 7470, 7466, 7461, 7456, 7450, 7444, 7440, 7439, 7443, 7453, 7467, 7483, 7499, 7516, 7531, 7543, 7553]
3222.590G553POTMLTMLKJV%j%j%J%TJT%JUKU%K%jkjTkUlmUnWmnVonpVrqrTj1j2j3j2
3288.161G410j4j3j4j3Tj0rokJNPRJ0J2J3J4J5J4UJ1J0RPMUKTJ%jT%TKMNTPQRVJ0RTQ
3336.374G599OPNUMLTMLUKULUJUKUJKJ%TjT%WJU%TjT%jU%Tj%j%Tj%j%kjXkTjkjT%JKW
3411.587G664JT%TJU%Tj%j%j%jVkVjTk%TkVjU%ljT%jkUjVk%TJTMLTMKTJKJT%j%jJTKJ
3480.050G649KULUKTLKVLTK%JUKTJLKYJ%UJ%TjVklmlTmlTkTjkjklmUnpqj0Tj1j3j1ro
3547.549G570kJMPQTNMJKJKJKLMLJjkoqrqUnTmTkT%TJUKT%jklT%UjnTpTj0TrpmjJMLT
3607.334G496KJTj%JTNPJ0TJ2J0RJ1J0J2J4J2J0PLjlTjJU%TjlTmlkjKJknj0j2j4Tj1T
3653.619G545j0UrolKOPJ0J1J4J7J6J3J0RTQJ0TRPMNMOPUQUPOMK%jlkjTJTLJTkmnmlj
$$ y = [7553, 7560, 7566, 7572, 7576, 7579, 7582, 7586, 7589, 7591, 7592, 7593, 7594, 7595, 7595, 7594, 7594, 7593, 7593, 7594, 7594, 7594, 7595, 7596, 7596, 7597, 7598, 7599, 7601, 7603, 7605, 7605, 7607, 7607, 7606, 7604, 7603, 7602, 7600, 7598, 7596, 7593, 7589, 7585, 7581, 7576, 7571, 7566, 7561, 7556, 7552, 7547, 7542, 7537, 7532, 7526, 7521, 7514, 7507, 7500, 7493, 7484, 7476, 7467, 7458, 7447, 7435, 7422, 7410, 7396, 7383, 7369, 7356, 7343, 7333, 7324, 7318, 7316, 7317, 7322, 7329, 7338, 7348, 7360, 7373, 7387, 7402, 7416, 7430, 7444, 7455, 7465, 7474, 7481, 7485, 7489, 7493, 7495, 7497, 7498, 7498, 7497, 7496, 7496, 7496, 7498, 7502, 7507, 7512, 7519, 7527, 7536, 7545, 7554, 7563, 7573, 7582, 7591, 7599, 7605, 7612, 7617, 7622, 7627, 7631, 7634, 7637, 7641, 7644, 7647, 7650, 7652, 7654, 7656, 7659, 7662, 7665, 7666, 7667, 7668, 7670, 7672, 7674, 7675, 7677, 7678, 7678, 7678, 7677, 7676, 7676, 7676, 7676, 7676, 7676, 7677, 7678, 7679, 7679, 7679, 7678, 7677, 7677, 7676, 7675, 7674, 7674, 7674, 7673, 7673, 7672, 7672, 7672, 7671, 7671, 7670, 7670, 7668, 7667, 7666, 7665, 7664, 7663, 7662, 7660, 7658, 7657, 7655, 7654, 7653, 7653, 7654, 7656, 7658, 7660, 7662, 7664, 7665, 7666, 7666, 7666, 7667, 7668, 7669, 7669, 7669, 7668, 7668, 7667, 7667, 7666, 7666, 7665, 7664, 7663, 7662, 7660, 7658, 7656, 7654, 7653, 7652, 7650, 7650, 7650, 7648, 7646, 7644, 7642, 7641, 7640, 7639, 7639, 7636, 7635, 7634, 7634, 7633, 7631, 7629, 7627, 7626, 7625, 7624, 7623, 7621, 7621, 7621, 7622, 7623, 7627, 7630, 7633, 7637, 7639, 7641, 7642, 7644, 7645, 7646, 7646, 7645, 7645, 7644, 7645, 7646, 7648, 7649, 7651, 7653, 7655, 7658, 7661, 7664, 7666, 7668, 7671, 7673, 7675, 7677, 7679, 7682, 7685, 7687, 7687, 7688, 7689, 7690, 7692, 7694, 7695, 7698, 7700, 7702, 7704, 7706, 7708, 7710, 7712, 7713, 7713, 7713, 7713, 7714, 7714, 7714, 7713, 7712, 7711, 7710, 7708, 7705, 7701, 7698, 7695, 7691, 7688, 7685, 7683, 7681, 7680, 7678, 7677, 7675, 7672, 7668, 7664, 7660, 7655, 7648, 7640, 7630, 7620, 7609, 7596, 7585, 7576, 7570, 7568, 7569, 7573, 7580, 7588, 7596, 7601, 7605, 7606, 7608, 7609, 7611, 7612, 7614, 7617, 7621, 7624, 7625, 7624, 7622, 7616, 7608, 7599, 7591, 7583, 7575, 7570, 7565, 7561, 7557, 7555, 7553, 7553, 7553, 7554, 7555, 7556, 7558, 7560, 7560, 7559, 7557, 7554, 7551, 7551, 7551, 7551, 7550, 7545, 7540, 7533, 7526, 7516, 7506, 7497, 7490, 7486, 7485, 7486, 7490, 7493, 7496, 7498, 7499, 7500, 7499, 7499, 7500, 7501, 7506, 7513, 7523, 7533, 7545, 7555, 7564, 7575, 7585, 7597, 7611, 7623, 7633, 7640, 7643, 7642, 7639, 7636, 7635, 7636, 7637, 7638, 7638, 7638, 7637, 7634, 7631, 7627, 7624, 7622, 7621, 7623, 7624, 7622, 7617, 7607, 7595, 7581, 7567, 7556, 7545, 7535, 7525, 7515, 7506, 7500, 7497, 7499, 7505, 7512, 7522, 7533, 7547, 7564, 7580, 7593, 7603, 7612, 7621, 7629, 7639, 7649, 7658, 7665, 7669, 7674, 7678, 7684, 7691, 7698, 7705, 7713, 7721, 7729, 7736, 7742, 7746, 7748, 7748, 7747, 7744, 7742, 7741, 7740, 7741, 7742, 7745, 7746, 7747, 7745, 7741, 7736, 7732, 7729, 7728]
3705.690G728Uknqj1Tj2roUnTmnlmTlTkljUlmqj2j4j9k0j9j6j1qopm%LOJ0QLloljKMOT
3757.760G492PTNYMLJT%Tj%Ujknprj0j4Tj7Tk2Tk5k8Tk9Tk6k3k0j4rjOJ1J4J7UJ6J4
3805.974G289RPOPJ1J2J6J8J5J4TJ3J1NKkVljkVlkjTlTnTm%JKT%jkjJLK%mj1j7j9j3
3855.151G345lOJ1TJ2ROJjnTmnrj1j2j3Tj4j2Trqrj0rj1j0rj0qrUj3j5k0k7k9l1k9k8
3895.651F970k7k6k3j7rl%OJ1J7J9TJ8J6J5J1N%pj3j9k6l3l7l8l9Tl7l4k5j7pPJ9K9
3929.400F686L8M4M8N0TM8M5M3M0L9L6L4L3L0K9K7K3J9J7J4J1J0PTONULJ%jlmTnmnl%
3967.971G424KNPQPRPONMLKJ%jTkjkjTkTlkTlTkljU
3999.792G456
$$ y = [7728, 7728, 7728, 7726, 7721, 7713, 7702, 7691, 7679, 7670, 7664, 7658, 7652, 7647, 7642, 7638, 7633, 7630, 7626, 7622, 7619, 7616, 7614, 7611, 7610, 7609, 7608, 7605, 7601, 7593, 7581, 7567, 7548, 7528, 7509, 7493, 7482, 7474, 7468, 7461, 7457, 7457, 7460, 7466, 7476, 7484, 7487, 7484, 7478, 7475, 7474, 7476, 7480, 7486, 7492, 7499, 7506, 7511, 7516, 7521, 7526, 7531, 7536, 7541, 7545, 7548, 7549, 7550, 7550, 7550, 7549, 7549, 7549, 7549, 7548, 7546, 7541, 7534, 7525, 7515, 7501, 7487, 7470, 7453, 7431, 7409, 7384, 7356, 7328, 7299, 7270, 7244, 7221, 7201, 7187, 7178, 7177, 7183, 7194, 7208, 7225, 7242, 7259, 7275, 7289, 7298, 7305, 7311, 7318, 7329, 7341, 7357, 7375, 7390, 7404, 7418, 7431, 7442, 7447, 7449, 7447, 7445, 7443, 7441, 7438, 7437, 7435, 7433, 7431, 7429, 7426, 7424, 7423, 7422, 7419, 7416, 7411, 7406, 7402, 7402, 7403, 7405, 7407, 7407, 7406, 7404, 7403, 7404, 7407, 7409, 7409, 7405, 7394, 7377, 7358, 7345, 7342, 7348, 7359, 7370, 7382, 7391, 7397, 7398, 7397, 7392, 7387, 7383, 7378, 7369, 7358, 7346, 7333, 7320, 7306, 7294, 7282, 7273, 7265, 7256, 7246, 7237, 7226, 7216, 7207, 7197, 7189, 7180, 7171, 7162, 7149, 7134, 7114, 7087, 7058, 7027, 6998, 6970, 6943, 6917, 6894, 6877, 6868, 6865, 6865, 6871, 6882, 6899, 6918, 6937, 6955, 6971, 6986, 6997, 7002, 7002, 6995, 6982, 6963, 6937, 6904, 6867, 6829, 6790, 6751, 6714, 6680, 6655, 6638, 6631, 6638, 6657, 6686, 6724, 6768, 6816, 6866, 6916, 6964, 7009, 7052, 7092, 7131, 7167, 7201, 7234, 7264, 7293, 7320, 7343, 7362, 7379, 7393, 7404, 7414, 7421, 7428, 7434, 7439, 7444, 7449, 7452, 7453, 7453, 7452, 7449, 7445, 7441, 7436, 7432, 7427, 7424, 7424, 7426, 7431, 7438, 7446, 7453, 7462, 7469, 7475, 7480, 7484, 7487, 7489, 7490, 7490, 7489, 7488, 7486, 7485, 7483, 7482, 7481, 7479, 7477, 7474, 7472, 7470, 7467, 7464, 7462, 7459, 7458, 7457, 7456]
##END=
 

