##TITLE= [Ni(macro)](ClO4)2
##JCAMP-DX= 4.24
##DATA TYPE= INFRARED SPECTRUM
##ORIGIN= Chemistry Department, UWI, JAMAICA
##OWNER= Public Domain
##DATE= 95/11/30
##TIME= 08:58:23
##$URL= http://wwwchem.uwimona.edu.jm:1104/spectra
##SPECTROMETER/DATA SYSTEM= PERKIN-ELMER 1600 FT-IR
##INSTRUMENT PARAMETERS= 
Y: 4400.00,450.00 cm-1; 6.03,76.020 %T          95/11/30 08:58
   16 scans; mode ratio; resol 4.00 cm-1; apod weak
##DATA PROCESSING= 
##XUNITS= 1/CM
##YUNITS= TRANSMITTANCE
##XFACTOR= 1.
##YFACTOR= 0.01
##FIRSTX= 4400.
##LASTX= 450.
##NPOINTS= 1976
##FIRSTY= 62.83
##MAXY= 76.02
##MINY= 6.03
##XYDATA= (X++(Y..Y))
4400 6283 6287 6296 6298 6305 6306 6304 6309 6313 6306 6302 6299 6296 6287 6281 6277 6269 6267 6267 6272 6270 6262 6255 6251 6245 6229 6221 6220 6218 6220 6229 6240 6249 6259 6275 6289 6303 6310 6312 6323 6332 6336 6337 6338 6341 6340 6337 6340 6342 6344 6343 6342 6343 6340 6340 6344 6343
4288 6343 6341 6340 6343 6342 6347 6348 6353 6356 6366 6371 6375 6381 6387 6390 6392 6397 6398 6400 6403 6408 6411 6408 6408 6410 6407 6407 6409 6418 6419 6414 6417 6418 6411 6419 6421 6417 6412 6410 6405 6406 6408 6407 6404 6403 6402 6399 6397 6395 6390 6389 6394 6402 6408 6412 6419 6424 6427 6424 6427 6433 6436
4166 6436 6436 6442 6448 6446 6449 6457 6455 6453 6455 6459 6461 6462 6464 6464 6468 6472 6473 6475 6479 6480 6481 6479 6482 6483 6481 6481 6481 6478 6473 6474 6479 6482 6481 6480 6476 6480 6486 6484 6481 6477 6481 6481 6474 6471 6472 6480 6483 6493 6492 6494 6500 6505 6506 6507 6508 6509 6507 6507 6505 6502 6503 6503 6505
4040 6505 6510 6510 6513 6511 6512 6513 6509 6510 6510 6510 6510 6514 6511 6511 6504 6502 6510 6514 6516 6514 6512 6509 6507 6506 6507 6514 6517 6511 6504 6508 6506 6497 6494 6499 6503 6506 6515 6506 6499 6507 6514 6516 6512 6499 6479 6474 6503 6486 6471 6508 6523 6516 6470 6430
3932 6430 6464 6505 6477 6462 6488 6476 6446 6479 6539 6558 6550 6520 6420 6321 6341 6400 6511 6593 6556 6451 6489 6547 6439 6481 6494 6466 6571 6562 6474 6425
3872 6425 6363 6482 6511 6457 6509 6591 6568 6398 6112 6304 6620 6709 6640 6519 6458 6387 6355 6457 6558 6566 6605 6596 6571 6552 6367 6397 6517
3818 6517 6486 6602 6711 6670 6498 6492 6538 6392 6481 6584 6591 6656 6691 6674 6653 6613 6599 6615 6550 6583 6665 6674 6595 6505 6548 6574 6618 6613 6513 6494
3758 6494 6564 6481 6276 6233 6454 6384 6298 6532 6611 6465 6260 6320 6462 6620 6609 6527 6510 6515 6560 6588 6592 6480 6318 6369 6542 6627 6568
3704 6568 6465 6519 6580 6565 6512 6389 6247 6300 6500 6550 6495 6389 6279 6047 6182 6300 6180 6281 6411 6394 6335 6295 6198 6107 6156
3654 6156 6044 5793 5778 5995 6083 6035 5969 5924 5868 5785 5720 5519 5446 5615 5650 5532 5350 5282 5310 5240 5159 5111 5042 5035 5024 4934 4834 4764
3598 4764 4684 4602 4558 4473 4313 4236 4233 4169 4065 3963 3875 3791 3713 3622 3491 3385 3383 3376 3326 3283 3253 3220 3191 3190 3196 3193 3211 3247 3267 3272 3260 3237
3534 3237 3207 3157 3088 3024 2959 2869 2781 2684 2573 2461 2336 2200 2059 1940 1816 1678 1560 1465 1366 1274 1204 1149 1110 1079 1070 1082 1112
3480 1118 1174 1240 1311 1375 1423 1470 1513 1550 1579 1598 1610 1614 1607 1586 1544 1504 1459 1399 1341 1272 1196 1127 1080 1063 1068 1103 1160 1216 1270 1329 1391
3414 1491 1539 1591 1649 1710 1773 1841 1907 1960 2012 2069 2123 2161 2200 2241 2277 2315 2355 2397 2442 2492 2539 2595 2647 2698 2748 2808 2868 2927 2987 3044 3104 3161
3350 3161 3212 3267 3321 3373 3423 3472 3515 3561 3612 3655 3698 3739 3781 3826 3867 3910 3954 3996 4039 4087 4131 4173 4225 4274 4319 4359 4397 4436 4473 4504 4540 4576
3286 4576 4606 4631 4659 4688 4707 4723 4739 4746 4745 4743 4733 4710 4680 4647 4603 4550 4505 4483 4495 4531 4577 4627 4678 4728 4779 4835 4879 4929 4991 5049 5100 5149 5191
3220 5191 5217 5226 5222 5201 5155 5088 4986 4812 4553 4196 3794 3474 3360 3432 3585 3720 3787 3758 3635 3428 3188 3011 2978 3116 3380
3170 3380 3690 3982 4226 4419 4569 4690 4789 4877 4954 5019 5078 5136 5183 5230 5274 5311 5338 5359 5385 5411 5419 5424 5432 5434 5432 5427 5420 5407 5390 5380 5365 5345 5325
3104 5325 5300 5278 5252 5223 5197 5163 5126 5083 5039 4984 4922 4857 4781 4692 4594 4484 4356 4210 4050 3870 3670 3456 3237 3014 2802 2618
3052 2618 2466 2353 2293 2283 2312 2378 2474 2589 2721 2850 2982 3114 3251 3389 3521 3641 3739 3815 3873 3922 3983 4055 4134 4193 4196 4119 3936
2998 3936 3662 3401 3203 3026 2842 2714 2674 2683 2758 2849 2918 3022 3163 3291 3391 3481 3566 3650 3735 3811 3866 3885 3868 3811 3735 3682 3683
2944 3683 3727 3781 3822 3846 3855 3859 3866 3870 3863 3849 3824 3786 3739 3698 3664 3635 3614 3606 3607 3609 3614 3616 3607 3583 3541 3472 3374 3253 3127 3020 2962 2972 3041 3150 3278
2874 3278 3410 3531 3636 3733 3827 3916 3994 4054 4101 4146 4191 4249 4331 4426 4534 4643 4746 4836 4916 5009 5119 5237 5353 5466 5566 5657
2822 5657 5735 5811 5882 5945 6004 6061 6109 6153 6196 6234 6256 6276 6304 6328 6352 6381 6414 6438 6458 6481 6499 6514 6535 6561 6581 6592 6606 6624 6629 6631 6639 6647 6648 6652 6664
2752 6664 6674 6678 6684 6698 6702 6703 6717 6733 6745 6759 6779 6795 6801 6808 6824 6826 6813 6811 6808 6792 6768 6752 6740 6721 6709 6710 6718 6729 6755 6782 6791 6794 6803 6817 6826 6834 6851 6866 6869 6876
2672 6876 6888 6886 6879 6881 6891 6891 6889 6900 6911 6912 6918 6940 6949 6947 6955 6967 6962 6952 6954 6953 6939 6929 6938 6940 6931 6934 6946 6949 6948 6958 6971 6972 6967 6971 6969 6958 6962 6981 6999 7007 7022 7045 7052 7055 7067
2582 7067 7080 7078 7078 7089 7089 7079 7079 7087 7082 7072 7077 7086 7082 7077 7081 7082 7068 7065 7077 7083 7087 7110 7131 7135 7135 7146 7157 7152 7147 7155 7155 7145 7141 7145 7140 7132 7135 7143 7135 7128 7135 7142 7135 7137 7146 7146 7135 7131 7134 7120
2482 7120 7104 7102 7103 7097 7098 7113 7124 7125 7134 7147 7149 7142 7148 7160 7161 7155 7161 7167 7156 7151 7154 7150 7131 7118 7107 7083 7055 7043 7050 7056 7068 7097 7116 7120 7128 7143 7144 7137 7137 7146 7147 7140 7147 7157 7154
2392 7154 7146 7154 7155 7149 7149 7166 7180 7186 7205 7229 7240 7247 7262 7283 7290 7297 7313 7323 7322 7323 7313 7256 7216 7254 7303 7319 7318 7329 7330 7322 7315 7322 7318 7302 7297 7290 7265 7229 7209 7194 7166
2310 7166 7139 7134 7138 7140 7154 7184 7200 7201 7218 7234 7232 7224 7231 7237 7225 7218 7225 7221 7205 7194 7195 7180 7156 7140 7128 7101 7073 7066 7066 7062 7076 7109 7129 7129 7134 7143 7132 7119 7123 7131 7132 7133
2226 7133 7148 7153 7139 7139 7146 7142 7127 7127 7127 7114 7095 7089 7082 7065 7060 7068 7070 7062 7061 7065 7054 7035 7038 7044 7043 7047 7071 7084 7081 7087 7101 7098 7088 7090 7098 7098 7105 7128 7149 7147 7152 7167 7173 7170 7178 7194
2134 7194 7196 7186 7189 7193 7182 7177 7180 7182 7166 7161 7162 7151 7134 7127 7121 7103 7086 7083 7078 7064 7048 7041 7030 7013 6999 6986 6966 6946 6942 6939 6933 6931 6930 6902 6875 6857 6837 6816 6797 6788 6785 6772
2050 6772 6753 6729 6694 6646 6615 6591 6553 6505 6460 6413 6360 6326 6315 6318 6321 6319 6348 6390 6418 6458 6502 6549 6583 6642 6704 6770 6833 6882 6909 6994 7046 7098 7142
1984 7142 7176 7209 7240 7266 7284 7303 7324 7311 7330 7376 7390 7392 7408 7432 7440 7448 7452 7469 7462 7441 7422 7520 7514 7517 7518 7527 7524 7526 7532 7488 7494 7507 7457 7539 7558 7537 7513 7530
1908 7530 7550 7560 7565 7563 7560 7545 7555 7571 7487 7552 7586 7554 7567 7558 7555 7548 7559 7539 7408 7403 7543 7567 7546 7553 7562 7573 7557 7577 7554 7529 7447 7368 7585 7581 7531
1838 7531 7551 7558 7496 7356 7504 7476 7461 7569 7539 7523 7523 7536 7467 7452 7506 7518 7488 7397 7404 7465 7457 7336 7253 7453 7487 7414 7416 7422 7350 7443 7372 7253
1774 7253 7120 7355 7346 7426 7391 7259 7388 7338 7325 7397 7202 7167 7235 7315 7262 7276 7156 7305 7157 6846 7268 7211 7270 7270 7207 7197 7072
1720 7072 6757 6925 7040 7109 7070 6982 6818 6902 6724 6471 6747 6559 6799 6797 6646 6600 6390 5996 6415 6266 6223 5883 5794 5598
1672 5598 5149 4816 4454 3870 3175 2640 2063 1642 1640 1714 2220 2649 3056 3328 3336 3180 2997 2761 2937 3385 3868 4194
1628 3976 4290 4286 4268 4195 4008 4059 4498 4863 5206 5501 5745 5890 6001 6112 6177 6189 6207 6223 6177 6114 6021 5927 5811 5760 5593 5460
1576 5460 5673 5693 5536 5754 5849 5909 5972 5557 5708 6162 6139 6240 6192 6272 6187 6019 5885 5670 6028 6118 5856 5907 5878 5699 5525
1526 5525 5494 5224 5455 5522 5685 6006 6115 6157 5912 5936 6420 6392 6264 6142 6136 6205 6013 5676 5541 5440 5350 5220 5115 4963
1478 4963 4688 4402 3998 3808 3625 3601 3667 3772 3625 3512 3666 4033 4144 4155 3958 3744 3525 3268 3101 3173 3556 3936
1434 3936 4106 4177 4252 4215 4002 3689 3255 2770 2717 2919 3252 3521 3780 3931 3988 3829 3381 2888 2813 2854 2909 2937 2992 3069 3063
1384 3063 2920 2609 2164 1806 1926 2811 3533 3778 3875 3919 4009 4078 4026 4035 4343 4606 4771 4902 5210 5664 5985 6158 6345
1338 6345 6499 6582 6625 6650 6672 6681 6676 6665 6629 6589 6521 6404 6320 6262 6118 5865 5440 4874 4503 4785 5396 5826 6008 6015 5860 5582
1286 5582 5246 4981 4930 5089 5241 5236 5152 5026 4694 4172 3634 3319 3438 3948 4552 5026 5302 5399 5394 5322 5276 5346 5502 5658 5759
1236 5759 5768 5701 5569 5399 5247 5184 5165 5096 4954 4723 4568 4672 4777 4703 4495 4332 4388 4516 4527 4421 4216 3940 3617 3214
1188 3214 2740 2346 2114 2065 2140 2198 2102 1882 1640 1481 1399 1316 1197 1068 949 857 806 772 759 749 756 766 794 808 841 844 845 809
1132 809 771 742 743 710 681 658 649 637 625 620 616 613 611 612 609 608 607 609 603 613 607 614 603 608 608 616 613 617 618 627 632 652 683 731 799 890 1010 1154 1317 1492 1637
1050 1637 1737 1814 1873 1897 1854 1799 1750 1753 1829 1995 2191 2344 2414 2463 2564 2718 2880 3001 3029 2940 2712 2400 2193 2169 2069 1982
998 1982 2137 2440 2734 2988 3280 3612 3902 4066 4049 4069 4242 4413 4518 4629 4768 4876 4904 4845 4800 4891 5078 5277 5428
952 5428 5533 5614 5671 5611 5114 5069 5540 5682 5625 5621 5442 5321 5661 5854 5962 5998 6029 5988 5929 5924 5993 6069 6179 6277 6360 6394 6421 6480
896 6480 6536 6555 6574 6615 6637 6637 6650 6675 6666 6668 6689 6708 6712 6723 6724 6686 6594 6499 6421 6331 6100 5816 5714 5825 5944 5954 5929 6092 6329 6479 6537
834 6537 6545 6575 6673 6753 6805 6874 6912 6907 6918 6932 6923 6910 6919 6928 6903 6895 6931 6931 6906 6882 6865 6803 6680 6481 6060 5401 4869 4669 4905 5515 6075
772 6075 6431 6615 6692 6770 6849 6878 6886 6912 6935 6923 6915 6955 6962 6935 6946 6976 6950 6924 6959 6969 6926 6906 6929 6931 6900 6910 6938 6917 6881 6887 6901 6852 6831 6876
704 6876 6861 6807 6816 6844 6800 6746 6734 6709 6655 6607 6579 6530 6485 6482 6473 6408 6361 6438 6296 6103 6006 5877 5734 5640 5644 5636 5571 5475 5352 4993 4167
642 4167 2791 1749 1780 2251 1990 1329 1059 826 737 841 1183 1866 2763 3403 3770 3960 4075 4179 4244 4257 4239 4341
598 4341 4447 4477 4536 4577 4559 4512 4361 4294 4354 4410 4406 4366 4272 4147 4068 4054 4068 4040 4024 4067 4154 4183 4270 4362 4459 4531 4662 4733 4820 4859
538 4859 4962 4971 4997 5002 4975 5027 5078 5125 5166 5190 5239 5274 5287 5291 5283 5268 5206 5107 5124 5147 5148 5171 5137 5125 5111 5080 5078 5072 5013 4983 4955 4881 4810 4787 4695
468 4695 4593 4494 4440 4435 4571 4810 4960 5079 5161
450 5161
##END=
