##TITLE= pimento oil
##JCAMP-DX= 4.24   $$ ISAS JCAMP-DX check program V1.1/a
##DATA TYPE= INFRARED SPECTRUM
##ORIGIN= Department of Chemistry, UWI, JAMAICA
##OWNER= public domain
##DATE= 99/11/24
##TIME= 13:43:00
##SPECTROMETER/DATASYSTEM= PERKIN-ELMER 1000 FT-IR
##INSTRUMENT PARAMETERS=
##DATAPROCESSING=
##RESOLUTION=   2.000000    
##DELTAX=  -1.000002    
##XUNITS= 1/CM
##YUNITS= TRANSMITTANCE
##XFACTOR=   .1342817    
##YFACTOR=   .2300194E-04
##FIRSTX=   4400.007    
##LASTX=   450.0000    
##MAXY=   .7537045    
##MINY=  -.3753645E-02
##NPOINTS=   3951
##FIRSTY=   .6081668    
##XYDATA=(X++(Y..Y))
32767B6440L6K6oj2j4P9L6l0n0k9K9kNK3M3j5p6MJ2m1n5J2K7Ok6m7K2M3j7KNk2L6M1L0
$$ 26440 26476 26502 26496 26484 26470 26549 26585 26555 26505 26476 26505 26503 26508 26531 26574 26559 26483 26487 26499 26458 26403 26415 26442 26448 26422 26375 26397 26440 26423 26425 26430 26408 26444 26485 26515
32506B6515MKM4O9K5J4N1N3J6LpqM5j9l0L4J9k2nJk7j2kmKPOl3k3J3j6k4J5Nj1J5RK7
$$ 26515 26519 26521 26565 26634 26659 26673 26724 26777 26793 26796 26789 26781 26826 26807 26777 26811 26830 26808 26803 26804 26777 26765 26763 26759 26761 26768 26774 26741 26718 26731 26715 26691 26706 26711 26700 26715 26724 26751
32223B6751J1J0L9K2J5K6K4j7%PK3M2J5Qrj8L2J1j2K0pm0J2KJ1L0L5K2j9l8J7JoK3k5
$$ 26751 26762 26772 26811 26833 26848 26874 26898 26881 26881 26888 26911 26953 26968 26976 26967 26949 26981 26992 26980 27000 26993 26953 26965 26967 26978 27008 27043 27065 27046 27008 27025 27026 27020 27043 27018
31963B7018m9K7N1JMLj2K0K1j6j7j3J7L8k2j6nmnj1J5J7j8jk0k5K8M6J6j2k7L6N6OK8
$$ 27018 26969 26996 27047 27048 27052 27055 27043 27063 27084 27068 27051 27038 27055 27093 27071 27055 27050 27046 27041 27030 27045 27062 27044 27043 27023 26998 27026 27072 27088 27076 27049 27085 27141 27147 27175
31702B7175L2L5O6L9k2jL6K9M0jj1M8J7j5K4L7Oj4j7K7J8k1K4L2lrk3PL2qm3kJ8JPmr
$$ 27175 27207 27242 27308 27347 27325 27324 27360 27389 27429 27428 27417 27465 27482 27467 27491 27528 27534 27520 27503 27530 27548 27527 27551 27583 27580 27571 27548 27555 27587 27579 27536 27534 27552 27553 27560 27556 27547
31427B7547N%J4j7l6lK9K0Nj0l2j3L6Kn6j2J4QJ8rk1kk8l2Oj4m2j6Ml8k4L2ol2L0%m5
$$ 27547 27552 27552 27566 27549 27513 27510 27539 27559 27564 27554 27522 27509 27545 27547 27491 27479 27493 27501 27519 27510 27489 27487 27459 27427 27433 27419 27377 27361 27365 27327 27303 27335 27329 27297 27327 27327 27282
31151B7282KK0PK4L8N2J6k1L5N6J8K4K5K7J4K0K1KK3K5TkQL7J2PRj0jK1%k0KN0L9l5m3
$$ 27282 27284 27304 27311 27335 27373 27425 27441 27420 27455 27511 27529 27553 27578 27605 27619 27639 27660 27662 27685 27710 27735 27733 27741 27778 27790 27797 27806 27796 27795 27816 27816 27796 27798 27848 27887 27852 27809
30875B7809K1K9K4M3%k3J5kj3J1j1K5O9J4p1k7k1J7O3qn4k3k6j9j0kJ3rl4J2k1m8%j9
$$ 27809 27830 27859 27883 27926 27926 27903 27918 27916 27903 27914 27903 27928 27997 28011 27940 27913 27892 27909 27972 27964 27910 27887 27861 27842 27832 27830 27843 27834 27800 27812 27791 27743 27743 27724
30622B7724mqk0J7qj4oJ5J0oNQloJ1K0Nk1j5J1M4M7n1l0L7kRk2l0K8ml2J4J6j8j0%K6
$$ 27724 27720 27712 27692 27709 27701 27687 27681 27696 27706 27700 27705 27713 27710 27704 27715 27735 27740 27719 27704 27715 27759 27806 27755 27725 27762 27760 27769 27747 27717 27745 27741 27709 27723 27739 27721 27711 27711 27737
30339B7737J0k1mJ6OJ4j3l9PK8J8J9lm1j3M9L6m4k5Kj2K9K1Mrj2K0J6J2MLKj4J1J7nJ0
$$ 27737 27747 27726 27722 27738 27744 27758 27745 27706 27713 27741 27759 27778 27775 27734 27721 27770 27806 27762 27737 27739 27727 27756 27777 27781 27772 27760 27780 27796 27808 27812 27815 27817 27803 27814 27831 27826 27836
30064B7836Qj0qlJ9PoK4rj9j4j7lK0jj5MLj6n3k3K9km5qM1Ok1j7Kj7l1k5mJ4qj5J0K9
$$ 27836 27844 27834 27826 27823 27842 27849 27843 27867 27858 27839 27825 27808 27805 27825 27824 27809 27813 27816 27800 27747 27724 27753 27751 27706 27698 27739 27745 27724 27707 27709 27692 27661 27636 27632 27646 27638 27623 27633 27662
29773B7662Qj7j1J8J0k6OK2lK3J1k5j2J6J8qOK5PRTjJ9K7K1%kL0%k0K0N1K7M0M3J4J6
$$ 27662 27670 27653 27642 27660 27670 27644 27650 27672 27669 27692 27703 27678 27666 27682 27700 27692 27698 27723 27730 27739 27748 27747 27766 27793 27814 27814 27812 27842 27842 27822 27842 27893 27920 27960 28003 28017 28033
29498B8033J7L3K5MJ7PnK8J9J7M4K8K4L1j4j3kL7M3J3l0k2KoJ7L8M7O1M4%j2lj3MK6L6
$$ 28033 28050 28083 28108 28112 28129 28136 28131 28159 28178 28195 28239 28267 28291 28322 28308 28295 28293 28330 28373 28386 28356 28334 28336 28330 28347 28385 28432 28493 28537 28537 28525 28522 28509 28513 28539 28575
29230B8575N9K2m8l1M8M6QJ6Jl5o0k4J9k1kL1K8K0P5O9PP1N2k1l9qj1q0o8qL3L6K3J2
$$ 28575 28634 28656 28608 28577 28625 28671 28679 28695 28696 28661 28601 28577 28596 28575 28573 28604 28632 28652 28727 28796 28803 28874 28926 28905 28866 28858 28847 28767 28699 28691 28724 28760 28783 28795
28976B8795j5o5m0kL0P0j5m6kN0M7p1j26q5QQ9P5J2pNQ0P8q9j14n6O5Q9Kk0l8q1m4L9
$$ 28795 28780 28715 28675 28673 28703 28773 28758 28712 28710 28760 28807 28736 28610 28525 28533 28622 28697 28709 28702 28707 28787 28865 28776 28662 28606 28671 28760 28762 28742 28704 28623 28579 28618
28731B8618J00N2m4J21L53k1j82j39j00l2j5J4L9M3O5M2K7N3L6pM6No9o6PJKj8m5J2N5
$$ 28618 28718 28770 28726 28847 29200 29179 28997 28858 28758 28726 28711 28725 28764 28807 28872 28914 28941 28994 29030 29023 29069 29074 29005 28939 28946 28947 28949 28931 28886 28898 28953
28500B8953j1l1JK5J28K43l4j95r3J2J05K7p5j02p7%K2K4N2R8P5n4r5K5J54J44p4j47
$$ 28953 28942 28911 28912 28937 29065 29308 29274 29079 28986 28998 29103 29130 29055 28953 28876 28876 28898 28922 28974 29072 29147 29093 28998 29023 29177 29321 29247 29100
28291B9100q3%Q6Kj05o9J2L9MpkMN3M6pj5QL3N3P9m3r9l2j5j4K5L4M3Q5O1l3n5NP5j8
$$ 29100 29017 29017 29103 29105 29000 28931 28943 28982 28986 28979 28977 28981 29034 29080 29073 29058 29066 29099 29152 29231 29188 29089 29057 29042 29028 29053 29087 29130 29215 29276 29243 29188 29193 29268 29250
28031B9250o2JK8P2Q4Jm3qjK7L3Q3J58mk4Or2p2j7K50J2k31j23J5J6K5O0J10J80k0j27
$$ 29250 29188 29189 29217 29289 29373 29374 29331 29323 29322 29349 29382 29465 29623 29619 29595 29601 29509 29437 29420 29670 29682 29451 29328 29343 29359 29384 29444 29554 29734 29714 29587
27800B9587j20o3p0q6k3N1N2M0K2k4k9oq2pK7o0o9rM3N3J18J03l7r4j00j14r1j4j6QP1
$$ 29587 29467 29404 29334 29248 29225 29276 29328 29368 29390 29366 29337 29331 29249 29242 29269 29209 29140 29131 29174 29227 29345 29448 29411 29317 29217 29103 29012 28998 28982 28990 29061
27569B9061J4o8j17j11j9rk8rm1j8Q6M8m7j02j42j48j41j01q3q4m8Tn8l5J5M5K7k28k45
$$ 29061 29075 29007 28890 28779 28760 28751 28723 28714 28673 28655 28741 28789 28742 28640 28498 28350 28209 28108 28025 27941 27893 27845 27787 27752 27767 27812 27839 27611 27366
27353B7366j29%j0j01j88j94j38q3o3r8r9n8o1p4l2J4n8j29q2p4M6J46K6j23m5q3k46
$$ 27366 27237 27237 27227 27126 26938 26744 26606 26523 26460 26362 26263 26205 26144 26070 26038 26052 25994 25865 25783 25709 25755 25901 25927 25804 25759 25676 25430
27152B5430j62q3n3o4r4n3m0m8n4m1l6n7o5l7M5J32M7k27j91j27j05o2Tn5n9m8o1l0n4
$$ 25430 25268 25185 25132 25068 24974 24921 24881 24833 24779 24738 24702 24645 24580 24543 24588 24720 24767 24540 24349 24222 24117 24055 23993 23938 23879 23831 23770 23740 23686
26936B3686p3j3l3Oj04j89j57k96j28J45L3o7n8q5o8m8j33j55j41j07q1j47j29j47k11
$$ 23686 23613 23600 23567 23573 23469 23280 23123 22827 22699 22844 22877 22810 22752 22667 22599 22551 22418 22263 22122 22015 21934 21787 21658 21511 21300
26750B1300j59j03q9k16k91m29m16l16k48j03m4j25k34k49k70l08l32l67l94l86l49m12
$$ 21300 21141 21038 20949 20733 20442 20013 19597 19281 19033 18930 18886 18761 18527 18278 18008 17700 17368 17001 16607 16221 15872 15460
26586A5460l26l75n02n51n91l68l20l70l27l53l62k81k51k49j99j71j62j75j93j30n9
$$ 15460 15134 14759 14257 13706 13115 12747 12427 12057 11730 11377 11015 10734 10483 10234 10035 9864 9702 9527 9334 9204 9145
26430I145n6j04q0m3q8p6n7o6o4m9j2Kn9q5l4j0k2l9m1l1k9m2o0PN9l4j09n4j1pk1k0
$$ 9145 9089 8985 8905 8862 8774 8698 8641 8575 8511 8462 8450 8452 8393 8308 8274 8264 8242 8203 8162 8131 8102 8060 8000 8007 8066 8032 7923 7869 7858 7851 7830 7810
26191G810OK1rKJ2L1K4l1k2M7O1K6RM4K4j3ML7M7J9j5J9L8lmK0lK1K8j5jj0J1L1qJK6
$$ 7810 7816 7837 7828 7830 7842 7873 7897 7866 7844 7891 7952 7978 7987 8031 8055 8042 8046 8083 8130 8149 8134 8153 8191 8188 8184 8204 8201 8222 8250 8235 8234 8224 8235 8266 8258 8259 8285
25916H285l6l3j9j8%j2j7j8mJqPpn0m3rpj2nj8k1m1k7Rmk4pkJkJ1M4k2p3J1L4J1J4j2
$$ 8285 8249 8216 8197 8179 8179 8167 8150 8132 8128 8129 8121 8128 8121 8071 8028 8019 8012 8000 7995 7977 7956 7915 7888 7897 7893 7869 7862 7860 7861 7859 7870 7914 7892 7819 7830 7864 7875 7889 7877
25625G877KM6M5K5QOTnLL4M5K8%J0L9O1M0K1L2L1QL8O9L9K7M8M9M0L5L3N8O4L8L7M7L3
$$ 7877 7879 7925 7970 7995 8003 8009 8015 8010 8013 8047 8092 8120 8120 8130 8169 8230 8270 8291 8323 8354 8362 8400 8469 8508 8535 8583 8632 8672 8707 8740 8798 8862 8900 8937 8984 9017
25357I017L8O8P5P1M5K8M5N1L2N1Q7P8M2L9M9M0L8O1N9L8M0O6O0M9M2N1N8O5P7O6N0L1
$$ 9017 9055 9123 9198 9269 9314 9342 9387 9438 9470 9521 9608 9686 9728 9767 9816 9856 9894 9955 10014 10052 10092 10158 10218 10267 10309 10360 10418 10483 10560 10626 10676 10707
25119A0707O7P9O8N7N0L4M3O8O4L6M9O6O9P6N6L8L2N3P9P2N0N9O5M8N2O4O1N5N7O3M6
$$ 10707 10774 10853 10921 10978 11028 11062 11105 11173 11237 11273 11322 11388 11457 11533 11589 11627 11659 11712 11791 11863 11913 11972 12037 12085 12137 12201 12262 12317 12374 12437 12483
24888A2483N5Q7M4L2Q5O1L1M0N5O5N9P2O6N7O9O2N5L5L8N5N0N6O4N3M5O2N9N3O4O1M7
$$ 12483 12538 12625 12669 12701 12786 12847 12878 12918 12973 13038 13097 13169 13235 13292 13361 13423 13478 13513 13551 13606 13656 13712 13776 13829 13874 13936 13995 14048 14112 14173 14220
24657A4220N3O8M9N1N0M5N1N3N2O0M8L7O4O8M0M3M6P4N0L4N5N8M8M6O8N7M4L5L6N4O4
$$ 14220 14273 14341 14390 14441 14491 14536 14587 14640 14692 14752 14800 14837 14901 14969 15009 15052 15098 15172 15222 15256 15311 15369 15417 15463 15531 15588 15632 15667 15703 15757 15821
24426A5821O1M6O0N0L6N2M7N0L9K7L3L0N6O0L7M8P6N5N6M6L6L9N0N1M0M4TO7O3L8M8N4
$$ 15821 15882 15928 15988 16038 16074 16126 16173 16223 16262 16289 16322 16352 16408 16468 16505 16553 16629 16684 16740 16786 16822 16861 16911 16962 17002 17046 17090 17157 17220 17258 17306 17360
24188A7360O6M9K1L5N6N3L9L2O3P5M2L3K1L2M1L5M2M8M4M8L4M0O0K7K6M3M7N0K4J5L8
$$ 17360 17426 17475 17496 17531 17587 17640 17679 17711 17774 17849 17891 17924 17945 17977 18018 18053 18095 18143 18187 18235 18269 18309 18369 18396 18422 18465 18512 18562 18586 18601 18639
23957A8639N0N5M5RM6P2M8N7L6M5N9M7K4M7P1TO1M7L0K3M0O4O2M6O2N2M4M3M7O8O4N4
$$ 18639 18689 18744 18789 18798 18844 18916 18964 19021 19057 19102 19161 19208 19232 19279 19350 19421 19482 19529 19559 19582 19622 19686 19748 19794 19856 19908 19952 19995 20042 20110 20174 20228
23719B0228N0M6L1K8M5N7M6M9N9O6P0M1L4N4TM7L7K5N9P7O0L4K8M6L5L9L7J9L8O0M6L8
$$ 20228 20278 20324 20355 20383 20428 20485 20531 20580 20639 20705 20775 20816 20850 20904 20958 21005 21042 21067 21126 21203 21263 21297 21325 21371 21406 21445 21482 21501 21539 21599 21645 21683
23481B1683L6K7K8M1N7M8L1KJ4M6M2K6K2L4K9J0KJ9M3LJK2JJ6L1L4J2PL6L0pmK8K5J4
$$ 21683 21719 21746 21774 21815 21872 21920 21951 21953 21967 22013 22055 22081 22103 22137 22166 22176 22178 22197 22240 22243 22244 22266 22267 22283 22314 22348 22360 22367 22403 22433 22426 22422 22450 22475 22489
23220B2489J6K2J6mpTKJ9Jk0j4j7j6l4n3m1n0r2j15j33j54j84k25k35k47l10l70m08m35
$$ 22489 22505 22527 22543 22539 22532 22525 22527 22546 22547 22527 22513 22496 22480 22446 22393 22352 22302 22210 22095 21962 21808 21624 21399 21164 20917 20607 20237 19829 19394
23004A9394m90n42n51n67n79n60m91m26l72l04k09j10j2J05J93K19K53K58K21J72J28
$$ 19394 18904 18362 17811 17244 16665 16105 15614 15188 14816 14512 14303 14193 14181 14286 14479 14698 14951 15209 15430 15602 15730
22848A5730N3j1m0r7j28p5k1rJ6R9J75K04K44K82K85K86K60K04J91J89J14O1M4M2L0N
$$ 15730 15783 15772 15732 15635 15507 15432 15411 15402 15418 15517 15692 15896 16140 16422 16707 16993 17253 17457 17648 17837 17951 18012 18056 18098 18128 18133
22654A8133mj3l5n4q7j23j30j24j26j22j21j43j11o5p6j04j10j00j01j25j48j82j97k20
$$ 18133 18129 18116 18081 18027 17940 17817 17687 17563 17437 17315 17194 17051 16940 16875 16799 16695 16585 16485 16384 16259 16111 15929 15732 15512
22475A5512k67l07l53l74l76m18m25m13m29m04l53l07k79k12j01mR0J67K31K95L29L33
$$ 15512 15245 14938 14585 14211 13835 13417 12992 12579 12150 11746 11393 11086 10807 10595 10494 10490 10580 10747 10978 11273 11602 11935
22311A1935L15K89K69J99R4On8j21k28l28l83m62n50n94n87n55n24m51l31k08j10l1n
$$ 11935 12250 12539 12808 13007 13101 13107 13049 12928 12700 12372 11989 11527 10977 10383 9796 9241 8717 8266 7935 7727 7617 7586 7581
22140G581k1n0p2j06j21j69j89j70j53j46j24j08r5n5l7j3M6O1N1O4O9P7N8K3nl6n1r7
$$ 7581 7560 7510 7438 7332 7211 7042 6853 6683 6530 6384 6260 6152 6057 6002 5965 5952 5998 6059 6110 6174 6243 6320 6378 6401 6396 6360 6309 6212
21932F212j25j24j78j93j48j36j18r4n6J6M1M5Q6J22J03P9P4R6R8P6M5TO9M3N2N1M4J9
$$ 6212 6087 5963 5785 5592 5444 5308 5190 5096 5040 5056 5097 5142 5228 5350 5453 5532 5606 5702 5800 5876 5921 5966 6035 6078 6130 6181 6225 6244
21723F244K2N3P5M7N1O5M3M6O9P6Q7J03J18J40J54J51J72J96J97K14K34K26K21K41K46
$$ 6244 6266 6319 6394 6441 6492 6557 6600 6646 6715 6791 6878 6981 7099 7239 7393 7544 7716 7912 8109 8323 8557 8783 9004 9245 9491
21537I491K19K44K68K37K07K03K34K29J93J71J76J74J51J21Q6P1O1QOK9J0PL1J0lRJj2
$$ 9491 9710 9954 10222 10459 10666 10869 11103 11332 11525 11696 11872 12046 12197 12318 12404 12475 12536 12544 12550 12579 12589 12596 12627 12637 12634 12643 12644 12632
21328A2632j3k6j01q0l6o4o7p3r4p1o4p5q8r6j07j30j43j68j73j32j09q9m2k6%N4R6J46
$$ 12632 12619 12593 12492 12412 12376 12312 12245 12172 12078 12007 11943 11868 11780 11684 11577 11447 11304 11136 10963 10831 10722 10633 10591 10565 10565 10619 10715 10861
21120A0861J95K62L59M44M97N70O51O99P22P47P54P48P41O84O33N89N29M82M38L97L96
$$ 10861 11056 11318 11677 12121 12618 13188 13839 14538 15260 16007 16761 17509 18250 18934 19567 20156 20685 21167 21605 22002 22398
20963B2398L59L04K93K94K68K39K29K12J89J88J74J66J71J48J47J39J30J33J29J28J27
$$ 22398 22757 23061 23354 23648 23916 24155 24384 24596 24785 24973 25147 25313 25484 25632 25779 25918 26048 26181 26310 26438 26565
20807B6565J04Q1P3J06J10Q7TO3N5N8P1P0N2K5L3N8L0L9N3K4L3K1nOK1K8Mj2%oj7j1k1
$$ 26565 26669 26750 26823 26929 27039 27126 27213 27276 27331 27389 27460 27530 27582 27607 27640 27698 27728 27767 27820 27844 27877 27898 27893 27899 27920 27948 27952 27940 27940 27934 27917 27906 27885
20561B7885j9jMj8k5morKj4l0k2j4j2j1k1k2j5j3oO%j8kJ1rj2%kKJ3L3L6J5MN2N4J6M5
$$ 27885 27866 27865 27869 27851 27826 27822 27816 27807 27809 27795 27765 27743 27729 27717 27706 27685 27663 27648 27635 27629 27635 27635 27617 27615 27626 27617 27605 27605 27603 27605 27618 27651 27687 27702 27706 27758 27812 27828 27873
20271B7873P4L8L5O6N7L0N2O0M5M8N9O5O2N0M2J9L0M5M7K6L1K8TL3L7K6TL7K6L5K7J0
$$ 27873 27947 27985 28020 28086 28143 28173 28225 28285 28330 28378 28437 28502 28564 28614 28656 28675 28705 28750 28797 28823 28854 28882 28910 28943 28980 29006 29032 29069 29095 29130 29157 29167
20033B9167K0K3J6J5J9J4J7K6J0JPJ4J8LJ0J7kKJ6j1j9OJ3J0J2kj2k1l6j8L0nm4k8j4
$$ 29167 29187 29210 29226 29241 29260 29274 29291 29317 29327 29328 29335 29349 29367 29370 29380 29397 29395 29397 29413 29402 29383 29389 29402 29412 29424 29422 29410 29389 29353 29335 29365 29360 29316 29288 29274
19772B9274k7n7m9l8j9l1n5m2l0l3m4k0j1rj2Tmj0jJ3QL2N7J8J0N2N5L1K8L4K4PLJ2Q
$$ 29274 29247 29190 29141 29103 29084 29053 28998 28956 28926 28893 28849 28829 28818 28809 28797 28785 28781 28771 28770 28783 28791 28823 28880 28898 28908 28960 29015 29046 29074 29108 29132 29139 29142 29154 29162
19511B9162K3J1roPj2%rk0Lj3l5j7k5j6j2j8j2k7k3j3%k0mJ6J4L6L7K2L1K4L1L5K4Qr
$$ 29162 29185 29196 29187 29181 29188 29176 29176 29167 29147 29150 29137 29102 29085 29060 29044 29032 29014 29002 28975 28952 28939 28939 28919 28915 28931 28945 28981 29018 29040 29071 29095 29126 29161 29185 29193 29184
19243B9184J1J8K4K7Jj7lJ5RqjK2NpoK1KlOJ7loj2rJ7QMJ5qj6RTj3j5%PJ6NJ%nprj%J6
$$ 29184 29195 29213 29237 29264 29265 29248 29245 29260 29269 29261 29260 29282 29287 29280 29274 29295 29297 29294 29300 29317 29314 29308 29296 29287 29304 29312 29316 29331 29323 29307 29316 29325 29312 29297 29297 29304 29320 29325 29326 29326 29321 29314 29305 29304 29304 29320
18901B9320J0POJ2K1K6NpMJ8K8J9J0L2L7QOK7K6J4kJ4J7J2KJ0J6K7%j1kJ5J9J1LPJ8J9
$$ 29320 29330 29337 29343 29355 29376 29402 29407 29400 29404 29422 29450 29469 29479 29511 29548 29556 29562 29589 29615 29629 29627 29641 29658 29670 29672 29682 29698 29725 29725 29714 29712 29727 29746 29757 29760 29767 29785 29804
18618B9804J0%ML3M2K4L4M3K6J5PL1M4K8J3J7K9pJ2K7J3rmJ1jLN%QjJ4L5J4K1K5L2L5
$$ 29804 29814 29814 29818 29851 29893 29917 29951 29994 30020 30035 30042 30073 30117 30145 30158 30175 30204 30197 30209 30236 30249 30240 30236 30247 30246 30249 30254 30254 30262 30261 30275 30310 30324 30345 30370 30402 30437
18342C0437L3M5M4L9M2L1M4M1M3K0K1L6M7K6MJ1K7NQL5TPNQLNkMK1Pmlmj6J2J0k4k8k
$$ 30437 30470 30515 30559 30598 30640 30671 30715 30756 30799 30819 30840 30876 30923 30949 30953 30964 30991 30996 31004 31039 31074 31081 31086 31094 31097 31102 31100 31104 31125 31132 31128 31125 31121 31105 31117 31127 31103 31075 31073
18052C1073mj8k0j1j5l1Tj8rk6l0j9j6mq%PpjK0J2OJ4TPJ3K5L0J1J4J9NjJ8K6J3RKJ1
$$ 31073 31069 31051 31031 31020 31005 30974 30943 30925 30916 30890 30860 30841 30825 30821 30813 30813 30820 30813 30812 30832 30844 30850 30864 30878 30885 30898 30923 30953 30964 30978 30997 31002 31001 31019 31045 31058 31067 31069 31080
17761C1080L1J0L1M6J4L5K7J8O3N8K0M8P1L9L4mM5P2LL0N6M4Tk0p7l8j9J2P9K1p1nOn6
$$ 31080 31111 31121 31152 31198 31212 31247 31274 31292 31355 31413 31433 31481 31552 31591 31625 31621 31666 31738 31741 31771 31827 31871 31915 31895 31818 31780 31761 31773 31852 31873 31802 31797 31803 31747
17508C1747plj4L7Q2O5L3j5m8K5Jn5qnl3Tk2QK8k9n5kN%ml6K3P2l2p6KJ2l2n3j9l7p4
$$ 31747 31740 31737 31723 31760 31842 31907 31940 31925 31877 31902 31903 31848 31840 31835 31802 31769 31747 31755 31783 31754 31699 31697 31702 31702 31698 31662 31685 31757 31725 31649 31651 31663 31631 31578 31559 31522 31448
17232C1448n2k3n1p1m1l0k2L2M5L5K3O2O8M7O1O6N9N5M2L6L1K6J4K3J9LPjj3J1J3j7k4
$$ 31448 31396 31373 31322 31251 31210 31180 31158 31190 31235 31270 31293 31355 31423 31470 31531 31597 31656 31711 31753 31789 31820 31846 31860 31883 31902 31905 31912 31911 31898 31909 31922 31905 31881
16987C1881mQPJ1MOJ7J8MLJk4j5J0qj2J2M%M%LRK7K8K1K6K5J7J8M6L3J5K4L3K3RJ9K6
$$ 31881 31877 31885 31892 31903 31907 31913 31930 31948 31952 31955 31956 31932 31917 31927 31919 31907 31919 31923 31923 31927 31927 31930 31939 31966 31994 32015 32041 32066 32083 32101 32147 32180 32195 32219 32252 32275 32284 32303 32329
16696C2329K5J2oOM3L9PQJ7J6TK1PKj4k1j5%J1pomj2j3pk0lj4j9RqrRrj2qTj2j3j2Tk0
$$ 32329 32354 32366 32360 32366 32409 32448 32455 32463 32480 32496 32512 32533 32540 32542 32528 32507 32492 32492 32503 32496 32490 32486 32474 32461 32454 32434 32431 32417 32398 32407 32399 32390 32399 32390 32378 32370 32362 32350 32337 32325 32313 32293
16383C2293k6k3l3j7rm7m0j9m4l7k1l9l1l0j9QJ1QJ3TK1L2K7K6L7M3M1L1K2M1L2poK6
$$ 32293 32267 32244 32211 32194 32185 32138 32098 32079 32035 31998 31977 31938 31907 31877 31858 31866 31877 31885 31898 31911 31932 31964 31991 32017 32054 32097 32138 32169 32191 32232 32264 32257 32251 32277
16130C2277J8kj6jK5Qj8QK4K3OJ4K2J6K4K3K0L6K6L0L2P%J2J0ol%K3L2ok6J1J6j7pJ6
$$ 32277 32295 32293 32277 32276 32301 32309 32291 32299 32323 32346 32352 32366 32388 32404 32428 32451 32471 32507 32533 32563 32595 32602 32602 32614 32624 32618 32615 32615 32638 32670 32664 32638 32649 32665 32648 32641 32657
15855C2657NqJ9K7mj9LPmnTkj3kTk1j3k3k0rk8k2l2k4j9pk1j9mk4j6Tl5k6k0j7k8k7j2
$$ 32657 32662 32654 32673 32700 32696 32677 32680 32687 32683 32678 32673 32671 32658 32656 32654 32633 32620 32597 32577 32568 32540 32518 32486 32462 32443 32436 32415 32396 32392 32368 32352 32336 32301 32275 32255 32238 32210 32183 32171
15564C2171l7o2m9l7p1r0p8p7q4q5j07j01r6j14j40j11j13j16r8r2r4p6n7m7l5k2qLT
$$ 32171 32134 32072 32023 31986 31915 31825 31747 31670 31586 31501 31394 31293 31197 31083 30943 30832 30719 30603 30505 30413 30319 30243 30186 30139 30104 30082 30074 30077 30080
15348C0080M9P9O9N6O4Q3P3O9O3R9R1P0O5N9N4N6N3M5N7M9J3NPJ8J1j2Trqj5k1k3oOR
$$ 30080 30129 30208 30277 30333 30397 30480 30553 30622 30685 30784 30875 30945 31010 31069 31123 31179 31232 31277 31334 31383 31396 31401 31408 31426 31437 31425 31413 31404 31396 31381 31360 31337 31331 31337 31346
15088C1346L6M4J8OJ9K6K2L8L9Nk3oQmnJ5J7jk0j8OQ%kKjlmoj4MJK5K9l5n4NLj9j2j6
$$ 31346 31382 31426 31444 31450 31469 31495 31517 31555 31594 31599 31576 31570 31578 31574 31569 31584 31601 31600 31580 31562 31568 31576 31576 31574 31576 31575 31572 31568 31562 31548 31552 31553 31578 31607 31572 31518 31523 31526 31507 31495 31479
14782C1479oK4K6J1K0L0N1O0O5O4TO8P6P5O2N5Q2R9L7LJ5L0M2TJ1J7K6K0J6J5KMqOJj4
$$ 31479 31473 31497 31523 31534 31554 31584 31635 31695 31760 31824 31888 31956 32032 32107 32169 32224 32306 32405 32442 32445 32460 32490 32532 32574 32585 32602 32628 32648 32664 32679 32681 32685 32677 32683 32684 32670
14514C2670PJ5m%qN4L3p8o7j4J4J0j9j8Mmk4l4j3Kk0l8k4jM4M3l3o8j6L8N7m7n0j9qk0
$$ 32670 32677 32692 32688 32688 32680 32734 32767 32689 32622 32608 32622 32632 32613 32595 32599 32595 32571 32537 32524 32526 32506 32468 32444 32443 32487 32530 32497 32429 32413 32451 32508 32461 32411 32392 32384 32364
14246C2364j2J1J2m3n3m5m1l6l5j6j7k8l2l5k8KM3L3l7k4JK5O9Lp4m3l2l1m3m6n5n1l4
$$ 32364 32352 32363 32375 32332 32279 32234 32193 32157 32122 32106 32089 32061 32029 31994 31966 31968 32011 32044 32007 31983 31984 32009 32078 32081 32007 31964 31932 31901 31858 31812 31757 31706 31672
14000C1672n6p6o0n7p7Tp2o9m3J2K6o3j51j41j13q1o2n1n6p3n9m4l9l8o4o0k4Tn5l2O
$$ 31672 31616 31540 31480 31423 31346 31269 31197 31128 31085 31097 31123 31060 30909 30768 30655 30574 30512 30461 30405 30332 30273 30229 30190 30152 30088 30028 30004 29980 29925 29893 29899
13770B9899J8l2j9J06M5j49r9n1%J6M3K2l8j5K6M5N2J18J99K1r3J1J40J07k2K8N1O5R7
$$ 29899 29917 29885 29866 29972 30017 29868 29769 29718 29718 29734 29777 29799 29761 29746 29772 29817 29869 29987 30186 30207 30114 30125 30265 30372 30350 30378 30429 30494 30591
13554C0591Q4Q7J00Q5O9TQ8J12J31M6KM9L5%QM1P3N1K3N4j7q0j2J8k8K3J26N9q3j24q5
$$ 30591 30675 30762 30862 30947 31016 31085 31173 31285 31416 31462 31464 31513 31548 31548 31556 31597 31670 31721 31744 31798 31781 31701 31689 31707 31679 31702 31828 31887 31804 31680 31595
13323C1595k0J7L8M4k7l5PN5k1n8m3qL4mK3J36M9j98k05n4k8j75j58r8p3j0j2k32k48
$$ 31595 31575 31592 31630 31674 31647 31612 31619 31674 31653 31595 31552 31544 31578 31574 31597 31733 31782 31584 31379 31325 31297 31122 30964 30866 30793 30783 30771 30539 30291
13107C0291j83j28j70l38l07k73k29j18k62l25j82k72k75k54j70l2q1j45M5J12j22r4
$$ 30291 30108 29980 29810 29472 29165 28892 28663 28545 28283 27958 27776 27504 27229 26975 26805 26773 26692 26547 26592 26704 26582 26488
12943B6488nJ16K76J01l46j76Ok4j89j20q3o1oNk3m7JJ19K90K27k03m8P2p2n6L2Q6O9
$$ 26488 26483 26599 26875 26976 26630 26454 26460 26436 26247 26127 26044 25983 25977 25982 25959 25912 25913 26032 26322 26549 26346 26298 26370 26298 26242 26274 26360 26429
12734B6429J1Q4J90J34L6m2m7J54L62l3n03m9J08O5m79k00p0n4K1K9j9o9q1J07K92j16
$$ 26429 26440 26524 26714 26848 26884 26842 26795 26949 27311 27278 26775 26726 26834 26899 26420 26220 26150 26096 26117 26146 26127 26058 25977 26084 26376 26260
12541B6260o16l37j21j94k89j87m6J29j34k68L9O9M7J20N1k11m3RP1J39J32j11r3j3k8
$$ 26260 25644 25307 25186 24992 24703 24516 24470 24599 24465 24197 24236 24305 24352 24472 24523 24312 24269 24278 24349 24488 24620 24509 24416 24403 24375
12355B4375m0m9J4J64L21m6j065l94k50k28l28o32r88j493j148j529j963k064j843j182
$$ 24375 24335 24286 24300 24464 24785 24739 23674 23280 23030 22802 22474 21842 20854 19361 18213 16684 14721 12657 10814 9632
12206I632j81P12J370K530J770J294J208Q60N80M40L00Qj01n9j17o49p55p06j002j211
$$ 9632 9451 10163 11533 14063 15833 17127 18335 19195 19775 20215 20515 20523 20422 20363 20246 19597 18842 18136 17134 15923
12057A5923j090j375k610j030n14l44n8P1O0j08j54j49Tj5J06J78K92M16M88N12M82L84
$$ 15923 14833 13458 10848 9818 9304 8960 8902 8973 9033 8925 8771 8622 8473 8458 8564 8742 9034 9450 9938 10450 10932 11316
11893A1316K35J17K0P5K26M52P39R18R86J013R73R21Q76Q43Q08P49O78O49O60O57N96
$$ 11316 11551 11668 11688 11763 11989 12441 13180 14098 15084 16097 17070 17991 18867 19710 20518 21267 21945 22594 23254 23911 24507
11737B4507K23K25K70K79L38M03J06k1P1J53J52K1%J01K43M83K60l90o55j47Ok55l66
$$ 24507 24730 24955 25225 25504 25842 26245 26351 26330 26401 26554 26706 26727 26727 26828 27071 27554 27814 27424 26769 26622 26628 26373 26007
11565B6007k09j30k58n02m18l43k65m39n56k70n74n29k96j235j154n88o92o65p76j569
$$ 26007 25798 25668 25410 24908 24490 24147 23882 23443 22887 22617 22043 21514 21218 19983 18829 18241 17549 16884 16108 14539
11416A4539j231j176j208j112j393j338r93j336r75n99p89q85p49l01j39j84p2j1J3J4
$$ 14539 13308 12132 10924 9812 8419 7081 6088 4752 3777 3178 2389 1504 755 454 315 131 59 48 61 75
11267G5L0N3J39K14K92L76N49O13O56P86R24R77R44R96R85Q43R50Q16P83Q59Q50TP96
$$ 75 105 158 297 511 803 1179 1728 2341 2997 3783 4707 5684 6628 7624 8609 9452 10402 11218 12001 12860 13710 14560 15356
11096A5356N71N58M35K88K39J86R5J5j92l29l88m44m88j086j072p41j330j807j695j167
$$ 15356 15927 16485 16920 17208 17447 17633 17728 17743 17551 17222 16834 16390 15902 14816 13744 13003 11673 9866 8171 7004
10947G004j157j079q12m99l38j88K09L94N12N02M53K85J1n15j99j93j40j11j4J92M13
$$ 7004 5847 4768 3956 3457 3119 2931 3140 3534 4046 4548 5001 5286 5297 4782 4583 4390 4250 4139 4125 4317 4730
10791D730N96O87O48N27K65Kj97l23l94m65l47n00j076m39k53k64j02J14K76M51O68Q24
$$ 4730 5326 6013 6661 7188 7453 7455 7258 6935 6541 6076 5729 5229 4153 3714 3461 3197 3095 3209 3485 3936 4604 5428
10627E428R08Q89P96N52M06L76L75K89L65N49N55N24N14N08N69O18O22N68M65L49L59
$$ 5428 6336 7225 8021 8573 8979 9355 9730 10019 10384 10933 11488 12012 12526 13034 13603 14221 14843 15411 15876 16225 16584
10471A6584M55M71N26N39M39L55J95oPK4o7l18l09k88l86m48m38m56p13o06m76m91m52
$$ 16584 17039 17510 18036 18575 19014 19369 19564 19558 19565 19589 19522 19204 18895 18607 18221 17773 17335 16879 16166 15560 15084 14593 14141
10299A4141m01l86l90m16m38m42l58l47m19m37k89k61k33j83j61l5Q4J90L10L49L78M67
$$ 14141 13740 13354 12964 12548 12110 11668 11310 10963 10544 10107 9818 9557 9324 9141 8980 8945 9029 9219 9529 9878 10256 10723
10135A0723N42N85N77N42N43N63N26N05M55M02L48K95K46J87J12O2l1q1p4n0q2j01n5
$$ 10723 11265 11850 12427 12969 13512 14075 14601 15106 15561 15963 16311 16606 16852 17039 17151 17213 17182 17101 17027 16977 16895 16794 16739
9964A6739L2L6M0P3P2O7O1L8K1M0M4TK9mj3n0j19j68k19k35k09k42k56k49k22j99k27
$$ 16739 16771 16807 16847 16920 16992 17059 17120 17158 17179 17219 17263 17307 17336 17332 17319 17269 17150 16982 16763 16528 16319 16077 15821 15572 15350 15151 14924
9763A4924k45k35k69l10l41l52l86m10m12m32m31m25m24m26m47m59m93n12n31n45n64
$$ 14924 14679 14444 14175 13865 13524 13172 12786 12376 11964 11532 11101 10676 10252 9826 9379 8920 8427 7915 7384 6839 6275
9607F275n51n36m97m53m14l60l22l04k77k52k23k17k37k20k10j84j65j61j32p0n1j2k
$$ 6275 5724 5188 4691 4238 3824 3464 3142 2838 2561 2309 2086 1869 1632 1412 1202 1018 853 692 560 490 439 427 425
9435D25J5N5Q9R8R9J20J57K01K53K78L11L49L43L03K73K39J73J08Qj18k11k88l58l86
$$ 425 440 495 584 682 781 901 1058 1259 1512 1790 2101 2450 2793 3096 3369 3608 3781 3889 3897 3779 3568 3280 2922 2536
9257B536l85l39l00k62k07j39r7l2MM8J23K02K69L20L80M22M24M17L81L13K31J59J13
$$ 2536 2151 1812 1512 1250 1043 904 807 775 779 827 950 1152 1421 1741 2121 2543 2967 3384 3765 4078 4309 4468 4581
9085D581K9l0n8r4j18Tj19j02p8p7TmN2P0R5J68K17K22K51L03L33L43L78L84L47L19L13
$$ 4581 4610 4580 4522 4428 4310 4192 4073 3971 3893 3816 3739 3735 3787 3857 3952 4120 4337 4559 4810 5113 5446 5789 6167 6551 6898 7217 7530
8884G530K55K08J49J06M4Nm1n8j9K8N9J24J96K25K33K71L00K89K48K45K61K14J49Q0N0
$$ 7530 7785 7993 8142 8248 8292 8297 8256 8198 8179 8207 8266 8390 8586 8811 9044 9315 9615 9904 10152 10397 10658 10872 11021 11101 11151
8698A1151j4j24k13l27m91o52q14r09r74r65q78p24n87m61l09j96r8L7J74L08M25M85
$$ 11151 11137 11013 10800 10473 9982 9330 8516 7607 6633 5668 4790 4066 3479 3018 2709 2513 2415 2452 2626 2934 3359 3844
8534C844N01M59L57K37K05K84M59O37P64P85O61M44J63j26l79n75o89p52p41o86n88m51
$$ 3844 4345 4804 5161 5398 5603 5887 6346 6983 7747 8532 9193 9637 9800 9674 9295 8720 8031 7279 6538 5852 5264 4813
8370D813k13Q8M62Q65J177J428J521J419J277J135R49P87O58N43M14L03K48J67J17J00
$$ 4813 4600 4688 5150 6015 7192 8620 10141 11560 12837 13972 14921 15708 16366 16909 17323 17626 17874 18041 18158 18258
8222A8258J01N6L6M6M9Q8R1P1Q5R5J34J74K13K55K49K00J92J85J70J28R7N4J5LR3J66
$$ 18258 18359 18415 18451 18497 18546 18634 18725 18796 18881 18976 19110 19284 19497 19752 20001 20201 20393 20578 20748 20876 20973 21027 21042 21045 21138 21304
8028B1304J59J41J37R1Q8N7Kpm8p7o0p1j09p6n8q8r8j63k21k37k77l46l68l65m11m52
$$ 21304 21463 21604 21741 21832 21920 21977 21979 21972 21924 21847 21787 21716 21607 21531 21473 21385 21287 21124 20903 20666 20389 20043 19675 19310 18899 18447
7834A8447n39o98q55j010j195j345j428j474j444j333j192j018q20o34m56k86j59o5N0
$$ 18447 17908 17210 16355 15345 14150 12805 11377 9903 8459 7126 5934 4916 4096 3462 3006 2720 2561 2496 2546
7693B546J35K35L21M21N50O72P52Q34Q96R47R20Q70Q32Q19P51O76N92N48M89L78L10K37
$$ 2546 2681 2916 3237 3658 4208 4880 5632 6466 7362 8309 9229 10099 10931 11750 12501 13177 13769 14317 14806 15184 15494 15731
7529A5731J16M4j3j42k74l92n22o46o81o93p27p37o33m88l42j54Q8L85O99R39J153J303
$$ 15731 15847 15891 15878 15736 15462 15070 14548 13902 13221 12528 11801 11064 10431 9943 9601 9447 9535 9920 10619 11558 12711 14014
7365A4014J338J275J158J006Q58P36O28N29M34L60K76J77J13P6N9K1j3l7m8n3p9j18j29
$$ 14014 15352 16627 17785 18791 19649 20385 21013 21542 21976 22336 22612 22789 22902 22978 23037 23058 23045 23008 22960 22907 22828 22710 22581
7194B2581j60k15k65k70k52k63k88k96l14l48l75l43k50j70j30k8J03J19J20J07J32J30
$$ 22581 22421 22206 21941 21671 21419 21156 20868 20572 20258 19910 19535 19192 18942 18772 18642 18614 18717 18836 18956 19063 19195 19325
7030A9325J57K03J18k7j03k07l04l53l94m51n13n54n95o30o93p68p83p58p70p68p09o54
$$ 19325 19482 19685 19803 19776 19673 19466 19162 18809 18415 17964 17451 16897 16302 15672 14979 14211 13428 12670 11900 11132 10423 9769
6866I769o15n84m98m01l22k81k00r1M6J37J65K44M22N40N59N65N90TN73N49N31N57O11
$$ 9769 9154 8570 8072 7671 7349 7068 6868 6777 6823 6960 7125 7369 7791 8331 8890 9455 10045 10635 11208 11757 12288 12845 13456
6695A3456N80M63M91N46N26N45N94O30O29TN71M95M98M91M46M37L83L02K22J62J35Q4
$$ 13456 14036 14499 14990 15536 16062 16607 17201 17831 18460 19089 19660 20155 20653 21144 21590 22027 22410 22712 22934 23096 23231 23315
6531B3315Q3R5L5%J1n9j45k29k90l46m51n71n73n40n61n70n94o32o78o93p25o92o42n26
$$ 23315 23398 23493 23528 23528 23539 23480 23335 23106 22816 22470 22019 21448 20875 20335 19774 19204 18610 17978 17300 16607 15882 15190 14548 14022
6352A4022l60k00J3K36M41O24Q04R19R40R73R82Q53P51O24M44K83J19j08k72m47o73p96
$$ 14022 13662 13462 13475 13711 14152 14776 15580 16499 17439 18412 19394 20247 20998 21622 22066 22349 22468 22360 22088 21641 20968 20172
6188B0172r44j072j163j238j211j180j101j014r12p64n75l99k68l0K03L11L91N47O05
$$ 20172 19228 18156 16993 15755 14544 13364 12263 11249 10337 9573 8998 8599 8331 8301 8504 8815 9206 9753 10358
6047A0358N76N24M96M38L82K84K01R5K4j76n30p78q97q81o74l55O7M69P32R46J262J598
$$ 10358 10934 11458 11954 12392 12774 13058 13259 13354 13378 13202 12672 11894 10997 10116 9442 9087 9154 9623 10355 11301 12563 14161
5883A4161J717J664J526J272R97Q03O04M25L31K44J82J42P7J0j06k74m11o07q17q50p64
$$ 14161 15878 17542 19068 20340 21337 22140 22744 23169 23500 23744 23926 24068 24145 24155 24049 23775 23364 22757 21940 21090 20326
5727B0326o93m25l9K52L64M18L66J44k9k34n30n99p67r97j070j063r77q66p15m78k48
$$ 20326 19633 19208 19169 19421 19785 20203 20569 20713 20684 20450 19920 19321 18554 17557 16487 15424 14447 13581 12866 12388 12140
5570A2140q4Q6L00N51O99P95J011J140J044R69R09Q51P40M79L51K95J35P2R9J12L8q9
$$ 12140 12056 12142 12442 12993 13692 14487 15498 16638 17682 18651 19560 20411 21151 21630 21981 22276 22411 22483 22582 22694 22732 22643
5407B2643k37k90l10k09M9K78M71O11N68M39L85L23J68Q9Q1N3Rl0l6k9m5o8q7j45r8m9
$$ 22643 22406 22116 21806 21597 21646 21924 22395 23006 23574 24013 24398 24721 24889 24978 25059 25112 25121 25091 25055 25026 24981 24913 24826 24681 24583 24534
5213B4534j04j03l1n5o3j19j45r7j16j51j34j53j49j12r3j06j86j73j02j23k03k26j52
$$ 24534 24430 24327 24296 24241 24178 24059 23914 23817 23701 23550 23416 23263 23114 23002 22909 22803 22617 22444 22342 22219 22016 21790 21638
5042B1638j05k13k10k55k20j67j40l5m71p12j95k53j68k33m12m34m04m33n52n87n38n77
$$ 21638 21533 21320 21110 20855 20635 20468 20328 20293 19822 19110 18915 18662 18494 18261 17849 17415 17011 16578 16026 15439 14901 14324
4878A4324o83o32n35m33l98k74j98PJ56J62K06K13J91K96K84K27J45J01J18R7Rk3n6r3
$$ 14324 13641 13009 12474 12041 11643 11369 11171 11178 11334 11496 11702 11915 12106 12402 12686 12913 13058 13159 13277 13374 13383 13360 13304 13211
4699A3211j1o3q7r2j23j09j41j46j08k15j49j96j78j75k45k81j82j29k26l51l50k31k45
$$ 13211 13200 13137 13050 12958 12835 12726 12585 12439 12331 12116 11967 11771 11593 11418 11173 10892 10710 10581 10355 10004 9654 9423 9178
4528I178l59l76m08l33k51l49k93k03j71j32q1l3QK4N5r1N1J23k7r3K8Kq7j08o1j08j74
$$ 9178 8819 8443 8035 7702 7451 7102 6809 6606 6435 6303 6222 6189 6197 6221 6276 6185 6236 6359 6332 6239 6267 6269 6182 6074 6013 5905 5731
4327E731j45j31j64j63j28j41j10j80k27j55j07k23j84j87j68j58j41k02j68j69q7n5
$$ 5731 5586 5455 5291 5128 5000 4859 4749 4569 4342 4187 4080 3857 3673 3486 3318 3160 3019 2817 2649 2480 2393 2338
4163B338p3j40j49l4J26j3j10J5o7q5n9l0l9k4q1j12q3om1p3r9n8o2M0k3r7j16p1l0K
$$ 2338 2265 2125 1976 1942 2068 2055 1945 1960 1893 1808 1749 1719 1680 1656 1575 1463 1380 1374 1333 1260 1161 1103 1041 1081 1058 961 845 774 744 746
3939G46p4o0j6j3n9j35O5O7j36n7N6q2j1L7K2n3m2k1M1j3j1r4q4NN9j28q0R9O2m1o4J5
$$ 746 672 612 596 583 524 389 454 521 385 328 384 302 291 328 350 297 255 234 275 262 251 157 73 78 137 9 -71 28 90 49 -15 0
3701@J8l3m1J79m6j94LJ13o8m2L1k9P6J09j05j3J76O1j59l7M5KJ13J23j06j24j03pJ49
$$ 0 18 -15 -56 123 77 -117 -114 -1 -69 -111 -80 -109 -33 76 -29 -42 134 195 36 -1 44 46 159 282 176 52 -51 -58 91
3485I1jl8M4n0l8J84J31k05k6J43l5k16lj11l3O7J23%
$$ 91 90 52 96 46 8 192 323 118 92 235 200 -16 -19 -130 -163 -96 27 27
3351B7
##END=
