##TITLE= polystyrene film (calibrant)
##JCAMP-DX= 4.24     $$ a comment
##DATA TYPE= INFRARED SPECTRUM
##ORIGIN= PERKIN-ELMER 1600 FT-IR
##OWNER= Public Domain
##DATE= 92/05/12
##TIME= 13:24:13
##SPECTROMETER/DATA SYSTEM= PERKIN-ELMER 1600 FT-IR
##INSTRUMENT PARAMETERS= 
X: 4400.00,450.00 cm-1; 0.01,87.100 %T          92/05/12 13:24
   16 scans; mode ratio; resol 2.00 cm-1; apod strong
##DATA PROCESSING= 
##XUNITS= 1/CM
##YUNITS= TRANSMITTANCE
##XFACTOR= 1.
##YFACTOR= 0.01
##FIRSTX= 4400.
##LASTX= 450.
##NPOINTS= 3951
##FIRSTY= 82.25
##MAXY= 87.1
##MINY= 0.01
##XYDATA= (X++(Y..Y))
4400H225J3RJ1MmRj2rK0k9TJ5J0k7l9k2j6k1KJl4k6oj3j2Jk6m2k1j3k4j2j1l0k6J6
$$ 8225 8238 8247 8258 8262 8258 8267 8255 8246 8266 8237 8208 8223 8233 8206 8167 8145 8129 8108 8110 8111 8077 8051 8045 8032 8020 8021 7995 7953 7932 7919 7895 7883 7872 7842 7816 7832
4364G832PjJ6k8l4J2J9k3mJ4j4MPqJ4RK1L6jmj5qJ1QJ2Qj4j2nRK2J0J8qk2OJ6mRJ2
$$ 7832 7839 7838 7854 7826 7792 7804 7823 7800 7796 7810 7796 7800 7807 7799 7813 7822 7843 7879 7878 7874 7859 7851 7862 7870 7882 7890 7876 7864 7859 7868 7890 7900 7918 7910 7888 7894 7910 7906 7915 7927
4324G927jj1okj6kNj3J5K2qMRJmqKOj0j6j9KJ6kJJ2lrJ1OM%j4nJ6K1PqMJ1PQKrj5k
$$ 7927 7926 7915 7909 7907 7891 7889 7894 7881 7896 7918 7910 7914 7923 7924 7920 7912 7914 7920 7910 7894 7875 7877 7893 7891 7892 7904 7901 7892 7903 7909 7913 7913 7899 7894 7910 7931 7938 7930 7934 7945 7952 7960 7962 7953 7938 7936
4278G936pLJ9J5Nj2q%k5m4k5j2j0k3k0Jkk4l5l2j1nl1m5j2Mj6j9Njk9l3k5J8K9rj6
$$ 7936 7929 7932 7951 7966 7971 7959 7951 7951 7926 7882 7857 7845 7835 7812 7792 7793 7791 7767 7732 7700 7689 7684 7653 7608 7596 7600 7584 7565 7570 7569 7540 7507 7482 7500 7529 7520 7504
4241G504ljJ0J6jomJ2J4KTlNK0J6J2K0lj1J9K8OJ3L1J8RJ2rj0L2Qk1MKRL7J0l3lNj7
$$ 7504 7501 7500 7510 7526 7525 7519 7515 7527 7541 7543 7545 7542 7547 7567 7583 7595 7615 7612 7601 7620 7648 7654 7667 7698 7716 7725 7737 7728 7718 7750 7758 7737 7741 7743 7752 7789 7799 7766 7763 7768 7751
4200G751QK8jj6JK0prqjNmj7j0Jkpj3j1lNJ0PoMJ1QmNJ4QK0K8J3lQJ2TK1J8J1MNPJ4
$$ 7751 7759 7787 7786 7770 7771 7791 7784 7775 7767 7766 7771 7767 7750 7740 7741 7739 7732 7719 7708 7705 7710 7720 7727 7721 7725 7736 7744 7740 7745 7759 7767 7787 7815 7828 7825 7833 7845 7857 7878 7896 7907 7911 7916 7923 7937
4155G937J8J1TjJ3PlOMJ6J2Lmlj9k7rpoj0k0pTj6l1l0j1nk6l8j9rNkk5k6k1k4pKj4
$$ 7937 7955 7966 7977 7976 7989 7996 7993 7999 8003 8019 8031 8034 8030 8027 8008 7981 7972 7965 7959 7949 7929 7922 7915 7899 7868 7838 7827 7822 7796 7758 7739 7730 7735 7733 7708 7682 7661 7637 7630 7632 7618
4114G618ornPj%Uj3rK5J1j7%J9OkJ8K0LNrk0mJj2k3j4jpj9k1j7k8k6k3k8j9l0o2n1
$$ 7618 7612 7603 7598 7605 7604 7604 7604 7604 7591 7582 7607 7618 7601 7601 7620 7626 7624 7642 7662 7665 7670 7661 7641 7637 7638 7626 7603 7589 7588 7581 7562 7541 7524 7496 7470 7447 7419 7400 7370 7308 7257
4073G257m3m2l6n3o5n6m0Tm5l9m6m1l5k6k3k0k1j9qrmKmlJ9TNJ1mrlpj4j8j7pRK7L6
$$ 7257 7214 7172 7136 7083 7018 6962 6922 6882 6837 6798 6752 6711 6676 6650 6627 6607 6586 6567 6559 6550 6546 6548 6544 6541 6560 6579 6584 6595 6591 6582 6579 6572 6558 6540 6523 6516 6525 6552 6588
4034F588L9M6O6P1O2O8N0L2P4R0N6N1N5M8N9O5M7L2M5N9L2LPTomNJj8j6oj3Uk1JJ2
$$ 6588 6627 6673 6739 6810 6872 6940 6990 7022 7096 7186 7242 7293 7348 7396 7455 7520 7567 7599 7644 7703 7735 7738 7745 7752 7746 7742 7747 7748 7730 7714 7708 7695 7682 7669 7648 7649 7661
3997G661LKjTRKNJ8J0NT%j1MJ2J3MjPJlJRK6J4J0J5K1L3K8J5Jj1oK4K8J7RmTJPRJ3
$$ 7661 7664 7666 7665 7664 7673 7675 7680 7698 7708 7713 7718 7718 7707 7711 7723 7736 7740 7739 7746 7747 7744 7745 7754 7780 7794 7804 7819 7840 7873 7901 7916 7917 7906 7900 7924 7952 7969 7978 7974 7970 7971 7978 7987 8000
3953H000mk6j0j9k0RNk3l5j7NqnJ8Mk0k6qk6m3j2oKK4K3jk3k1nJ3lj3RNj6OM2N2M8
$$ 8000 7996 7970 7960 7941 7921 7930 7935 7912 7877 7860 7865 7857 7852 7870 7874 7854 7828 7820 7794 7751 7739 7733 7735 7759 7782 7781 7758 7737 7732 7745 7742 7729 7738 7743 7727 7733 7775 7827 7875
3914G875L5J7QPTMk4o1Tk3TK4L6J1M9O8N5N9K8j3n0q1j6N0N8Qn8n9j5QJ5k7n4JK7L7
$$ 7875 7910 7927 7935 7942 7949 7953 7929 7868 7807 7784 7761 7785 7821 7832 7881 7949 8004 8063 8091 8078 8028 7947 7931 7981 8039 8047 7989 7930 7915 7923 7938 7911 7857 7858 7885 7922
3878G922K7l1o8l9k3l8q5o6L9P6K9l7k6oj6J9M4M1J6k2m1o7j16j33p2R6J89J62R9L8
$$ 7922 7949 7918 7850 7811 7788 7750 7665 7599 7638 7714 7743 7706 7680 7674 7658 7677 7721 7762 7778 7756 7715 7648 7532 7399 7327 7423 7612 7774 7873 7911
3848G911J1Km5m7rl1m0k4n3j8O4M1M6O1OLN2M1kk3k6qNk9r1j35n3M9Q1K9p0l0M3O3
$$ 7911 7922 7924 7879 7832 7823 7792 7752 7728 7675 7657 7721 7762 7808 7869 7875 7878 7930 7971 7969 7946 7920 7912 7917 7888 7797 7662 7609 7658 7739 7768 7698 7668 7711 7774
3814G774N8K7Lk0n6j07n8J2J1nn2p7k8M8Q3M7NJ1N0O9M8K6J0RJ1J8nj7kK4L3K8j6k9
$$ 7774 7832 7859 7862 7842 7786 7679 7621 7633 7644 7639 7587 7510 7482 7530 7613 7660 7665 7676 7726 7795 7843 7869 7879 7888 7899 7917 7912 7895 7893 7917 7950 7978 7962 7933
3780G933PL7M8M5L9K0jl8r0n3M8M1k6mL8K8J0k1p4o3ok2oM4Pp9j25q5q4n3P9J00L7
$$ 7933 7940 7977 8025 8070 8109 8129 8128 8090 8000 7947 7995 8036 8010 8006 8044 8072 8082 8061 7987 7924 7918 7896 7890 7934 7941 7862 7737 7652 7568 7515 7594 7694 7731
3747G731p9j40QQ6P0Q2K1l9o9r5j19m1M6L8Q0Q6O3M1Ml6m2QJ4j8K9M9J3L5O9N4J5r
$$ 7731 7652 7512 7520 7606 7676 7758 7779 7740 7671 7576 7457 7416 7462 7500 7580 7666 7729 7770 7774 7738 7696 7704 7718 7700 7729 7778 7791 7826 7895 7949 7964 7955
3715G955m4r7o6j5NR7J04M9K6%m0p7n7J0L9L5Qpoqj6o1j04p6n8m3M3Q2N4L2J9rk7m3
$$ 7955 7911 7814 7748 7733 7738 7835 7939 7988 8014 8014 7974 7897 7840 7850 7889 7924 7932 7925 7919 7911 7895 7834 7730 7654 7596 7553 7596 7678 7732 7764 7783 7774 7747 7704
3681G704o1n8m8j09j48k6J07J08L1l2m6J4J16J12O7L2J6J2KPJ3pn7p7oM3L9Mj06j61
$$ 7704 7643 7585 7537 7428 7280 7254 7361 7469 7500 7468 7422 7436 7552 7664 7731 7763 7779 7791 7793 7800 7813 7806 7749 7672 7666 7709 7748 7752 7646 7485
3651G485j21n5J6J10J58J20O2L0J8L3L7J7K0K1Ll3rJ8j6p5j46j16K8Q4P8M5Ok8n5r0
$$ 7485 7364 7309 7325 7435 7593 7713 7775 7805 7823 7856 7893 7910 7930 7951 7954 7921 7912 7930 7914 7839 7693 7577 7605 7689 7767 7812 7818 7790 7735 7645
3621G645r2m6J4N8N1J9k0kO2L9k0j2KM4P7O4K6Rj1k1qK6L6mk5oNL3N6L5k4p4o2kP5
$$ 7645 7553 7507 7521 7579 7630 7649 7629 7627 7689 7728 7708 7696 7698 7742 7819 7883 7909 7918 7907 7886 7878 7904 7940 7936 7911 7905 7910 7943 7999 8034 8010 7936 7874 7872 7947
3586G947R0N7L1K4Lk1j2kJ0J3j2j0jnjm2j00p7n6J9O2M1L8J7j6j1jj0j3LPk5l0OJ8
$$ 7947 8037 8094 8125 8149 8152 8131 8119 8117 8127 8140 8128 8118 8117 8112 8111 8069 7969 7892 7836 7855 7917 7958 7996 8013 7997 7986 7985 7975 7962 7965 7972 7947 7917 7923 7941
3551G941Ork4j9j2J0L2L8L7J7J4J8nmK7K9J8RPONjj0J5K6mlK1K6KmJ6Nj2kJ5Rj9l3
$$ 7941 7947 7938 7914 7895 7883 7893 7925 7963 8000 8017 8031 8049 8044 8040 8067 8096 8114 8123 8130 8136 8141 8140 8130 8145 8171 8167 8164 8185 8211 8213 8209 8225 8230 8218 8216 8231 8240 8221 8188
3512H188k6k8j5Olk2k8l0k4rJkMj7k8j1mnj1TKj6j7p%OKOrj0OK2TJ3J1J4J1MJ1J6J7
$$ 8188 8162 8134 8119 8125 8122 8100 8072 8042 8018 8009 8010 8008 8012 7995 7967 7956 7952 7947 7936 7925 7927 7911 7894 7887 7887 7893 7895 7901 7892 7882 7888 7910 7932 7945 7956 7970 7981 7985 7996 8012 8029
3471H029J2J0J6MTRMTPJ6J3Ojk%lo%nrnk7l8k1rqj3j4j6qpoprTj3Tjlrlmj0NK0J2O
$$ 8029 8041 8051 8067 8071 8075 8084 8088 8092 8099 8115 8128 8134 8133 8131 8131 8128 8122 8122 8117 8108 8103 8076 8038 8017 8008 8000 7987 7973 7957 7949 7942 7936 7929 7920 7911 7898 7885 7884 7881 7872 7869 7865 7855 7860 7880 7892 7898
3424G898%mRK0J2RK4K0NJ5J8J7J1J6K7J3NQJ7J2PJ2J7QjNPN%qj1kKlj1j0nj8k6j1n
$$ 7898 7898 7894 7903 7923 7935 7944 7968 7988 7993 8008 8026 8043 8054 8070 8097 8110 8115 8123 8140 8152 8159 8171 8188 8196 8195 8200 8207 8212 8212 8204 8193 8191 8193 8190 8179 8169 8164 8146 8120 8109 8104
3383H104j1nj0k6k1jkj2j6j3j4j0qpoj1kj%QNkjKJTJ0K0J1J6K9L1J0JMQJ8L0K9JTJ5
$$ 8104 8093 8088 8078 8052 8031 8030 8028 8016 8000 7987 7973 7963 7955 7948 7942 7931 7929 7928 7928 7936 7941 7939 7938 7940 7941 7942 7952 7972 7983 7999 8028 8059 8069 8070 8074 8082 8100 8130 8159 8160 8161 8176
3341H176QMJ2J4Kj5kJ1Tqj8%qj1klj0rk2k3j7j2rj0j3j5k2j6j3j2qj1o%J0%j8lJ0m
$$ 8176 8184 8188 8200 8214 8216 8201 8199 8210 8221 8213 8195 8195 8187 8176 8174 8171 8161 8152 8130 8107 8090 8078 8069 8059 8046 8031 8009 7993 7980 7968 7960 7949 7943 7943 7953 7953 7935 7932 7942 7938
3301G938pLNTJ3J0RJ6QMJ1K2K4QJ2K1J6TRJ1J6J0QJ2RjkJ%LKqj2j1k0j4lj2k1k2j7
$$ 7938 7931 7934 7939 7944 7957 7967 7976 7992 8000 8004 8015 8037 8061 8069 8081 8102 8118 8134 8143 8154 8170 8180 8188 8200 8209 8208 8206 8207 8207 8210 8212 8204 8192 8181 8161 8147 8144 8132 8111 8089 8072
3260H072pj4j9j0j8k0pok3Tj5j0jqpTolKL%KMRJ7J6TQLRJ0J7K8J4J0K0J9J5PJ0J3J0
$$ 8072 8065 8051 8032 8022 8004 7984 7977 7971 7948 7925 7910 7900 7899 7891 7884 7877 7871 7868 7870 7873 7873 7875 7879 7888 7905 7921 7937 7945 7948 7957 7967 7984 8012 8026 8036 8056 8075 8090 8097 8107 8120 8130
3218H130J4PNnqklmTjj0k9k7k1j6j4j7j3j8k8k3j2j1rj1j6k3k5k0j1npTj1j3j1KJ7
$$ 8130 8144 8151 8156 8151 8143 8141 8138 8134 8130 8129 8119 8090 8063 8042 8026 8012 7995 7982 7964 7936 7913 7901 7890 7881 7870 7854 7831 7806 7786 7775 7770 7763 7756 7745 7732 7721 7723 7740
3180G740lj9pMJ1PTJ2Lj3j0k0l3l8l1j9pLTJK4L4M1M4L2J2PJ2J5J0pj6j3Trj1k0l0
$$ 7740 7737 7718 7711 7715 7726 7733 7740 7752 7755 7742 7732 7712 7679 7641 7610 7591 7584 7587 7590 7591 7615 7649 7690 7734 7766 7778 7785 7797 7812 7822 7815 7799 7786 7773 7764 7753 7733 7703
3142G703k6k2k5k3l0l7k2j8l3Tk8k1k9l4k8k7k4k6k7l5m4m6n6o5p6r2j12j49j68j79
$$ 7703 7677 7655 7630 7607 7577 7540 7518 7500 7467 7434 7406 7385 7356 7322 7294 7267 7243 7217 7190 7155 7111 7065 7009 6944 6868 6776 6664 6515 6347 6168
3112F168k12k52k83l00l01k78k36j71j01l3L1P0Q9Q3N4J8k2p7j52k22k83l44l94m13
$$ 6168 5956 5704 5421 5121 4820 4542 4306 4135 4034 4001 4032 4102 4191 4274 4328 4346 4324 4247 4095 3873 3590 3246 2852 2439
3088B439m07l73l10k37j62p9NP8J41J78J82J67J36Q9M0j0n4r5j30j63j88k01j96j71
$$ 2439 2032 1659 1349 1112 950 871 876 954 1095 1273 1455 1622 1758 1847 1887 1877 1823 1728 1598 1435 1247 1046 850 679
3064F79j42j12p5m2mL7O8J09J49J72J80J89J91J80J66J50J30R4N0Pm1r0j34j66j90
$$ 679 537 425 350 308 304 341 409 518 667 839 1019 1208 1399 1579 1745 1895 2025 2119 2169 2176 2135 2045 1911 1745 1555
3039A555k06k11k06j97j83j64j33j00p1m4k6j1O%mKK7N3J01J59K16K73L19L53L60L40
$$ 1555 1349 1138 932 735 552 388 255 155 84 40 14 3 9 9 5 7 34 87 188 347 563 836 1155 1508 1868 2208
3013B208L03K50J90J19M3l0j00j49j72j66j24o1K7J37K40L24L78L88L59L02K47K07
$$ 2208 2511 2761 2951 3070 3113 3083 2983 2834 2662 2496 2372 2311 2338 2475 2715 3039 3417 3805 4164 4466 4713 4920
2991D920J61J23R6O4L8K8K0Lj9m2n3Tm6m8m3l5l7m0m9n9o8q9j10j21j31j47j54j60
$$ 4920 5081 5204 5300 5364 5402 5430 5450 5453 5434 5392 5339 5286 5240 5192 5149 5114 5077 5037 4988 4929 4861 4772 4662 4541 4410 4263 4109 3949
2963C949j71Uj77Vj80j79j73j78j83j84j79j70j66j59j44j31j22j11r6q0o8n5m4l6
$$ 3949 3778 3607 3436 3259 3082 2905 2728 2548 2369 2196 2018 1835 1651 1472 1302 1136 977 833 702 580 469 373 293 225 170 126 90
2936I0k9k1j1TrjTlJ%JjKLknL%KPQONPJ1J7J8K0K1K8L7M2M9N8P2P7Q6R4J01J00R9J02
$$ 90 61 40 29 18 9 8 7 4 5 5 6 5 7 10 8 3 6 6 8 15 23 29 34 41 52 69 87 107 128 156 193 235 284 342 414 491 577 671 772 872 971 1073
2894A073R8R4R3R0R1Q8TQ9Q8R0UR2R4R7R6R1Q9Q4P6O7N6L6J8Lj9n3p5j04j28j49j65
$$ 1073 1171 1265 1358 1448 1539 1627 1715 1804 1892 1982 2072 2162 2254 2348 2445 2541 2632 2721 2805 2881 2948 3004 3040 3058 3061 3042 2989 2914 2810 2682 2533 2368
2862B368j74j75j80j78j62j49j35j13r1p3n4l3pK2M8Q1J20J66K23K79L35L94M35M39
$$ 2368 2194 2019 1839 1661 1499 1350 1215 1102 1011 938 884 851 844 866 914 995 1115 1281 1504 1783 2118 2512 2947 3386
2838C386M33M15L84L38K91K51K17J81J56J32J12R6Q6P5O3O0N3M9N0L4L1K9J9TJ4TJ7
$$ 3386 3819 4234 4618 4956 5247 5498 5715 5896 6052 6184 6296 6392 6478 6553 6616 6676 6729 6778 6828 6862 6893 6922 6941 6960 6974 6988 7005
2811G005J6QLJ0J7J4J2K1K0J%J0J2N%lTLQPQLqlTKMKj%RK2J9J6K4L2L4M0M7M9M2L1
$$ 7005 7021 7029 7032 7042 7059 7073 7085 7106 7126 7127 7127 7137 7149 7154 7154 7151 7148 7151 7159 7166 7174 7177 7169 7166 7163 7165 7169 7171 7170 7170 7179 7201 7220 7236 7260 7292 7326 7366 7413 7462 7504 7535
2769G535L2L7L3K2K9L2J9J5J9K7K1QJ3TNJonkrqj0j1j8j9Tk5k6k7Tk3j7k8k6k5l1j8
$$ 7535 7567 7604 7637 7659 7688 7720 7739 7754 7773 7800 7821 7829 7842 7855 7860 7861 7855 7850 7848 7839 7831 7821 7810 7792 7773 7754 7729 7703 7676 7649 7626 7609 7581 7555 7530 7499 7481
2732G481j4k0j2j4nkj2lL%QJ3MRK1J6J2J9K0RJ9L4K7K4K0J2J0K6K2J5QPMlNRMnj4p
$$ 7481 7467 7447 7435 7421 7416 7414 7402 7399 7402 7402 7410 7423 7427 7436 7457 7473 7485 7504 7524 7533 7552 7586 7613 7637 7657 7669 7679 7705 7727 7742 7750 7757 7761 7758 7763 7772 7776 7771 7757 7750
2692G750jrj4j5j2j3qk0k2j3k0j7j6j1rk3k4k0j3rTj0rlJKNOMNKMJ6J1RJ3OK0J4J9
$$ 7750 7749 7740 7726 7711 7699 7686 7678 7658 7636 7623 7603 7586 7570 7559 7550 7527 7503 7483 7470 7461 7452 7442 7433 7430 7431 7433 7438 7444 7448 7453 7455 7459 7475 7486 7495 7508 7514 7534 7548 7567
2652G567K1J0K2K5K2J7J3TQJ2J5Qjpj4j9k5l3k6j5j1mJ3J8K0K6K2LmkmqnrTk0l1k7U
$$ 7567 7588 7598 7620 7645 7667 7684 7697 7710 7718 7730 7745 7753 7752 7745 7731 7712 7687 7654 7628 7613 7602 7598 7611 7629 7649 7675 7697 7700 7696 7694 7690 7682 7677 7668 7659 7639 7608 7581 7554 7527
2612G527k5k7k9k5l3l5k5k2plMK8TL1M0L6L2M1M2K9TL0K4J3QJ4MqopJ0K2K4L2L5L6
$$ 7527 7502 7475 7446 7421 7388 7353 7328 7306 7299 7296 7300 7328 7356 7387 7427 7463 7495 7536 7578 7607 7636 7666 7690 7703 7711 7725 7729 7721 7715 7708 7718 7740 7764 7796 7831 7867
2576G867L8K2J5J9J3ororj5j9j5j3k2k0j3k3k8k3Tk4k1k3k4j9k1Tj5k1j2kj%NJ8J1
$$ 7867 7905 7927 7942 7961 7974 7968 7959 7953 7944 7929 7910 7895 7882 7860 7840 7827 7804 7776 7753 7730 7706 7685 7662 7638 7619 7598 7577 7562 7541 7529 7527 7526 7526 7531 7549 7560
2540G560MRJ2J8J5J2J8K1UJ5J8K8J9J5J6J4J1J8K3K0QPJ1J0J2LmMmrmKmoTj0qoj1j9
$$ 7560 7564 7573 7585 7603 7618 7630 7648 7669 7690 7711 7726 7744 7772 7791 7806 7822 7836 7847 7865 7888 7908 7916 7923 7934 7944 7956 7959 7955 7959 7955 7946 7942 7944 7940 7934 7928 7918 7910 7904 7893 7874
2499G874j8k0j6j5k4k8j8rj5k4j9j4oMmTOlnQJ3J1J9K5J8J6J8K4L4L0K3L2K6K3L3L1
$$ 7874 7856 7836 7820 7805 7781 7753 7735 7726 7711 7687 7668 7654 7648 7652 7648 7644 7650 7647 7642 7650 7663 7674 7693 7718 7736 7752 7770 7794 7828 7858 7881 7913 7939 7962 7995 8026
2463H026K7K4J6K4K3J7K0K2RTJ1ROTLkmonj1j0j9j8Tj7k1k3Tk2k4k2k3k1j8j9k1k0
$$ 8026 8053 8077 8093 8117 8140 8157 8177 8199 8208 8217 8228 8237 8243 8249 8252 8250 8246 8240 8235 8224 8214 8195 8177 8159 8142 8121 8098 8075 8053 8029 8007 7984 7963 7945 7926 7905 7885
2426G885j3olj1ojj1mPTMNJ4J0J4TJ9J7J2J8K6K1J2J9K6K7L3L5J8KJ2K5J9J6TQLJr
$$ 7885 7872 7866 7863 7852 7846 7845 7834 7830 7837 7844 7848 7853 7867 7877 7891 7905 7924 7941 7953 7971 7997 8018 8030 8049 8075 8102 8135 8170 8188 8190 8202 8227 8246 8262 8278 8286 8289 8290 8281
2387H281k1k4k8m7n6o8p2q9j00j04j03r6r5r6q9r2q9p9q0q5q7p2m7l8m1k8j7rLL1M2
$$ 8281 8260 8236 8208 8161 8105 8037 7965 7876 7776 7672 7569 7473 7378 7282 7193 7101 7012 6933 6853 6768 6681 6609 6562 6524 6483 6455 6438 6429 6432 6463 6505
2356F505N1O8P9Q8J15J28J01k0j07j23j01n2j5j2k6k9oQoJ3N5O7O2P3O8Q4Q5P8O8O7
$$ 6505 6556 6624 6703 6791 6906 7034 7135 7115 7008 6885 6784 6732 6717 6705 6679 6650 6644 6652 6646 6659 6714 6781 6843 6916 6984 7068 7153 7231 7299 7366
2326G366M0K8RK0RJ5J3K1qk0j9k9k6j0jJ0K3L6L2L9L3TJ3K1RJmojo%J0J7J1J5J9K5
$$ 7366 7406 7434 7443 7463 7472 7487 7500 7521 7513 7493 7474 7445 7419 7409 7408 7418 7441 7477 7509 7548 7581 7614 7627 7648 7657 7658 7654 7648 7647 7641 7641 7651 7668 7679 7694 7713 7738
2289G738L1L2L3L1L5L7K9K8L0K7L4TK6K3J8J4K8TJ3J1J4J0J2Qmj0%mj3j4j3j5j9k2
$$ 7738 7769 7801 7834 7865 7900 7937 7966 7994 8024 8051 8085 8119 8145 8168 8186 8200 8228 8256 8269 8280 8294 8304 8316 8324 8320 8310 8310 8306 8293 8279 8266 8251 8232 8210
2255H210k3j4j6k3k0j5j3k2l2k3j5j9Tj4j7j5j2j3j5j3pmKPKMJ0J3J8J7K3J7K3L2K8
$$ 8210 8187 8173 8157 8134 8114 8099 8086 8064 8032 8009 7994 7975 7956 7942 7925 7910 7898 7885 7870 7857 7850 7846 7848 7855 7857 7861 7871 7884 7902 7919 7942 7959 7982 8014 8042
2220H042K3K9L3L1K5L3L4K0K5L2K6K5K8K2K1J9K1J9OKJnj1j5j2k2k4k7l4l3l7l2k6
$$ 8042 8065 8094 8127 8158 8183 8216 8250 8270 8295 8327 8353 8378 8406 8428 8449 8468 8489 8508 8514 8516 8517 8512 8501 8486 8474 8452 8428 8401 8367 8334 8297 8265 8239
2187H239k9l2Tk7k4k6k2j6j1j3j6j1rnpj1KPRJ4J0TJ3J4K4K6K3K5K8L2L1L4L8L1K8
$$ 8239 8210 8178 8146 8119 8095 8069 8047 8031 8020 8007 7991 7980 7971 7966 7959 7948 7950 7957 7966 7980 7990 8000 8013 8027 8051 8077 8100 8125 8153 8185 8216 8250 8288 8319 8347
2152H347L0K8L4L0K8K7K4K7J9J1PJ3J6OJnUk4k5j2j8k8l3l2k8l8Tk8k7l4l8k9k2l3
$$ 8347 8377 8405 8439 8469 8497 8524 8548 8575 8594 8605 8612 8625 8641 8647 8648 8643 8638 8633 8609 8584 8572 8554 8526 8493 8461 8433 8395 8357 8329 8302 8268 8230 8201 8179 8146
2117H146l6k2j4j7j3j2j1j2mLMNJ4TK2K1TK5TL2TK2K4L9N0M4L2K3K5L7L2K6K3K5K7
$$ 8146 8110 8088 8074 8057 8044 8032 8021 8009 8005 8008 8012 8017 8031 8045 8067 8088 8109 8134 8159 8191 8223 8245 8269 8308 8358 8402 8434 8457 8482 8519 8551 8577 8600 8625 8652
2082H652K9J8QL%mqlrj7j1j4k5k8k9l2l1k6l4m0m3l2k4l0l7Tl1k0j8Tk0Tj0qj4j3K
$$ 8652 8681 8699 8707 8710 8710 8706 8698 8695 8686 8669 8658 8644 8619 8591 8562 8530 8499 8473 8439 8399 8356 8324 8300 8270 8233 8196 8165 8145 8127 8109 8089 8069 8059 8051 8037 8024 8026
2045H026J0QkJK1K8K2K3TK2L0L1K8L2L4TL8L0L3L4K8K9K6K1TJ0kmJ1J3mnj0k7k9k4
$$ 8026 8036 8044 8042 8043 8064 8092 8114 8137 8160 8182 8212 8243 8271 8303 8337 8371 8409 8439 8472 8506 8534 8563 8589 8610 8631 8641 8639 8635 8646 8659 8655 8650 8640 8613 8584 8560
2009H560k2l0m2l7k0l2m7Tm1n0m8m4n3m9n0q3q0l6k5m9n1k5k3k2qJOJ4J6J5J6J8J0
$$ 8560 8538 8508 8466 8429 8409 8377 8330 8283 8242 8192 8144 8100 8047 7998 7948 7865 7785 7749 7724 7675 7624 7599 7576 7554 7546 7547 7553 7567 7583 7598 7614 7632 7642
1976G642lrj7k9m8o7p8j04j07q6q0q4r0r4q0o6n9n6n7n5n4n9o9q2r4j04j20j23Tj11
$$ 7642 7639 7630 7613 7584 7536 7469 7391 7287 7180 7094 7014 6930 6840 6746 6666 6600 6541 6485 6428 6373 6319 6260 6191 6109 6015 5911 5791 5668 5545 5434
1946E434r3q0p8j0P1R1J15J40J54J71J78J70J65J54J33J22J03P1N2M7M2J4PN3P8N0
$$ 5434 5341 5261 5183 5173 5244 5335 5450 5590 5744 5915 6093 6263 6428 6582 6715 6837 6940 7011 7063 7110 7152 7166 7173 7226 7304 7354
1920G354lqQ4R8N6K9L2M5K7MK5L9UK7Rnmj1k0k5m5p1q9r5p6p5r2j23j60j21m6o1r2
$$ 7354 7351 7343 7427 7525 7581 7610 7642 7687 7714 7718 7743 7782 7821 7860 7887 7896 7891 7887 7876 7856 7831 7786 7715 7626 7531 7455 7380 7288 7165 7005 6884 6838 6777 6685
1886F685r0p2n8Tn9n8n5Un9o1o6n7m6n7r1n1L8Q5R8R6J01J10J14J25J28J25J27J21
$$ 6685 6595 6523 6465 6407 6348 6290 6235 6180 6125 6066 6005 5939 5882 5836 5779 5688 5637 5675 5760 5858 5954 6055 6165 6279 6404 6532 6657 6784 6905
1857F905J15J07R5Q7P7P4P1N3L2N2N4m6m2J52J63Q2N0L0J2LL0K3nj7l5j10j70l8O2
$$ 6905 7020 7127 7222 7309 7386 7460 7531 7584 7616 7668 7722 7676 7634 7786 7949 8031 8081 8111 8123 8126 8156 8179 8174 8157 8122 8012 7842 7804 7866
1828G866k1j60j58j9l0q7r7j02j09j16j05r7j01j06j19j24j36r7o0q5q1o8o3n7p2m7
$$ 7866 7845 7685 7527 7508 7478 7391 7294 7192 7083 6967 6862 6765 6664 6558 6439 6315 6179 6082 6022 5937 5856 5788 5725 5668 5596 5549
1802E549LJ5Q1J33R8R3J46J16M3J23K21K33J85J36J12P0L7R2J04L4k0J7O4N4J0l7M
$$ 5549 5552 5567 5648 5781 5879 5972 6118 6234 6277 6400 6621 6854 7039 7175 7287 7357 7394 7486 7590 7624 7604 7621 7685 7739 7749 7712 7716
1775G716J3j01p3J70K02J9n5P2O7j6o2j29j94o0J3p9j61k03j01m2j01j56k34k10o1
$$ 7716 7729 7628 7555 7725 7927 7946 7891 7963 8030 8014 7952 7823 7629 7569 7582 7503 7342 7139 7038 6996 6895 6739 6505 6295 6234
1750F234r2j00l0j4m6r7p7Jm5j24k3O3K0m9j57j62J20J84N3k1N3R8O2N9O2O3R8J41
$$ 6234 6142 6042 6012 5998 5952 5855 5778 5779 5734 5610 5587 5650 5670 5621 5464 5302 5422 5606 5659 5638 5691 5789 5851 5910 5972 6035 6133 6274
1722F274J46R5k3n2K03K71J38J60K24J70P0L8P4K9p3n9K8P1R2o5l50k65M32J85j34
$$ 6274 6420 6515 6492 6440 6643 6914 7052 7212 7436 7606 7676 7714 7788 7817 7744 7685 7713 7784 7876 7811 7461 7196 7628 7813 7679
1697G679k42J33K52L0o9j03j13q8n0m5j76l70k51K17J95k2q3J1J4o9j78j36J27O8p8
$$ 7679 7437 7570 7822 7852 7783 7680 7567 7479 7429 7384 7208 6838 6587 6804 6999 6977 6894 6905 6919 6850 6672 6536 6663 6731 6653
1672F653q3o6n4J33J53O7K9k0o8O3J76J28Q2O5N7K3j01k67k39M41M51J41o0j55p1P8
$$ 6653 6570 6504 6450 6583 6736 6803 6832 6812 6744 6807 6983 7111 7193 7258 7315 7338 7237 6970 6731 7172 7623 7764 7704 7549 7478 7556
1646G556K67K01M4JMj1m9j26j55k18o3K63J09m5p8p9j29j70n3lj01k16j30N5Qo3r4
$$ 7556 7823 8024 8068 8069 8073 8062 8013 7887 7732 7514 7451 7714 7823 7778 7700 7621 7492 7322 7269 7266 7165 6949 6819 6874 6882 6819 6725
1619F725j53k56j28M0o6j72k40l18m24n56o53p43p69o74n18l60k06o9O4K03L53M81
$$ 6725 6572 6316 6188 6228 6162 5990 5750 5432 5008 4452 3799 3056 2287 1613 1095 735 529 460 524 727 1080 1561
1597A561N49N40N02M48L92L62L15K29Q6j10l39n14n08k78J01M86P16P24N30K40K26
$$ 1561 2110 2650 3152 3600 3992 4354 4669 4898 4984 4874 4535 4021 3513 3235 3336 3822 4538 5262 5792 6032 6258
1576F258M61L28J89J38L1j00O3K42R3n2r3J5L7q1k57m58l24Q8L44J33j39j53M1qj47
$$ 6258 6719 7047 7236 7374 7405 7305 7368 7610 7703 7651 7558 7573 7610 7529 7272 6814 6490 6578 6922 7055 6916 6763 6804 6796 6649
1551F649j83m6Oo5j53j72n3o1j22m6o8O2L66K80J36M0m1R9K65K16J38L9%N1J6K9Q5
$$ 6649 6466 6420 6426 6361 6208 6036 5983 5922 5800 5754 5686 5748 6114 6394 6530 6570 6529 6628 6893 7109 7247 7286 7286 7337 7353 7382 7467
1524G467p5k00j07J76J44j45k42J4L8l1j40j77r9j82k71k98l63k20J8o1k46m13n42
$$ 7467 7392 7192 7085 7261 7405 7260 7018 7032 7070 7039 6899 6722 6623 6441 6170 5872 5509 5289 5307 5246 5000 4587 4045
1501D045o27q36r71o91n34k96p5j0KL2J33K86L61N16O21O22O16N61M43L53K93K18J34
$$ 4045 3418 2582 1611 920 386 90 15 5 7 39 172 458 819 1335 1956 2578 3194 3755 4198 4551 4844 5062 5196
1478E196L4L8J10J7o9K4J60J15Rn5q9j40k29j81j65l02m25n34o62p39q16Tl39j07k9
$$ 5196 5230 5268 5378 5395 5326 5350 5510 5625 5634 5579 5490 5350 5121 4940 4775 4473 4048 3514 2852 2113 1297 481 142 35 6
1453Fj%K0L7N9P8R4J26J71K13K43K66K91L20K86L11O09N98M90M89M77L83L07L34K70
$$ 6 5 5 25 62 121 199 293 419 590 803 1046 1312 1603 1923 2209 2520 3129 3727 4217 4706 5183 5566 5873 6207 6477
1428F477J72J09J8l3N2P3m0j81j16J06O7L7K4kj2j4j0KJ3J6Lk6n0L7O8K9mo8q9J7K1
$$ 6477 6649 6758 6776 6743 6795 6868 6828 6647 6531 6637 6704 6741 6765 6763 6751 6737 6727 6729 6742 6758 6761 6735 6685 6722 6790 6819 6815 6747 6658 6675 6696
1397F696q2j45q5k3j03j88k06k25k81k74j74j57j70j53j33j23Uj27j19j17j25r3j4
$$ 6696 6614 6469 6384 6361 6258 6070 5864 5639 5358 5084 4910 4753 4583 4430 4297 4174 4051 3928 3801 3682 3565 3440 3347 3333
1373C333K6K0K2K3L6M7L8L0JjN6P1Q1P6O1N3M7L0K4J5KjKRL2M6N6P7R0R7Q5N2M6O5
$$ 3333 3359 3379 3401 3424 3460 3507 3545 3575 3576 3575 3631 3702 3783 3859 3920 3973 4020 4050 4074 4089 4091 4090 4092 4101 4133 4179 4235 4312 4402 4499 4584 4636 4682 4747
1339D747O2K0j9m6q4j14j20j09q9n0jM6P3R0R2Q5P2N1K3%j4l8n5o4o8n5k3NK0L3N1
$$ 4747 4809 4829 4810 4764 4680 4566 4446 4337 4248 4198 4197 4243 4316 4406 4498 4583 4655 4706 4729 4729 4715 4677 4622 4558 4490 4435 4412 4417 4437 4470 4521
1308D521N8N6N8N1M4M6M2L4K3Nj7k8l3m0m2l4k7j4nQK0K2K3J9J6J7K6L9M9P1R3R6J06
$$ 4521 4579 4635 4693 4744 4788 4834 4876 4910 4933 4938 4921 4893 4860 4820 4778 4744 4717 4703 4698 4706 4726 4748 4771 4790 4806 4823 4849 4888 4937 5008 5101 5197 5303
1275E303J14J15J09J12TJ10J01R8Q9Q2P8P2O1N2M5M9M3J7JTnj0rj7j8j7k3k9k7j9oT
$$ 5303 5417 5532 5641 5753 5865 5975 6076 6174 6263 6345 6423 6495 6556 6608 6653 6702 6745 6762 6763 6764 6759 6749 6740 6723 6705 6688 6665 6636 6609 6590 6584 6578
1243F578j2j5qrmMnk0Tj9k4k6k0k1k4j1OJ7J8J7K8L5K7L3L0K3J6RJj0k1k3l7n0n2o0
$$ 6578 6566 6551 6543 6534 6530 6534 6529 6509 6489 6470 6446 6420 6400 6379 6355 6344 6350 6367 6385 6402 6430 6465 6492 6525 6555 6578 6594 6603 6604 6594 6573 6550 6513 6463 6411 6351
1207F351p5q8j01j15j24j20j09q9o5l7j5j2j0j1j0j3k3m2o8j14j66k15k46k39j74n2
$$ 6351 6276 6188 6087 5972 5848 5728 5619 5530 5465 5428 5413 5401 5391 5380 5370 5357 5334 5292 5224 5110 4944 4729 4483 4244 4070 4018
1181D018J03K49L46L76L38K52J61J02N7L2K1J3%qk1k4l7o3q8j37j99k70l41l50k96
$$ 4018 4121 4370 4716 5092 5430 5682 5843 5945 6002 6034 6055 6068 6068 6060 6039 6015 5978 5915 5827 5690 5491 5221 4880 4530 4234
1156D234j87k9J54L18M32M59M03L23K47J93J60J39J23J08R4Q9P8O5M2M1M3L3J4Qj0
$$ 4234 4047 4018 4172 4490 4922 5381 5784 6107 6354 6547 6707 6846 6969 7077 7171 7260 7338 7403 7445 7486 7529 7562 7576 7584 7574
1131G574k9l9m5n2n4o3p9q6q5q4j01j08j00r8r3p6n5k3oPK4M0L1K6J8J3Mpj8k4k7l2
$$ 7574 7545 7506 7461 7409 7355 7292 7213 7127 7042 6958 6857 6749 6649 6551 6458 6382 6327 6304 6298 6305 6329 6369 6400 6426 6444 6457 6461 6454 6436 6412 6385 6353
1099F353l8l1k6k8l0k6k4j8j3k7m2n9q1j10j26j47j72j80j81j79j64j74k05k35k37
$$ 6353 6315 6284 6258 6230 6200 6174 6150 6132 6119 6092 6050 5991 5910 5800 5674 5527 5355 5175 4994 4815 4651 4477 4272 4037 3800
1074C800k14j70j18o5pN6J15J68K10K24K27K21J97J67J44J31J17R5Q2O9O2N9M8L7L1
$$ 3800 3586 3416 3298 3233 3226 3282 3397 3565 3775 3999 4226 4447 4644 4811 4955 5086 5203 5298 5380 5449 5511 5570 5618 5655 5686
1049E686K5J6J0T%rk9n3p7j11j73k68m03n49o57o80n93m26k56j37l6R1K36L45L84L71
$$ 5686 5711 5727 5737 5747 5747 5738 5709 5656 5579 5468 5295 5027 4624 4075 3418 2738 2145 1719 1463 1326 1290 1381 1617 1962 2346 2717
1023B717L36L04K81K53K37K25K09J94J76J59J47J30J05O9J6l4j01j62j58o1Q1K33L29
$$ 2717 3053 3357 3638 3891 4128 4353 4562 4756 4932 5091 5238 5368 5473 5542 5558 5524 5423 5261 5103 5042 5123 5356 5685
1000E685L13K08J08M8Kk7l3n3p2p6r1j10j18j20j26j32j16q7o1k6J3M0O8J00R5P5N3
$$ 5685 5998 6206 6314 6362 6364 6337 6304 6251 6179 6103 6012 5902 5784 5664 5538 5406 5290 5203 5142 5116 5129 5169 5237 5337 5432 5507 5560
973E560J2m0r1j27j28j24j08o6pN6J15J67K14K35K17J78J35J06Q3N4K4Kl4o0o7p8r2
$$ 5560 5572 5532 5441 5314 5186 5062 4954 4888 4881 4937 5052 5219 5433 5668 5885 6063 6198 6304 6387 6441 6465 6467 6433 6373 6306 6228 6136
946F136q0o8m4jL8O3R6J11J03R5Q9R0P4L3Nqk6n0o1o4p2q0r0q2r3j11j21j36j74k17
$$ 6136 6056 5988 5944 5943 5981 6044 6140 6251 6354 6449 6538 6628 6702 6735 6740 6732 6706 6656 6595 6531 6459 6379 6289 6207 6114 6003 5882 5746 5572 5355
916E355k65l09l50l71l67l44k86k04j17j0J01K08L06L77M30M64M60M26L76L14K62K16
$$ 5355 5090 4781 4431 4060 3693 3349 3063 2859 2742 2732 2833 3041 3347 3724 4154 4618 5078 5504 5880 6194 6456 6672
894F672J82J44J35J25J21J03Q7Q0P3N6L6J7RKj0j6k7l2l3m7n5m7Tn6Tm8m9l5m0m3l0
$$ 6672 6854 6998 7133 7258 7379 7482 7569 7649 7722 7778 7814 7831 7840 7842 7832 7816 7789 7757 7724 7677 7622 7575 7528 7472 7416 7368 7319 7284 7244 7201 7171
863G171k0j6k4k8k0k4j3j5l1m1o0r4j34j62j77j82j79j55j20q0l8K0P7J44K06K48K88
$$ 7171 7151 7135 7111 7083 7063 7039 7026 7011 6980 6939 6879 6785 6651 6489 6312 6130 5951 5796 5676 5596 5558 5578 5655 5799 6005 6253 6541
836F541L08L04K74K06J58J08P8M3J3Lj7k9l8n3Tn7q1q7p5p0q7q3n9m8o5p1o1n9m6j7
$$ 6541 6849 7153 7427 7633 7791 7899 7977 8020 8033 8036 8019 7990 7952 7899 7846 7789 7708 7621 7546 7476 7389 7306 7247 7199 7134 7063 7002 6943 6897 6880
806F880j1k4l6k5k3l2m4n7o3p4q6j01j32j59j76k01k12k21k30k42Tk52k61k75k94l13
$$ 6880 6869 6845 6809 6784 6761 6729 6685 6628 6565 6491 6405 6304 6172 6013 5837 5636 5424 5203 4973 4731 4489 4237 3976 3701 3407 3094
780C094l18l31l28l20l06k73k37k09j79j40j10q8o6m3l5k9k0j5j2ro%JK%OUNPLRJ6
$$ 3094 2776 2445 2117 1797 1491 1218 981 772 593 453 343 255 189 146 111 82 62 47 35 26 20 20 21 23 23 29 35 41 46 53 56 65 81
747H1K9N0Q3J32J86K27K67L02L29L54L84M26M59M73M37L55K92K44J87J73J57J26Q7
$$ 81 110 160 243 375 561 788 1055 1357 1686 2040 2424 2850 3309 3782 4219 4574 4866 5110 5297 5470 5627 5753 5840
724E840P5L0m8j00j36k04k80l64m25m58n20o04o96p25o19m18k25r0k9%P%nlK%JKjn
$$ 5840 5915 5945 5897 5797 5661 5457 5177 4813 4388 3930 3410 2806 2110 1385 766 348 123 33 4 4 11 11 6 3 5 5 6 8 7 2
694BK4J41L08M47M91M98N12M87M45L66K63J66J13P9N9O9R3P9P5Q2J18J44J36L4j92
$$ 2 26 167 475 922 1413 1911 2423 2910 3355 3721 3984 4150 4263 4342 4401 4470 4563 4642 4717 4799 4917 5061 5197 5231 5039
669E039k16O64N41K28J82J70J41J18J09Q1P0P9M6nl1m2k7m3n0p6l8mnj7j6j8j2l4p
$$ 5039 4823 5487 6028 6256 6438 6608 6749 6867 6976 7057 7127 7206 7252 7247 7216 7174 7147 7104 7054 6978 6940 6936 6931 6914 6898 6880 6868 6834 6827
640F827k5l2l1n9o1l7m2m6k4k5k7k1Jj7oqm1j12p1P3J63J30J24Q9L9L3O0N4L2j4n5
$$ 6827 6802 6770 6739 6680 6619 6582 6540 6494 6470 6445 6418 6397 6398 6381 6375 6367 6326 6214 6143 6216 6379 6509 6633 6722 6761 6794 6854 6908 6940 6926 6871
609F871l8k6o2q0o8n9r2j23j14r5o8p1p2q6r7p2n8rj1q0o9m1l3n4n1Tn5q7j51j54j39
$$ 6871 6833 6807 6745 6665 6597 6538 6446 6323 6209 6114 6046 5975 5903 5817 5720 5648 5590 5581 5570 5490 5421 5380 5347 5293 5242 5191 5136 5049 4898 4744 4605
578D605j32j62j80j82j98j71j35j53j41j28j19j15j19j23r8r7p8p9q5q4q0q2p1p5p2
$$ 4605 4473 4311 4131 3949 3751 3580 3445 3292 3151 3023 2904 2789 2670 2547 2449 2352 2274 2195 2110 2026 1946 1864 1793 1718 1646
553A646q0j06j03q6q7j03j07r5q0o5Tn2k1J9M0P3J19J63K36K92L19L53L91L78L51L24
$$ 1646 1566 1460 1357 1271 1184 1081 974 879 799 734 669 617 596 615 655 728 847 1010 1246 1538 1857 2210 2601 2979 3330 3654
527C654L23L25K43K18J91J15Q4J40J13P8R9J39J18J19R6Q6J09J60J11J09J49J39J31
$$ 3654 3977 4302 4545 4763 4954 5069 5153 5293 5406 5484 5583 5722 5840 5959 6055 6141 6250 6410 6521 6630 6779 6918 7049
504G049J15J23J58J22R1J06R5Q1J06J11N5L5nJ5R0N1m9j6l3j6Nk3n8o5r3o6p9m2j7
$$ 7049 7164 7287 7445 7567 7658 7764 7859 7940 8046 8157 8212 8247 8242 8257 8347 8398 8349 8333 8300 8284 8289 8266 8208 8143 8050 7984 7905 7863 7846
475G846j69j96N9R8n3j08j07J1L1n2p4RP3P1k4p2j10J23J06J5J00O6N5J22L8
$$ 7846 7677 7481 7540 7638 7585 7477 7370 7381 7412 7360 7286 7295 7368 7439 7415 7343 7233 7356 7462 7477 7577 7643 7698 7820 7858
450G858
$$ 7858
##END=
