##TITLE= Headspace from ripe banana
##JCAMP-DX= 5.00 $$From Command Line Converter 1.0
##DATA TYPE= GAS CHROMATOGRAPH
##ORIGIN= Dept of Chem, UWI, Mona, JAMAICA
##OWNER= Dr Robert J. Lancashire
##$URL= http://wwwchem.uwimona.edu.jm:1104/software/jcampdx.html
##SPECTROMETER/DATA SYSTEM= HP 5890 GC
##DATE= 11-26-1995
##TIME= 08:51:07
##XUNITS= TIME
##YUNITS= ARBITRARY
##XFACTOR= 2.000700e-005
##YFACTOR= 8.032600e-002
##FIRSTX=   0.000000
##LASTX=  20.01
##NPOINTS= 6004
##MAXY= 128636.000000
##MINY= 48310.000000
##FIRSTY= 48925.000000
##DELTAX=   0.003333
##XYDATA= (X++(Y..Y))
0F09080q7j12J62j25N0P5k5q7Q7J2q7n0J75M9l7L7j86O2o2O2K5%j37J12
4015F08993R9m9o3l7Q7l7o2L7O2k36j3N0J49j99O2Q8j3j37J3P4j99J3Q7q7j3
8163F08669n0K5j24K5P4m9k5%J24r9p5%K5K5k5R9j24k12J87k5o2j3O3o3J3o2
12495F08321P4%n0m9L7l7K5M9q7%l7Q7n0L8K4k11J49%J3j50Q7%L8O2o2j00P5
16977F08246%j00N0L7r9N0j3n0l7O2%K5%%%J00k49P5k5O2Q7j37q7j3Q8l8L8M9
21642F08121j74J00%%j3j2N0p5P5J49q7l7%p5K5Q7L7%j49J12j3q7l7J00L7L7
26007F08171r9P4j24N0M9P5j49N0Q7j50J99o2O2j49J37n0J3o3%K5J50j3L8k74
29989F08047L7N0j3K5P5n0K5L7N0j37K5l7l7j3Q7%O2j86P4O3O2p5N0%N0k5j25
$$ plain form
0 609080 608993 608881 609043 608918 608968 609043 609018 608931 609018 609030 608943 608893 609068 609117 609080 609117 608931 608993 608931 608993 609018 609018 608881 608993
4015 608993 609092 609043 608980 608943 609030 608993 608931 608968 609030 608794 608781 608831 608980 608781 608843 608931 608918 608781 608794 608868 608669 608682 608769 608682 608669
8163 608669 608619 608644 608520 608545 608619 608570 608545 608545 608669 608570 608495 608495 608520 608545 608520 608619 608495 608283 608470 608445 608383 608370 608433 608370 608383 608321
12495 608321 608395 608395 608345 608296 608333 608296 608321 608370 608283 608283 608246 608333 608283 608321 608345 608134 608283 608283 608296 608146 608233 608233 608271 608333 608271 608171 608246
16977 608246 608246 608146 608196 608233 608134 608184 608171 608121 608084 608146 608146 608171 608171 608171 608171 608271 608022 608097 608072 608134 608221 608084 607997 607984 608072 608034 608072 608121
21642 608121 607947 608047 608047 608047 608034 608022 608072 607997 608072 608221 608134 608097 608097 608022 608047 608134 608171 608171 608022 608134 608121 608034 607997 608097 608134 608171
26007 608171 608072 608146 608022 608072 608121 608196 608047 608097 608184 608034 608233 608171 608233 608084 608221 608171 608184 608121 608121 608146 608296 608283 608321 608047
29989 608047 608084 608134 608121 608146 608221 608171 608196 608233 608283 608146 608171 608134 608097 608084 608171 608171 608233 608047 608121 608184 608246 608171 608221 608221 608271 608246 608121
34471F08121J00P5j12l8Q7o2O2o2k5Q7j2q7J12o2j3k5J25n0k5j2L7%k5J00p5
38669F08221j49J2O2Q7r9N0J2j2J2Q7j12r9J99q7j3k5K5O2%m9J2j2O2p5K5o2
42984F08134N0L7P5o3q7k5O3%J2Q7l7Q7o2n0%n0N0J2O3j12R9J3p5J00n0%K5n0
47649F08246j3L8J24p4O2j37J24%J3j12O2j00J50l8p4k5Q7J2j24J49l7N0j87
51498F08196%J00M9m9Q7J2j12J3Q7j12J74p5p4P4J3j00J37k5J37j37K5%r9P4
55480F08395%L8J37n0O2J2p4O2l7n0k5k5%J49k4q8O3j50J00L7j37N0j62J99J3
59629F08495j12J99o2p5J25K4o2N0J2J00N0n0J99r9k5J62O2j00o2O2Q7m9O2j3
63661F08980l7j2l8k5k5P5k5J00L7l7%R9k4O2l8j2N0N0J2J49N0N0J99J87L11
$$ plain form
34471 608121 608221 608296 608184 608146 608233 608171 608233 608171 608146 608233 608221 608134 608246 608184 608171 608146 608271 608221 608196 608184 608221 608221 608196 608296 608221
38669 608221 608072 608084 608146 608233 608134 608184 608196 608184 608196 608283 608171 608072 608271 608184 608171 608146 608171 608233 608233 608184 608196 608184 608246 608171 608196 608134
42984 608134 608184 608221 608296 608233 608146 608121 608184 608184 608196 608283 608246 608333 608271 608221 608221 608171 608221 608233 608296 608184 608283 608296 608221 608321 608271 608271 608296 608246
47649 608246 608233 608271 608395 608321 608383 608246 608370 608370 608383 608271 608333 608233 608383 608345 608271 608246 608333 608345 608221 608370 608333 608383 608196
51498 608196 608196 608296 608345 608296 608383 608395 608283 608296 608383 608271 608445 608370 608296 608370 608383 608283 608420 608395 608532 608395 608420 608420 608321 608395
55480 608395 608395 608433 608570 608520 608582 608594 608520 608582 608545 608495 608470 608445 608445 608594 608570 608482 608545 608395 608495 608532 608395 608445 608283 608482 608495
59629 608495 608383 608582 608520 608445 608570 608594 608532 608582 608594 608694 608744 608694 608893 608794 608769 608931 608993 608893 608831 608893 608980 608931 608993 608980
63661 608980 608943 608931 608893 608868 608843 608918 608893 608993 609030 608993 608993 609092 609068 609130 609092 609080 609130 609180 609192 609341 609391 609441 609640 609827 610138
67809F10138K49M86P09Q59J332J693K441K826L684M793N515O848Q614J0371J3283
70308F73841J5923J9296K2608K6206L0388L3576L7896M0559M4320M5278M7718
72124A037609M8664M9025M8266M7942M5540M3684M1033L7920L4920L2530K6953
73990A494086K6231K1226J7528J5014J3396Q004N764J75l959r84m48n365p881
76156A582787q465r848j2076j3208j3084j4466j4691j5611j7753j6794j7454
77972A429337j7466j7304j6521j6059j5138j3819j1914j0146p681n279k540P47
79972A296217L835O473Q877J1714J3881J5612J7578J8674J9010J9545J9421J8973
81954A469810J6906J8213J6483J4093J3059R997P806M954J905L598L735q09l636
$$ plain form
67809 610138 610387 610873 611582 612441 613773 615466 617907 620733 624417 629210 634725 641573 650187 660558 673841
70308 673841 689764 709060 731668 757874 788262 821838 859734 900293 944613 989891 1037609
72124 1037609 1086273 1135298 1183564 1231506 1277046 1320730 1361763 1399683 1434603 1467133 1494086
73990 1494086 1520317 1541543 1559071 1574085 1587481 1595485 1601249 1601424 1597465 1596481 1596033 1590668 1582787
76156 1582787 1574322 1564474 1552398 1539190 1526106 1511640 1496949 1481338 1463585 1446791 1429337
77972 1429337 1411871 1394567 1378046 1361987 1346849 1333030 1321116 1310970 1303289 1298010 1295470 1296217
79972 1296217 1300052 1306525 1315402 1327116 1340997 1356609 1374187 1392861 1411871 1431416 1450837 1469810
81954 1469810 1486716 1504929 1521412 1535505 1548564 1558561 1566367 1571321 1573226 1576824 1580559 1579750 1576114
84120A576114m693n515p295r113r462j0482j2399j2724j3246j5076j5711j5238
86153A445160j6545j6868j7355j7590j7517j7889j7989j7815j7392j7665j7392
87969A253143j7230j6906j6221j5599j5188j4641j3644j3607j2736j2063j0906
89785A094402j0868j0544r723r088q665q241q117p843p408p245p158o910o822
91951I85770o872o337o996p669o212o138o710o685o274o026o237n752p631n876
94283H94355o424n988n727n764n676o536n839n552n727n590n453n328n266m967
96616H14518m943m880n129m120m644m083l461l909l337l162k664k639k166k129
98982G63252j805j731j581j344j370j183j257j245j183j195j257j382j344j594
$$ plain form
84120 1576114 1571421 1565906 1558611 1549498 1540036 1529554 1517155 1504431 1491185 1476109 1460398 1445160
86153 1445160 1428615 1411747 1394392 1376802 1359285 1341396 1323407 1305592 1288200 1270535 1253143
87969 1253143 1235913 1219007 1202786 1187187 1171999 1157358 1143714 1130107 1117371 1105308 1094402
89785 1094402 1083534 1072990 1063267 1054179 1045514 1037273 1029156 1021313 1013905 1006660 999502 992592 985770
91951 985770 978898 972561 965565 957896 951684 945546 938836 932151 925877 919851 913614 907862 900231 894355
94283 894355 887931 881943 876216 870452 864776 858240 852401 846849 841122 835532 830079 824751 819485 814518
96616 814518 809575 804695 799566 795446 790802 786719 783258 779349 776012 772850 770186 767547 765381 763252
98982 763252 761447 759716 758135 756791 755421 754238 752981 751736 750553 749358 748101 746719 745375 743781
101314G43781j494j519j543j743j780j955j930j879k055k029k017k191k116k166
103647G17364k266k166k316k353k104k228k303k179k104k104k128k104k067k004
105979F86938k005j867j718j581j394j034n72j37P09J669K390L598M892O561Q017
108478G04466R785J1392J2785J4653J5885J7479J7864J9757K0218J9197K1114
110294H84595J9769K0031K0355J8151J7615J8127J5100J3072J2524J2213J1192
112110A062744R835Q005N577M357L884K764J369J37o59j619k838m494n379n776
114443A077907o461o797o636p021p370p495q229r001r137r873j0382r673r076
116609I70756j0607r175q764r113q328p956q004q964p818p494o474o324o188o174
$$ plain form
101314 743781 742287 740768 739225 737482 735702 733747 731817 729938 727883 725854 723837 721646 719530 717364
103647 717364 715098 712932 710616 708263 706159 703931 701628 699449 697345 695241 693113 691009 688942 686938
105979 686938 684933 683066 681348 679767 678373 677339 676767 676630 677339 679008 681398 684996 689888 696449 704466
108478 704466 714251 725643 738428 753081 768966 786445 804309 824066 844284 863481 884595
110294 884595 904364 924395 944750 962901 980516 998643 1013743 1026815 1039339 1051552 1062744
112110 1062744 1072579 1080584 1086161 1090518 1094402 1097166 1098535 1098672 1098013 1096394 1093556 1089062 1083683 1077907
114443 1077907 1071446 1064649 1058013 1050992 1043622 1036127 1027898 1018897 1009760 999887 989505 979832 970756
116609 970756 960149 950974 942210 933097 924769 916813 908809 899845 892027 884533 878059 871735 865547 859373
118975H59373n814m918m681m880m494m083l735m183l760l710l610l772l424m046
121307H00263l149l511l299l411l212l262l212k950k938k801k615k004j892j295
123640G60712j245p97o34j75k74K5l7M61J070J245J556J482J369J370J356J432
126305G68916R46Q72O84O10M24J12%k49n11r46q84j207j419j494j768j917k104
129104G60065k303k515k440k789k714l087k976k913l124k926l150l224l212l125
131470G19567l224l200l099l138l037l137k876l100k789k788k777k664k689k577
133803F78472k552k627k340k403k465k004k129k203j843j992j817j918j718j743
136135F48718j493j669j655j233j419j320j394j245j170j083j146j033j108r09
$$ plain form
118975 859373 853559 848641 843960 839080 834586 830503 826768 822585 818825 815115 811505 807733 804309 800263
121307 800263 797114 793603 790304 786893 783681 780419 777207 774257 771319 768518 765903 763899 762007 760712
123640 760712 759467 758670 758036 757861 757587 757612 757575 758036 759106 760351 761907 763389 764758 766128 767484 768916
126305 768916 769862 770734 771418 772028 772452 772564 772564 772315 771804 770858 769974 768767 767348 765854 764086 762169 760065
129104 760065 757762 755247 752807 750018 747304 744217 741241 738328 735204 732278 729128 725904 722692 719567
131470 719567 716343 713143 710044 706906 703869 700732 697856 694756 691967 689179 686402 683738 681049 678472
133803 678472 675920 673293 670953 668550 666085 664081 661952 659749 657906 655914 654097 652179 650461 648718
136135 648718 647225 645556 643901 642668 641249 639929 638535 637290 636120 635037 633891 632858 631750 630841
138468F30841r96j045o73r46p59o97o35n23m86l61j37L8K99M23Q21J295J693K204
141467F30356K502K988L672M395M507N091N453O163O286O910O772O934P059O972
143799G06060P096O810O237O374N677N315N229M445M382L871L411K926K627K266
146132G72726J942J245J020N23N0l98n60j034j419j282j930k291k315k477k690
148631G61110k975k913l212l212l224l113l274l573l236l611l386l511l436l585
150963G14849l610l324l349l536l037l287l000k938k876k926k763k777k776k751
153296F71899k540k440k427k552k490k191k490k042k042j842j618j743j693j432
155612F42357j345j381j407j034j145j021r83r34n60o10l24k5L24N85J407J967
$$ plain form
138468 630841 629845 628800 628127 627181 626422 625725 625090 624567 624081 623720 623583 623621 623920 624343 625164 626459 628152 630356
141467 630356 632858 635846 639518 643913 648420 653511 658964 665127 671413 678323 685095 692029 699088 706060
143799 706060 713156 719966 726203 732577 738254 743569 748798 753243 757625 761496 764907 767833 770460 772726
146132 772726 774668 775913 776933 777456 777506 777108 776548 775514 774095 772813 770883 768592 766277 763800 761110
148631 761110 758135 755222 752010 748798 745574 742461 739187 735614 732378 728767 725381 721870 718434 714849
150963 714849 711239 707915 704566 701030 697993 694706 691706 688768 685892 682966 680203 677426 674650 671899
153296 671899 669359 666919 664492 661940 659450 657259 654769 652727 650685 648843 647225 645482 643789 642357
155612 642357 641012 639631 638224 637190 636045 635024 634041 633107 632547 631937 631613 631588 631912 632497 633904 635871
158294F35871K901M046N402O624Q453J0507J2536J4491J6296J8213K0181K1761
160277G77282K2844K3990K5845K4625K6193K5608K6280K3032K5695K2371K1413
162093A045178K1662J8238J7865J6258J4603J2923J0918R237P818O947M706L423
164092A189776J743N98l61r71l337m345n975n814p345p905q615q790r660j0956
166458A118043j1154j0520j0594j1802j1814j1254j1491j2263j2997j2075j2275
168291I89804j1205j1279j2561j0881j1852j0395r548j1267j0233r636r225j0009
170273H61713r897r026q577q155q179p370p855p569o798o411o324o462o286n690
172606G57114n664n241m968m643m594m905m444m246m182m022l622l797l411l461
$$ plain form
158294 635871 638772 642818 648220 654844 663297 673804 686340 700831 717127 735340 755521 777282
160277 777282 800126 824116 849961 874586 900779 926387 952667 975699 1001394 1023765 1045178
162093 1045178 1066840 1085078 1102943 1119201 1133804 1146727 1157645 1166882 1174700 1181647 1186353 1189776
164092 1189776 1191519 1192117 1191756 1190785 1187448 1183103 1177128 1171314 1163969 1156064 1147449 1138659 1128999 1118043
166458 1118043 1106889 1096369 1085775 1073973 1062159 1050905 1039414 1027151 1014154 1002079 989804
168291 989804 978599 967320 954759 943878 932026 921631 912083 900816 890583 880947 871722 861713
170273 861713 851816 842790 834213 826058 817879 810509 802654 795085 788287 781876 775552 769090 762804 757114
172606 757114 751450 746209 741241 736598 732004 727099 722655 718409 714227 710205 706583 702786 699375 695914
174938F95914l113l124k938k926k764k863k403k340k403k141k266k154k141k029
177254F60309j768j979j644j792j507j506j581j494j407j232j482j170r21j370
179587F39456q96j195r46j071q47r71p34p60r33p35p59p10p22p47n60p47n48o60
182602F24915n85n35o22m36o10m23m74l85m36m98m23k99m48n36m11k86l61l73
185601F16774m24l48k87k36l98l24j74m24k24m48k74j49k87k61k86l36j25k24
188617F11545k12r9j99j25k5n0k49j24q7N0n0O2J24l7j2K24J24J12K99J12J37
192082F11520J74K00K24K98J62K37R9K49J62L11J50P5J61J12J50J87J12j00J99
195264F14682J37N0J2k5%%k4o3o2p5P5j74K5j25j49L7j99j62q7L7k24j2j12j75
$$ plain form
174938 695914 692801 689677 686739 683813 681049 678186 675783 673443 671040 668899 666633 664479 662338 660309
177254 660309 658541 656562 654918 653126 651619 650113 648532 647038 645631 644399 642917 641747 640826 639456
179587 639456 638560 637365 636419 635348 634501 633530 632796 632036 631103 630368 629609 628899 628177 627430 626870 626123 625575 624915
182602 624915 624330 623795 623173 622737 622127 621704 621230 620845 620409 619911 619488 619189 618741 618205 617794 617508 617147 616774
185601 616774 616350 616002 615715 615479 615081 614757 614583 614159 613935 613487 613213 613064 612777 612516 612230 611894 611769 611545
188617 611545 611333 611234 611035 610910 610885 610835 610586 610462 610375 610425 610375 610437 610561 610524 610512 610736 610860 610972 611271 611383 611520
192082 611520 611694 611894 612118 612416 612578 612815 612914 613163 613325 613636 613786 613861 614022 614134 614284 614471 614583 614483 614682
195264 614682 614819 614869 614881 614856 614856 614856 614832 614769 614707 614632 614707 614533 614558 614433 614284 614321 614122 613960 613873 613910 613686 613674 613562 613387
199246F13387o2j37j49j62j62n0j24k5j00J3j50j61k5k62J00j50j2j74j3j86%
202762F11396j00L7r9j12p5k5j37o2J2m9k49p5j87j62k86k37j2k37k61L7p4k62
206444F08781Q7j24j12j00J12j99P5j25k5K5j49L7n0q7%j74P5%j00n0p4j00l7
210259F07686n0l7%K4k36%N0l8p4n0k5j00o2Q7j49q7j3n0p4J87k62%P5j12J37
214408F06827j75p4M9p4J24k74o2L8p5J24j24j00K5k5n0m9j3j87J75J2j49N0%
218273F05993M9j61O2Q7j00p4L7o2j50J00l7n0L7l7n0j49J37j00J2l7J00j25%
222072F05482P5p5r9M9m9M9l7j00N0%O2j74P5n0%J99o2o2R9k5P5l7L7J74p4P4
226437F05656Q8j3J25K5K11j2N0O2o2K4j2J2P5r9O2J12j74%j00J00n0p5j2M9j2
$$ plain form
199246 613387 613325 613188 613039 612877 612715 612665 612541 612516 612416 612429 612279 612118 612093 611831 611931 611781 611769 611595 611582 611396 611396
202762 611396 611296 611333 611234 611122 611047 611022 610885 610823 610835 610786 610537 610462 610275 610113 609827 609590 609578 609341 609080 609117 609043 608781
206444 608781 608868 608744 608632 608532 608644 608445 608520 608395 608370 608395 608246 608283 608233 608146 608146 607972 608047 608047 607947 607897 607823 607723 607686
210259 607686 607636 607599 607599 607623 607387 607387 607437 607399 607325 607275 607250 607150 607088 607175 607026 606939 606926 606876 606802 606989 606727 606727 606802 606690 606827
214408 606827 606652 606578 606627 606553 606677 606403 606341 606379 606304 606428 606304 606204 606229 606204 606154 606105 606092 605905 606080 606092 605943 605993 605993
218273 605993 606042 605881 605943 606030 605930 605856 605893 605831 605681 605781 605744 605694 605731 605694 605644 605495 605632 605532 605544 605507 605607 605482 605482
222072 605482 605557 605482 605383 605432 605383 605432 605395 605295 605345 605345 605407 605233 605308 605258 605258 605457 605395 605333 605432 605407 605482 605445 605482 605656 605582 605656
226437 605656 605744 605731 605856 605881 606092 606080 606130 606192 606130 606154 606142 606154 606229 606130 606192 606304 606130 606130 606030 606130 606080 606005 605993 606042 606030
230585F06030K5j12R9o2q7J00k00Q8M9%l7q7P5j00O2q7P5%O2L7p4J49J25R9J62
234734F06391J87K98K62M11O84N61P72J157J171J630J781K066K316K913L112L498
237416F29210L598M121M382M494M756N005M929N192N515N229M992N116M843M781
239732F96163M531M096L785L672L224K802K589K303J793J431J096P97O84L61k48
242231G29079j37n98r96p10j058j494j232j544k029j917k278k378k142k365k291
244731G05910k676k502k540k527k640k465k514k702k627k601k478k191k303k353
247063F70791k191k328k253k030k104k178k067k116j868j817j805j644j792j531
249396F43067j594j544j456j407j382j295j294j183j096j245j058j083j058p47
$$ plain form
230585 606030 606055 605943 606042 605980 605893 605993 605793 605881 605930 605930 605893 605806 605881 605781 605843 605756 605831 605831 605893 605930 605856 606005 606130 606229 606391
234734 606391 606578 606876 607138 607549 608233 608794 609566 610723 611894 613524 615305 617371 619687 622600 625712 629210
237416 629210 632808 636929 641311 645805 650561 655566 660495 665687 671202 676431 681423 686539 691382 696163
239732 696163 700694 704790 708575 712247 715471 718273 720862 723165 724958 726389 727485 728282 728966 729327 729079
242231 729079 728942 728344 727348 726638 725580 724086 722854 721310 719281 717364 715086 712708 710566 708201 705910
244731 705910 703234 700732 698192 695665 693025 690560 688046 685344 682717 680116 677638 675447 673144 670791
247063 670791 668600 666272 664019 661989 659885 657707 655640 653524 651656 649839 648034 646390 644598 643067
249396 643067 641473 639929 638473 637066 635684 634389 633095 631912 630816 629571 628513 627430 626372 625625
251728F25625j046r83m98r59p59q34p10p84n11o97n85n97n86m73m73k74o72m48
254727F13736k61m36n48k12m60k49m48j87k49l24l23k00l48j50j12k11k24l24
257743F08470k5j00k73j00k5j74j87j12j87j2j74o3j2j87J3j75K5r9n0o2n0q7
261425F06354j3o2p5L8j3j49%p5%j2l8r9j3o2k5N0j50L8o2O2n0j12N0J2q7L7r9
265923F05445Q7k5k5n0j24j3j2K5k5k5p5%J3%%l8m9L7n0r9R9N0j00N0q7N0K5j25
270571F04959J00R9p4J2L8%J2J2m9R9n0L8J2p4J61j86Q7j3N0J3j3%N0q7J12L7
274903F05345r9J2j2O2o2J37p5p5j37Q7P5j12L7N0J3j12J2q7o2%n0N0o3K5K5q7
279218F04897N0j3m9%j00J2o2n0O3j3J00q7j50l7N0%n0j74%P4%j62l7j2%n0q7
$$ plain form
251728 625625 624579 623596 623098 622139 621380 620546 619836 619052 618541 617844 617259 616662 616076 615603 615130 614856 614184 613736
254727 613736 613475 613039 612491 612279 611819 611570 611122 610935 610686 610362 610039 609839 609491 609341 609229 609018 608794 608470
257743 608470 608445 608345 608072 607972 607947 607773 607586 607474 607287 607275 607101 607038 607026 606839 606852 606677 606702 606603 606553 606491 606441 606354
261425 606354 606341 606279 606204 606242 606229 606080 606080 606005 606005 605993 605955 605856 605843 605781 605756 605806 605656 605694 605632 605694 605644 605532 605582 605594 605507 605544 605445
265923 605445 605532 605507 605482 605432 605308 605295 605283 605308 605283 605258 605183 605183 605196 605196 605196 605158 605109 605146 605096 604997 605096 605146 605046 605096 605009 605059 605084 604959
270571 604959 605059 605158 605084 605096 605134 605134 605146 605158 605109 605208 605158 605196 605208 605134 605295 605109 605196 605183 605233 605246 605233 605233 605283 605196 605308 605345
274903 605345 605246 605258 605246 605308 605246 605383 605308 605233 605096 605183 605258 605146 605183 605233 605246 605134 605146 605059 604997 604997 604947 604997 604934 604959 604984 604897
279218 604897 604947 604934 604885 604885 604785 604797 604735 604685 604748 604735 604835 604748 604598 604561 604611 604611 604561 604387 604387 604461 604461 604299 604262 604250 604250 604200 604113
283750F04113J49k5n0O3l8m9n0j3%j2l8%j2j24M9P5j87J50j50J50n0J37j00O2
287732F04050j2K5j12J37k5k5J00p5J37J2j2L7J00J2J3Q7j3K5J37q7J99o2J00
291547F04748%%J99q7L7J00J2Q7J00j12J24%K5p5J00k5J00N0j75Q7N0O2k11J49
295563F05345j2P4j2L7%p4J74n0K49p5K25R9J00M11L36L48N23N85N11Q71R96R59
299211F11620R08J382J357J357J332J656J843J618J917J780J905J880J556J930
301544F34041J730J606J494J482J307J282J108J096J095P35P47O59M11M36J49
304043F49378J37J50O2j50j99j99k61n85n86l61q09o22o60q59q22q71p97q34p97
307209F40315r09j083q34r58q84q72r33r34p60q46r59r46r21o72q22q59p97p34
$$ plain form
283750 604113 604262 604237 604187 604250 604212 604163 604113 604100 604100 604088 604050 604050 604038 603914 603963 604038 603851 604001 603851 604001 603951 604088 603988 604050
287732 604050 604038 604063 603951 604088 604063 604038 604138 604063 604200 604212 604200 604237 604337 604349 604362 604449 604436 604461 604598 604511 604710 604648 604748
291547 604748 604748 604748 604947 604860 604897 604997 605009 605096 605196 605084 605208 605208 605233 605158 605258 605233 605333 605383 605208 605295 605345 605407 605196 605345
295563 605345 605333 605407 605395 605432 605432 605358 605532 605482 605731 605656 605881 605980 606080 606491 606827 607175 607698 608283 608794 609665 610661 611620
299211 611620 612528 613910 615267 616624 617956 619612 621455 623073 624990 626770 628675 630555 632111 634041
301544 634041 635771 637377 638871 640353 641660 642942 644050 645146 646241 646976 647723 648382 648793 649229 649378
304043 649378 649515 649665 649727 649577 649378 649179 648918 648333 647747 647386 646577 645955 645295 644436 643614 642743 641946 641112 640315
307209 640315 639406 638323 637489 636531 635647 634775 633842 632908 632148 631302 630343 629397 628476 627804 626982 626123 625326 624592
310224F24592q47p97m97o98o59p10o72o73m85n98m10n48m86l86m73l73l74l36
313240F14570l86m11j61k37j62k49j49k24k49P4j49n0j37o2J00q8K00l8j12%J12
316705F12192Q7K37J00K61Q7L74J37M10J25L24K98K87K98M86K99K99O47K24M73
319888F17645L49M60N11M85M61L48M74M60M11K99L48L24M61M35J12K49L61K37
322886F24430L7L12q8J25J62n0L7k5j2J2p4k37j62N0l98j87j87k74j37m35j75
326402F22724k98k99k37k86k49k99k99k61l98k62k49l24k98j99k99k12m11n0k98
329534F17496k99j25j61j87j00p4k25P5j24K5k5Q7J99O2K74J12K87K49K73K99
332883F18118L49M73M48N10L99O97M36N23O22O47M98O73N72N23N35L99M98N97
$$ plain form
310224 624592 623745 622948 622451 621753 621094 620384 619712 619039 618554 617956 617546 616998 616512 616126 615653 615280 614906 614570
313240 614570 614184 613773 613612 613375 613213 612964 612815 612591 612342 612416 612267 612217 612080 612018 612118 612030 612230 612192 612080 612080 612192
316705 612192 612279 612516 612616 612877 612964 613338 613475 613885 614010 614334 614632 614919 615217 615703 616002 616301 616948 617172 617645
319888 617645 617994 618454 618965 619450 619911 620259 620733 621193 621604 621903 622251 622575 623036 623471 623583 623832 624193 624430
322886 624430 624467 624779 624691 624816 624978 624928 624965 624940 624928 624940 624866 624629 624467 624517 624119 623932 623745 623471 623334 622899 622724
326402 622724 622426 622127 621890 621604 621355 621056 620757 620496 620098 619836 619587 619263 618965 618766 618467 618255 617844 617794 617496
329534 617496 617197 617072 616911 616724 616624 616550 616325 616400 616276 616301 616276 616363 616562 616624 616898 617010 617297 617546 617819 618118
332883 618118 618467 618940 619388 619898 620297 620994 621430 621953 622575 623222 623720 624393 624965 625488 626023 626422 626920 627517
335899F27517M49M35M24L36K11L36K37J62J37J49J00N0R9j87r9k12q7l11j75k48
339197F29323j62m11k86m49l86k98m24m23m48n23m48m98m23n73l49l48p22l61
342196F21791n61m35m48n11k74n60l98m48l49l98m61l49l48k99n98l36l11j99
345212F14508l98l86l49j87l98l11l49k36j13k86k61k24k24k25k36j87k24j87
348228F09727k86o2j50j86k5k37j62q7j37k49Q7k86J37k61j50J25n0p5p4K49j50
351693F07698L7O3%K5J74P5K5J99J86O3J86L8R9K74J99J00K74O2J87J99L11Q7
355375F10561K74K00J49L61J87L11M36K61N73K99O10L98O47O48Q59P22P96R47
358391F19239J020R84J158J170J170J233J307J232J283J269J183J108J382J008
$$ plain form
335899 627517 627966 628401 628825 629161 629372 629708 629945 630107 630244 630393 630493 630543 630642 630455 630356 630144 630057 629746 629571 629323
339197 629323 629161 628750 628464 628015 627629 627331 626907 626484 626036 625513 625065 624567 624144 623571 623222 622874 622152 621791
342196 621791 621230 620795 620347 619836 619562 619002 618604 618156 617807 617409 616948 616599 616251 615952 615354 615018 614707 614508
345212 614508 614110 613724 613375 613188 612790 612479 612130 611894 611781 611495 611234 611010 610786 610561 610325 610138 609914 609727
348228 609727 609441 609379 609229 609043 609018 608781 608619 608532 608395 608146 608233 607947 608084 607823 607673 607798 607748 607673 607599 607848 607698
351693 607698 607735 607798 607798 607823 607997 608072 608097 608296 608482 608545 608731 608769 608868 609142 609341 609441 609715 609777 609964 610163 610474 610561
355375 610561 610835 611035 611184 611545 611732 612043 612479 612740 613313 613612 614222 614620 615267 615915 616774 617496 618292 619239
358391 619239 620259 621243 622401 623571 624741 625974 627281 628513 629796 631065 632248 633356 634738 635746
360723F35746J270J096P59J008Q47R96P47O35O35J74M36K86J25J74%K5k74j00
363722F44585l36j62m23k24m98n73o10o59o98m85o35n98q21p97o23p46p23o84
366688F34290p97o60o47q34o60p22p22o48o72p59o35o23n47o35n98n97n98l49
369687F22587n85m60m98n11n47j75n60l36l49m23l24m48j74l24m11k98k62k99
372702F15603l23j25m23k49l61k61k25k24k24k61j99k87l11j49j87j74k49k00
375718F11171k61l73n0j75k49k24o2k86p5k36k00o2j74k62o2k5j24j87j49k62
379017F07673K5j74%k49P5k74j75k5m9p5j2q8j61R9q7o2j12l8j2J2j49N0L7j24
383032F06105L7j2%J2L7j49K5P5J2O2n0J50R9r9Q7K12%n0J37l8Q8Q7J12N0R9L7
$$ plain form
360723 635746 637016 638112 638871 639879 640726 641722 642469 643104 643739 643913 644349 644635 644760 644934 644934 644959 644685 644585
363722 644585 644249 644087 643664 643440 642942 642369 641759 641100 640402 639917 639282 638684 637863 637066 636443 635697 634974 634290
366688 634290 633493 632833 632186 631352 630692 629970 629248 628600 627928 627169 626534 625911 625364 624729 624131 623534 622936 622587
369687 622587 622002 621542 621044 620533 619986 619811 619251 618915 618566 618143 617819 617371 617197 616873 616462 616164 615902 615603
372702 615603 615280 615155 614732 614483 614122 613861 613636 613412 613188 612927 612728 612441 612130 611981 611794 611620 611371 611171
375718 611171 610910 610537 610487 610312 610063 609839 609777 609491 609416 609180 608980 608918 608744 608482 608420 608395 608271 608084 607935 607673
379017 607673 607698 607524 607524 607275 607350 607076 606901 606876 606827 606752 606740 606652 606491 606590 606503 606441 606329 606291 606279 606291 606142 606192 606229 606105
383032 606105 606142 606130 606130 606142 606179 606030 606055 606130 606142 606204 606154 606304 606403 606304 606391 606603 606603 606553 606690 606652 606740 606827 606939 606989 607088 607125
387364F07125J13R9L7J00N0p5P5J74%L7Q8%%%M9N0p4K4j37L8J2j2N0k00J12r9
391679F07636q7j3n0r9N0j37%j12j37P4j24j99n0o2j87J24r9q7q7k5n0j25j12
395528F06042l7p5j49%q7%j50m9o3O3o3P5Q7%o2J99J3O2K49j00L24P5K24L23L24
399676F07225K99L48N73N23M61P09M48P35Q09O10Q96O85Q47P84R46Q72R46Q21
402692F19537Q97P96P97R09O47P10O97N73P72N97M73M24M35L49K99K11K87J49
405708F29559O2Q7l7k61O2%k74j87o2l49l73j99k49l24m36m60k74m61j86m61n48
409173F24629m11l48m24k49l48k62l61l86k11l36l12j99j86l99r9j12p5l61n0
412355F19500k37j74q7n0l36p5j49j37j99j37j49j62n0k49l7j25k74j49j25r9
$$ plain form
387364 607125 607238 607337 607374 607474 607524 607449 607524 607698 607698 607735 607823 607823 607823 607823 607872 607922 607848 607872 607735 607773 607785 607773 607823 607623 607735 607636
391679 607636 607549 607536 607486 607387 607437 607300 607300 607188 607051 607125 607001 606802 606752 606690 606503 606627 606528 606441 606354 606329 606279 606154 606042
395528 606042 606005 605930 605781 605781 605694 605694 605544 605495 605432 605495 605432 605507 605594 605594 605532 605731 605744 605806 606055 605955 606279 606354 606578 606901 607225
399676 607225 607524 607872 608445 608968 609429 610138 610586 611321 612130 612740 613636 614321 615168 615952 616898 617770 618716 619537
402692 619537 620434 621230 622027 622936 623583 624293 624990 625563 626335 626932 627405 627829 628264 628613 628912 629123 629410 629559
405708 629559 629621 629708 629671 629410 629472 629472 629198 629011 628949 628600 628227 628028 627779 627455 627019 626559 626285 625824 625638 625177 624629
409173 624629 624218 623870 623446 623197 622849 622587 622226 621840 621629 621293 620981 620782 620596 620197 620098 619986 619911 619550 619500
412355 619500 619263 619089 619002 618952 618616 618541 618392 618255 618056 617919 617770 617608 617558 617309 617272 617147 616873 616724 616599 616500
415704F16500k49q7k87k49k24k49j37k49k86k5l98j87j49k62k49j49j75l48j62
418870F12379k12j99j99j99k99n0k86j12k62j99j99k24j12q7k99j74j00k24p5
422002F08868j86q8j12j61l8k11%k00q7j37%j24j25o2j12%j00j24p5%q7n0%q7
426034F06702j12%O2p4M9k48P4p4P4%j49j12Q7%k5n0N0K5j25%Q8q8m9Q7n0O2o2
430515F06142J2o2J3R9L8J12j12R9J62L7J62N0J87L11L36L61M48O73O10Q96Q09
433998F11383J058J420J605J893J942K303K714K851L249L635L660M482M444M694
436363F51333M780N129N590N627N764N615N839N913N702O087O026N652N403N079
438696G29539M718M320M644M307M308L635L062K565K166K515K004J581O10N98
$$ plain form
415704 616500 616251 616164 615877 615628 615404 615155 615018 614769 614483 614458 614060 613873 613724 613462 613213 613064 612889 612541 612379
418870 612379 612167 611968 611769 611570 611271 611221 610935 610823 610561 610362 610163 609939 609827 609740 609441 609267 609167 608943 608868
422002 608868 608682 608594 608482 608321 608283 608072 608072 607872 607785 607648 607648 607524 607399 607337 607225 607225 607125 607001 606926 606926 606839 606789 606789 606702
426034 606702 606590 606590 606652 606578 606627 606379 606453 606379 606453 606453 606304 606192 606279 606279 606254 606204 606254 606279 606154 606154 606242 606154 606105 606192 606142 606204 606142
430515 606142 606154 606092 606105 606204 606242 606354 606242 606341 606503 606540 606702 606752 606939 607250 607586 607947 608395 609068 609678 610574 611383
433998 611383 612441 613861 615466 617359 619301 621604 624318 627169 630418 634053 637713 642195 646639 651333
436363 651333 656113 661242 666832 672459 678223 683838 689677 695590 701292 707379 713405 719057 724460 729539
438696 729539 734257 738577 743221 747528 751836 755471 758533 761098 763264 765779 767783 769364 769974 770572
441028G70572Q7j87k36k5q34p97j033j656k241k378j992k141k403k527k689l174
443694G46346k976k739k776l112l287l137l573l486l087l424l187l187k714k913
446027G02748l025l162l112k889k925k440k851k764k639k639k602k204k141k428
448359F64927k191j992k240k179j979j768j818j768j817j793j494j581j456j283
450692F39568j407j269j171j170j220j133j157r96j084r58j046q34j058p35p09
453191F23621p97q47n97p22n98q09m98m61o47o35n48l98m61m35n36l11n85k74
456190F13462l86l61k99m48k49l73k24k49l61k74k24j25l11k49j99k12r9j75k11
459322F08433j62j99n0k99l7j87o2j87j74n0k49q7O2k24%n0j24p5%n0j74j62J49
$$ plain form
441028 770572 770659 770472 770236 770211 769377 768580 767547 765891 763650 761272 759280 757139 754736 752209 749520 746346
443694 746346 743370 740631 737855 734743 731456 728319 724746 721260 718173 714749 711562 708375 705661 702748
446027 702748 699723 696561 693449 690560 687635 685195 682344 679580 676941 674302 671700 669496 667355 664927
448359 664927 662736 660744 658504 656325 654346 652578 650760 648992 647175 645382 643888 642307 640851 639568
450692 639568 638161 636892 635721 634551 633331 632198 631041 630045 628961 628003 626957 626123 625065 624330 623621
453191 623621 622824 621977 621380 620658 620060 619251 618753 618292 617645 617010 616462 616064 615603 615168 614632 614321 613736 613462
456190 613462 613076 612715 612416 611968 611719 611346 611122 610873 610512 610238 610014 609889 609578 609329 609130 608918 608819 608644 608433
459322 608433 608271 608072 608022 607723 607686 607499 607437 607250 607076 607026 606777 606690 606752 606528 606528 606478 606354 606279 606279 606229 606055 605893 606042
463187F06042k86N0K5j25K5j74Q7n0%n0j37j2N0q7j3l7L7l7k5q7%j37%Q7q7k5
467503F05034J12o2j37Q7%q7R9r9l8N0N0j74O2n0j2J24r9%j3J37j99n0O2m9j87
471651F04561J74j24N0k5%q8J00j2%j00l7O2j99Q7j3%K5L8J2j24k5n0n0J25l8
475850F04349j2K5k5p5J87j00j37k5%N0r9J61j86k5O2j12K12o3j49J00n0P5L7
479648F04200j12K5j12l8J37l7j00m9J24n0k5%k5m9J2o2K5L7j2j50N0p5N0P5j37
483847F03702J2r9J49p5%%m9J2%J37j00%p4R9r9K5j00J3l8K5N0p5P5j25P5%K5
488345F03565Q7k12K00n0%j50J25%Q7q7Q7q7L7N0l7%P4p4%j12Q7P5n0L7J00j12
492660F03640P4%j24O2l7j3J37j37O3k5l8%N0%%%j2M9j24J49%P5%%J12j99J62
$$ plain form
463187 606042 605756 605806 605831 605706 605731 605557 605644 605594 605594 605544 605407 605395 605445 605358 605345 605308 605345 605308 605283 605196 605196 605059 605059 605146 605059 605034
467503 605034 605146 605084 604947 605034 605034 604947 605046 604947 604909 604959 605009 604835 604897 604847 604835 604959 604860 604860 604847 604984 604785 604735 604797 604748 604561
471651 604561 604735 604611 604661 604636 604636 604548 604648 604636 604636 604536 604499 604561 604362 604449 604436 604436 604461 604499 604511 604387 604362 604312 604262 604387 604349
475850 604349 604337 604362 604337 604262 604449 604349 604212 604187 604187 604237 604138 604299 604113 604088 604150 604038 604250 604187 604038 604138 604088 604163 604200
479648 604200 604088 604113 604001 603963 604100 604063 603963 603914 604038 603988 603963 603963 603938 603889 603901 603839 603864 603901 603889 603739 603789 603714 603764 603839 603702
483847 603702 603714 603615 603764 603689 603689 603689 603640 603652 603652 603789 603689 603689 603615 603714 603615 603640 603540 603553 603515 603540 603590 603515 603590 603465 603540 603540 603565
488345 603565 603652 603440 603640 603590 603590 603440 603565 603565 603652 603565 603652 603565 603602 603652 603615 603615 603689 603615 603615 603503 603590 603665 603615 603652 603752 603640
492660 603640 603714 603714 603590 603652 603615 603602 603739 603602 603665 603640 603602 603602 603652 603652 603652 603652 603640 603689 603565 603714 603714 603789 603789 603789 603901 603702 603864
497142F03864K5k5J37j99Q7O2O2r9j25J49%K5K5J3J62j62K49k49K49j12l8q7%
501007F04013J50o3L8n0J12j62J62j50N0Q7J3n0j2O2j00L8n0%j25J25l8q7N0j2
504989F04001q7n0%%N0j12%L7j99O2N0q7p5R9j24%K5q7J2N0J00j62o3K5K5n0J3
509471F03453n0L7q7J3K5k5Q7j00J50j50l7Q7j49J12k5j00l7L7l7%J12%j99J24
513503F03241r9K5M9j74P5K5M9J00j00%J13j13l7J3Q7l8o2N0o2P4k5%j36J49o2
517652F03142l8N0j2j50J99k4K4k4k5%%J74j25J50l7J49j37P5J2%%O2L8Q7k37
521800F03353K49N0%j2J74j00o2Q7J3l8J37L8n0k5L49k62%l7N0P4j37N0n0j2J99
525999F04038k5o2N0%q7p5K5n0J49r9n0J87j00%r9n0N0%R9j99J37j74J37j00j3
$$ plain form
497142 603864 603889 603864 604001 603802 603889 603951 604013 603914 603789 603938 603938 603963 603988 604001 604163 604001 604250 604001 604250 604138 604100 604013 604013
501007 604013 604163 604100 604138 604088 604200 604038 604200 604050 604100 604187 604200 604150 604138 604200 604100 604138 604088 604088 603963 604088 604050 603963 604013 604001
504989 604001 603914 603864 603864 603864 603914 603802 603802 603839 603640 603702 603752 603665 603590 603689 603565 603565 603590 603503 603515 603565 603665 603503 603440 603465 603490 603440 603453
509471 603453 603403 603440 603353 603366 603391 603366 603453 603353 603503 603353 603316 603403 603254 603366 603341 603241 603204 603241 603204 603204 603316 603316 603117 603241
513503 603241 603142 603167 603216 603042 603117 603142 603191 603291 603191 603191 603304 603191 603154 603167 603254 603216 603154 603204 603142 603216 603191 603191 603055 603204 603142
517652 603142 603104 603154 603142 602992 603191 603167 603191 603167 603142 603142 603142 603316 603191 603341 603304 603453 603316 603391 603403 603403 603403 603465 603503 603590 603353
521800 603353 603602 603652 603652 603640 603814 603714 603652 603739 603752 603714 603851 603889 603839 603814 604163 603901 603901 603864 603914 603988 603851 603901 603851 603839 604038
525999 604038 604013 603951 604001 604001 603914 603839 603864 603814 603963 603864 603814 604001 603901 603901 603802 603752 603802 603802 603901 603702 603839 603665 603802 603702 603689
530147F03689J00k5r9M9K5J12J3j12o3k4P4%J50k24%M9N0n0N0k5k5J50j12L7N0
534296F03839k5p5P5k5%N0j00O3J36j24K5l7J12P4p4Q7M9q7j74J62l7p5N0J2L7
538494F03938l7N0o2K5Q7%q7P4l7Q7n0%l7l7p5K5n0J00%k5M9k4K4N0l7O2n0%%
543326F03963m9M9m9Q7O2j74R9J3o3J00K5j3q7%K5J00l8o2K5K5k36K61j00J00
547308F04063k5q7L7N0n0%n0l7J37%j99J99j24%J24j49%k5R9p4K5j3L7m9K5j12
551623F03802M9j2n0J3O2o2R9r9%L7l7M9o2k5Q7m9j3n0P5o2%j3J25k5j50J00%
556155F03789%n0J00n0j24K4m9R9j24P4K5N0j62J87%n0l7O2j24J49q7J00j00o2
560137F03640R9K5n0k5O3L7q7J2K5%j24R9j24J2J62k5J3%j3%J3j62J99O2%k11
$$ plain form
530147 603689 603789 603764 603665 603714 603739 603851 603864 603752 603689 603665 603739 603739 603889 603665 603665 603714 603764 603714 603764 603739 603714 603864 603752 603789 603839
534296 603839 603814 603739 603814 603789 603789 603839 603739 603802 603938 603814 603839 603802 603914 603988 603914 604001 604050 603963 603789 603951 603914 603839 603889 603901 603938
538494 603938 603901 603951 603889 603914 604001 604001 603914 603988 603951 604038 603988 603988 603951 603914 603839 603864 603814 603914 603914 603889 603938 603914 603938 603988 603951 604013 603963 603963 603963
543326 603963 603914 603963 603914 604001 604063 603889 603988 604001 603938 604038 604063 604050 603963 603963 603988 604088 604050 603988 604013 604038 603802 604063 603963 604063
547308 604063 604038 603951 603988 604038 603988 603988 603938 603901 604038 604038 603839 604038 603914 603914 604038 603889 603889 603864 603963 603889 603914 603901 603938 603889 603914 603802
551623 603802 603851 603839 603789 603802 603864 603802 603901 603802 603802 603839 603802 603851 603789 603764 603851 603802 603789 603739 603814 603752 603752 603739 603864 603839 603689 603789 603789
556155 603789 603789 603739 603839 603789 603665 603689 603640 603739 603615 603689 603714 603764 603602 603789 603789 603739 603702 603764 603640 603789 603702 603802 603702 603640
560137 603640 603739 603764 603714 603689 603752 603789 603702 603714 603739 603739 603615 603714 603590 603602 603764 603739 603752 603752 603739 603739 603752 603590 603789 603851 603851 603640
564452F03640K5P4q7j2k5P4N0n0p4P4l7J00J2o2O2n0J00N0p5q7N0Q7j00n0J3j3
568817F03689m9%J2J12j49p5K24j24K5j62J37j50J62l7j00J37%j49Q7l7j3j37
572466F03403J00q7k5R9q7n0j2N0%j00O2l7j25J3n0Q7p4K4l7l7J37j3j37%L8k5
576781F03117K5l8r9R9j2k5n0K5%J12%%n0l7L7L8k5N0%L7o2j00K24K5J3%j3O2
581446F03353q7L8Q7j25L24l7M9l7j25K12J12j2L7J00p5P5J12j3P5N0P4J3Q7J00
585461F04387p5L7J62P5k5j3J87K5j2J49o2J49n0l7J99j2O2q7J99j24J24J00j00
589277F05258L7j2K5%p5J62l7j00P5n0j25Q8j3l7j87P5j50%O3q8%j24K5n0k5j37
593642F04598O3k5j00p5r9n0J00K4p4j12M9j86n0k5O2o2p5o2L7j24N0R9p4j75
$$ plain form
564452 603640 603665 603739 603652 603640 603615 603689 603739 603689 603615 603689 603652 603752 603764 603702 603764 603714 603814 603864 603789 603702 603752 603839 603739 603689 603702 603689
568817 603689 603640 603640 603652 603764 603615 603540 603764 603640 603665 603503 603640 603490 603652 603615 603515 603652 603652 603503 603590 603553 603540 603403
572466 603403 603503 603416 603391 603490 603403 603353 603341 603391 603391 603291 603353 603316 603191 603204 603154 603241 603167 603191 603154 603117 603254 603241 603104 603104 603142 603117
576781 603117 603142 603104 603005 603104 603092 603067 603017 603042 603042 603154 603154 603154 603104 603067 603104 603142 603117 603167 603167 603204 603142 603042 603266 603291 603304 603304 603291 603353
581446 603353 603266 603304 603391 603266 603590 603553 603602 603565 603440 603652 603764 603752 603789 603889 603814 603889 604001 603988 604063 604113 604187 604200 604287 604387
585461 604387 604312 604349 604511 604586 604561 604548 604735 604760 604748 604897 604835 604984 604934 604897 605096 605084 605146 605059 605258 605134 605258 605358 605258
589277 605258 605295 605283 605308 605308 605233 605395 605358 605258 605333 605283 605158 605246 605233 605196 605009 605084 604934 604934 604997 604909 604909 604785 604810 604760 604735 604598
593642 604598 604661 604636 604536 604461 604362 604312 604412 604436 604362 604250 604299 604113 604063 604038 604100 604038 603963 603901 603938 603814 603864 603963 603889 603714
597624F03714j12J37j49p5J74p4j12J2j2j3l7J00q8J37k36J99j2j00J12N0j99
601139F03416J86r9N0Q7M9N0P5P5R9l7J99J99O3J86K99O2L24J99J99M24K49M73
604788F06827L48M73N73N23N23P09N48O72Q22O72O97Q35Q46R34Q21Q35Q46P97
607787F19301R58R34R46R09P84Q84Q47P72P22P47Q59L86O22Q22L73M73N48L98
610802F32285J75L98L49%J49K37o3P5o2j12p5j24k74j75l86k49l11m23m11l86
614101F30617k99l61o34l49m73o48l98n73o22m48m86o60n97n23n10o10m98l86
617100F21542p35m11o59m49n22m61n11m35n11m98m23m61m48l36n48l48m48l99
620116F12939l11l86l98k49k99m11k24k74k11l61k49k00j99l24j12k86o2l11j87
$$ plain form
597624 603714 603602 603739 603590 603515 603689 603615 603503 603515 603503 603490 603453 603553 603465 603602 603366 603565 603553 603453 603565 603615 603416
601139 603416 603602 603503 603553 603640 603689 603739 603814 603889 603988 603951 604150 604349 604412 604598 604897 604959 605283 605482 605681 606105 606354 606827
604788 606827 607175 607648 608221 608744 609267 609976 610524 611196 612018 612690 613387 614222 615068 616002 616823 617658 618504 619301
607787 619301 620259 621193 622139 623048 623832 624716 625563 626335 627057 627804 628663 629049 629671 630493 630866 631339 631887 632285
610802 632285 632460 632858 633207 633207 633356 633593 633530 633605 633543 633431 633356 633232 632958 632783 632397 632148 631837 631414 631003 630617
614101 630617 630318 629957 629323 628974 628501 627853 627455 626882 626260 625812 625326 624666 624069 623546 623036 622426 621928 621542
617100 621542 620807 620396 619737 619288 618766 618305 617794 617359 616848 616350 615927 615466 615018 614682 614134 613786 613338 612939
620116 612939 612628 612242 611844 611595 611296 610885 610661 610387 610176 609815 609566 609366 609167 608843 608731 608445 608383 608072 607885
623298F07885l7k62k36k62j2j25k11k00q7j74k5k24l7q8m9j25j87j2J2k11p5%
626930F05258j00j24q7j00Q7j24j00j12J3o3q7J25j99k5p5p5%K5j24o3j2j00O3
630795F04001j00J3k25N0N0p5N0o2q7Q7n0o2K5L7o2%q7%l8K5p4Q7n0j3P5j2q7
635277F03416P4j37N0J3j12%L7k5L7N0o2J2%l7K5j37J2L8L7n0K5N0j2o3n0K5K5
639776F03241K5K5j37N0L7q7O2r9N0M9r9J37j37K5K5n0n0Q7j12K5P5j37N0l8K5
643924F03042J12j99J62%j12J2j2J2%k5J3L7l7O2%n0k5O3n0R9m9l8k5J00n0P5
648289F03117o2Q7j50N0l7R9J3o2q8j2J37%K5j00J37j37k5l7l7k5%J24o2O2j12
652438F02905J00q7L7J2p4%n0j00J25L7j62K5J25k5p5N0n0k5N0%j12Q7j49J24
$$ plain form
623298 607885 607848 607586 607350 607088 607076 606951 606740 606540 606453 606279 606254 606030 605993 605905 605856 605731 605544 605532 605544 605333 605258 605258
626930 605258 605158 605034 604947 604847 604934 604810 604710 604598 604611 604548 604461 604586 604387 604362 604287 604212 604212 604237 604113 604050 604038 603938 604001
630795 604001 603901 603914 603689 603739 603789 603714 603764 603702 603615 603702 603652 603590 603615 603652 603590 603590 603503 603503 603465 603490 603416 603503 603453 603440 603515 603503 603416
635277 603416 603490 603353 603403 603416 603304 603304 603341 603316 603353 603403 603341 603353 603353 603316 603341 603204 603216 603254 603291 603241 603266 603316 603304 603241 603191 603216 603241
639776 603241 603266 603291 603154 603204 603241 603154 603216 603117 603167 603216 603117 603254 603117 603142 603167 603117 603067 603154 603042 603067 603142 603005 603055 603017 603042
643924 603042 603154 602955 603117 603117 603005 603017 603005 603017 603017 602992 603005 603042 603005 603067 603067 603017 602992 603055 603005 603104 603055 603017 602992 603092 603042 603117
648289 603117 603055 603142 602992 603042 603005 603104 603117 603055 602967 602955 603092 603092 603117 603017 603154 603017 602992 602955 602918 602893 602893 603017 602955 603017 602905
652438 602905 603005 602918 602955 602967 602893 602893 602843 602743 602868 602905 602743 602768 602893 602868 602793 602843 602793 602768 602818 602818 602706 602793 602644 602768
656420F02768j2q7J24k5k5J12o2J3J2j24P4L8j00O2P5n0K5N0j12Q7n0j24J74q7
660435F02756j00N0O2k5J00q7n0J2N0%Q7j49L7O3j37M9j2O2j2%J2j49J37J2r9
664584F02669j50J87O2o2l7o3N0L8%P4j62Q8R9n0O3j00J37l7o3P5o2O2k5J00p5
668782F02818L7L8O2j2J12j37K5n0N0O2L7q7%J00j00O2K5l7N0j3l7l8N0k5J3n0
673114F02955n0%J37N0p5n0N0o2%J12p5l7O2j12J87j25N0j2n0J2p4%k5L7L8K4
677429F02967Q8j00l7n0%P5k5M9k4j75J50j62J49q7%p5O3%%L7p5r9j3J12k5p4
681744F02669L7J49k11R9j74L7K12j49P4j24J24j74L7J62p4n0R9%q7L8J2j00N0
685610F02656j62J62%L8%k5K5J2l7K5l8J00j12k5P5%P4r9j3O2o2O2o2J00J2j49
$$ plain form
656420 602768 602756 602669 602793 602768 602743 602855 602793 602806 602818 602694 602768 602806 602706 602768 602843 602793 602818 602868 602756 602843 602793 602669 602843 602756
660435 602756 602656 602706 602768 602743 602843 602756 602706 602718 602768 602768 602855 602706 602743 602806 602669 602718 602706 602768 602756 602756 602768 602619 602756 602768 602669
664584 602669 602519 602706 602768 602706 602669 602606 602656 602694 602694 602768 602606 602694 602793 602743 602806 602706 602843 602806 602743 602818 602756 602818 602793 602893 602818
668782 602818 602855 602893 602955 602943 603055 602918 602943 602893 602943 603005 603042 602955 602955 603055 602955 603017 603042 603005 603055 603042 603005 602967 603017 602992 603005 602955
673114 602955 602905 602905 603042 603092 603017 602967 603017 602955 602955 603067 602992 602955 603017 602905 603092 602967 603017 603005 602955 602967 602893 602893 602868 602905 602943 602967
677429 602967 603055 602955 602918 602868 602868 602943 602918 602967 602943 602768 602918 602756 602905 602818 602818 602743 602806 602806 602806 602843 602768 602669 602656 602768 602743 602669
681744 602669 602706 602855 602644 602743 602569 602606 602818 602669 602743 602619 602743 602569 602606 602768 602694 602644 602743 602743 602656 602694 602706 602606 602656
685610 602656 602494 602656 602656 602694 602694 602669 602694 602706 602669 602694 602656 602756 602644 602619 602694 602694 602768 602669 602656 602718 602656 602718 602656 602756 602768 602619
689925F02619K5P4j24P5j3%Q7N0j87%m9K61k24j00K5P5P5j00n0J00%Q7j62J3L7
694073F02594J2j2J2o2n0J50p5j2M9j37J50n0k5N0q7j3K5k5l7N0N0%j3n0P5%p5
698605F02494J12j2J24m9P4l7j2J12L7N0J24J25%J99N0J99J2L12Q7K86J00K49
702254F04636K49K11K87J24L24K24J37K86K49L24J24L61Q7K62J12K36K00L11Q7
705419F08831J99J99J50K61J00J49J25K49J62R9J87P5j3J62J37J62Q7k5P5J24
708768F11495J74p4J37l8J37n0l7J25M9k4L7%J2j49Q7l7k5J49j49j50J25j25p4
712583F11595N0%j75J3l8P5l7q7K4q7j86M9K5j24j3j74O2%j12k5p4P4r9j12j00
716732F10524n0%j12O3k37N0j50j49%j2Q7q7j87L7k11J12j87p5%n0j49K5j50K5
$$ plain form
689925 602619 602644 602718 602594 602669 602656 602656 602743 602793 602606 602606 602557 602818 602594 602494 602519 602594 602669 602569 602519 602619 602619 602706 602544 602557 602594
694073 602594 602606 602594 602606 602544 602494 602644 602569 602557 602606 602469 602619 602569 602544 602594 602507 602494 602519 602494 602457 602507 602557 602557 602544 602494 602569 602569 602494
698605 602494 602606 602594 602718 602669 602743 602706 602694 602806 602843 602893 603017 603142 603142 603341 603391 603590 603602 603914 604001 604287 604387 604636
702254 604636 604885 605096 605383 605507 605831 606055 606192 606478 606727 607051 607175 607536 607623 607885 607997 608233 608433 608744 608831
705419 608831 609030 609229 609379 609640 609740 609889 610014 610263 610425 610524 610711 610786 610773 610935 611072 611234 611321 611296 611371 611495
708768 611495 611669 611595 611732 611694 611831 611781 611744 611869 611918 611894 611931 611931 611943 611794 611881 611844 611819 611968 611819 611669 611794 611669 611595
712583 611595 611645 611645 611470 611483 611445 611520 611483 611396 611420 611333 611147 611196 611221 611097 611084 610910 610972 610972 610860 610835 610761 610835 610736 610624 610524
716732 610524 610474 610474 610362 610425 610188 610238 610088 609939 609939 609927 610014 609927 609740 609777 609566 609678 609491 609416 609416 609366 609217 609242 609092 609117
720764F09117j37l7%n0j24%j25p4%j50K5j00k4j00j37J3j3o2j00K5j24n0n0q7
724746F07636J12j25j74J00j00Q7j86J49k24l7L7q7o3m9J2j2q7o3n0j74J37n0
728428F06789r9j50L8k5p5j37J00j87n0j2q7n0k5J2j86K49k00Q8k62J12j99l7
732060F05607j3j2j37q7J49j12L7q7k36J86j86P4J25j25J3j00j12J74j99k5P5
735592F05009j00j12Q8J2O2r9p5J12q7K5j74J36j12q7%J12r9j62N0%L7%N0n0q7
739741F04449%j3j49j24K36j87%j49j3O3j3l7N0j25J3J2n0p4J2J3j3j12p5J50
743756F03864k5q7J49q7o2N0q8L8n0q7j3%j2l7J12L7k37K5O3M9j12O3l8r9j3J50
748088F03553j37L7l7o3j2l7q8%Q8o3K5%n0J50k49j50N0J37r9n0J37k5k24J62
$$ plain form
720764 609117 608980 608943 608943 608893 608769 608769 608644 608570 608570 608420 608445 608345 608321 608221 608084 608097 608084 608022 607922 607947 607823 607773 607723 607636
724746 607636 607748 607623 607449 607549 607449 607536 607350 607499 607275 607238 607275 607188 607125 607076 607088 607076 606989 606926 606876 606702 606839 606789
728428 606789 606690 606540 606578 606553 606478 606341 606441 606254 606204 606192 606105 606055 606030 606042 605856 606105 605905 605993 605731 605843 605644 605607
732060 605607 605594 605582 605445 605358 605507 605395 605432 605345 605109 605295 605109 605183 605308 605183 605196 605096 604984 605158 604959 604934 605009
735592 605009 604909 604797 604885 604897 604959 604860 604785 604897 604810 604835 604661 604797 604685 604598 604598 604710 604611 604449 604499 604499 604536 604536 604586 604536 604449
739741 604449 604449 604436 604287 604163 604399 604212 604212 604063 604050 604113 604100 604063 604113 603988 604001 604013 603963 603889 603901 603914 603901 603789 603714 603864
743756 603864 603839 603752 603901 603814 603752 603802 603714 603752 603702 603615 603602 603602 603590 603553 603665 603702 603465 603490 603553 603602 603490 603553 603515 603416 603403 603553
748088 603553 603416 603453 603416 603353 603341 603304 603216 603216 603304 603241 603266 603266 603216 603366 603117 602967 603017 603154 603055 603005 603142 603117 602893 603055
752053F03055L7J2J3k24%q7R9j2j37Q7j37J37l7j12K4J37m9q8K5j24K5l8O3j12
756085F02557q8k4l8j87J25j00k5j99j2K11j99L8J2k12L12j12R9j87J37%m9J2
759734F02071P5j37%R9j2n0P5j99J49o2L7N0N0j00J50J2k37J50K5O2j37J00M9
763582F02220K5q7J00j00J50j00O2K5n0m9O2J2n0Q8l8L8j3p5Q8%j62J49J3%M9
767731F02357o2j24P4P5K5%q7Q7J00j37Q7J12%N0J2K5%J12j49j00N0O2K5j25k4
771879F02445%J2o2l8%K00j12J2N0j87J25%j00J00j87J49l7k5l7M9J3n0J49j24
775911F02345k5o2N0%J2L7%J3j12Q7j87J62%J25j25L7m9J49n0J3j12K11o2%j2
780060F02445n0%P4k4K4j2l7M9Q8j87L7J3K5J2J62j00j62O3L7j2M9p4K5j87N0
$$ plain form
752053 603055 603092 603104 603117 602893 602893 602806 602905 602893 602756 602843 602706 602843 602806 602694 602718 602855 602806 602718 602743 602619 602644 602606 602669 602557
756085 602557 602469 602445 602407 602220 602345 602245 602220 602021 602009 602220 602021 602059 602071 601859 602171 602059 602158 601971 602108 602108 602059 602071
759734 602071 602146 602009 602009 602108 602096 602046 602121 601922 602071 602009 602046 602096 602146 602046 602196 602208 601971 602121 602146 602208 602071 602171 602220
763582 602220 602245 602158 602258 602158 602308 602208 602270 602295 602245 602196 602258 602270 602220 602308 602270 602308 602295 602220 602308 602308 602146 602295 602308 602308 602357
767731 602357 602295 602171 602245 602320 602345 602345 602258 602345 602445 602308 602395 602507 602507 602557 602569 602594 602594 602706 602557 602457 602507 602569 602594 602469 602445
771879 602445 602445 602457 602395 602357 602357 602557 602445 602457 602507 602320 602445 602445 602345 602445 602258 602407 602370 602345 602308 602357 602370 602320 602469 602345
775911 602345 602320 602258 602308 602308 602320 602357 602357 602370 602258 602345 602158 602320 602320 602445 602320 602357 602308 602457 602407 602420 602308 602519 602457 602457 602445
780060 602445 602395 602395 602469 602445 602469 602457 602420 602469 602557 602370 602407 602420 602445 602457 602619 602519 602357 602420 602457 602445 602494 602420 602445 602258 602308
784208F02308J12M9m9j3J50j3j24n0k5N0j75M24O2j99o2j25j2l8P5K5Q7l7j00
788074F02320L7J3%R9j12J00L7j37J3P5%K4m9Q7n0o2K5L7j2%k5n0J87n0l8j61
792389F02308J99j37j3J37l7j2k5P4q7%%O2%p4J2J37l7j3l7J2j12J00L7l7j2K4
796704F02469m9L7L7p4%k5l8O3n0j00Q7%q7Q7j37Q8R9n0l7j2M9q7N0k5J00p5j12
801236F02208J87j50N0N0P5o3r9%j00J00n0Q7q7%%L7k5J50%p5J3O2%n0k5J25k12
805734F02208L7k5P5K5j00N0P5p5J25k37L8O2j3%%p4K36o2O2q7%L7L8P4k4q8o2
810216F02295K74j62n0J87%l7J49q7K5n0K5L7%J3K5P4o2N0J2J25l7J2K5K5j50
814364F02718J37j12N0J50j00O2j37J75P4j2R9m9J61k11J49n0Q7l7j2J24k5J50
$$ plain form
784208 602308 602420 602469 602420 602407 602557 602544 602420 602370 602345 602395 602220 602644 602706 602507 602445 602320 602308 602270 602345 602370 602457 602420 602320
788074 602320 602357 602370 602370 602469 602357 602457 602494 602357 602370 602445 602445 602469 602420 602507 602457 602395 602420 602457 602445 602445 602420 602370 602557 602507 602469 602308
792389 602308 602507 602370 602357 602494 602457 602445 602420 602494 602407 602407 602407 602469 602469 602395 602407 602544 602507 602494 602457 602469 602357 602457 602494 602457 602445 602469
796704 602469 602420 602457 602494 602420 602420 602395 602357 602420 602370 602270 602357 602357 602270 602357 602220 602308 602407 602357 602320 602308 602357 602270 602320 602295 602395 602320 602208
801236 602208 602395 602245 602295 602345 602420 602357 602258 602258 602158 602258 602208 602295 602208 602208 602208 602245 602220 602370 602370 602295 602308 602370 602370 602320 602295 602420 602208
805734 602208 602245 602220 602295 602320 602220 602270 602345 602270 602395 602158 602196 602258 602245 602245 602245 602171 602407 602345 602407 602320 602320 602357 602395 602469 602445 602357 602295
810216 602295 602569 602407 602357 602544 602544 602507 602656 602569 602594 602544 602569 602606 602606 602619 602644 602718 602656 602706 602718 602843 602806 602818 602843 602868 602718
814364 602718 602855 602743 602793 602943 602843 602905 602768 602943 603017 603005 603104 603055 603216 603005 603154 603104 603191 603154 603142 603266 603241 603391
818063F03391n0p5J37O2L8o3J00n0K5j2J37l8q7J87Q7l7J62j25J00J61k36J49
821695F03963%%p4J99%N0P4N0p5k4Q7j3l7N0Q7l8%Q8l8O3K4%J62j12J3J49q7o2
826360F04499K11N0r9j3J87p5k5K5J00p5%%K5n0N0%N0K5M9K5L8j12l8L8J2l7%
830892F04860Q7q7o3j2J00M9l7j37J25k5k5l8l7L7L8K5j25q7O2%K5k5%N0j62%
835207F04598J3N0K4j86O2k5P5k5k5p5O2J3j49k5O2L7p4Q7j50J3p5l7Q7j25K49
839356F04461j74q7j3O3%j00l7Q7j50Q8q8o2K5r9K4J3%l7j00j2j3q7K36p4j25
843554F03739l7j49J61k11J62j3j37L8n0L7p5p4l8%L8l8%%k36J74J3o3J00p5r9
847703F03167P4n0N0p4R9j24p5P5P4j2k49J12P5p5p5N0p5P5p5Q8q8N0j49P5q8
$$ plain form
818063 603391 603341 603266 603403 603465 603503 603440 603540 603490 603515 603503 603640 603602 603515 603702 603789 603752 603914 603789 603889 604050 603814 603963
821695 603963 603963 603963 603889 604088 604088 604138 604212 604262 604187 604163 604250 604237 604200 604250 604337 604299 604299 604387 604349 604412 604436 604436 604598 604486 604499 604648 604561 604499
826360 604499 604710 604760 604661 604648 604835 604760 604735 604760 604860 604785 604785 604785 604810 604760 604810 604810 604860 604885 604934 604959 604997 604885 604847 604885 604897 604860 604860
830892 604860 604947 604860 604797 604785 604885 604934 604897 604760 604885 604860 604835 604797 604760 604797 604835 604860 604735 604648 604710 604710 604735 604710 604710 604760 604598 604598
835207 604598 604611 604661 604685 604499 604561 604536 604611 604586 604561 604486 604548 604561 604412 604387 604449 604486 604412 604499 604349 604362 604287 604250 604337 604212 604461
839356 604461 604287 604200 604187 604250 604250 604150 604113 604200 604050 604138 604050 603988 604013 603914 603938 603951 603951 603914 603814 603802 603789 603702 603938 603864 603739
843554 603739 603702 603553 603714 603503 603665 603652 603515 603553 603503 603540 603465 603391 603353 603353 603391 603353 603353 603353 603117 603291 603304 603241 603341 603266 603167
847703 603167 603241 603191 603241 603167 603266 603142 603067 603142 603216 603204 602955 603067 603142 603067 602992 603042 602967 603042 602967 603055 602967 603017 602868 602943 602855
851851F02855J00l7o3l7%k5J3q8%N0K5j49J2n0L8J2%j2l8m9L7%K5n0K5k5k5p5
856516F02469J00p5J3n0N0j3K5%p4%M9m9l8J3n0%R9j24O2N0j12N0N0n0l8J00%
861048F02457q7j3L8n0J24j49J74j49k5P5J2L8M9j74N0k5l7R9l7N0n0j12J12j3
865030F02357j2O2j12%N0J2r9L7k5L8j3J3O2j50L8Q7l7n0R9r9j00o2J12N0j00
869179F02158J50j12j00J49p4n0K5O2j37Q7%n0J12k4q8N0l7n0n0N0P5N0j75k5
873211F01996J25o2%q8N0j2o2O2j3%k5N0n0%K5l7O2k5%k5j2j2n0J12j00N0q7Q7
877859F01959J2r9j3m9J37j00N0K5j12l8J87L7k24%Q7%o2K5n0K5J3%J2L7J37m9
882191F01947j50K5J00o3J00j62P5p5N0J00k5j3q7Q7o2j25J50K5J2q7J74K5o2
$$ plain form
851851 602855 602955 602918 602855 602818 602818 602793 602806 602718 602718 602768 602793 602644 602656 602606 602644 602656 602656 602644 602606 602557 602594 602594 602619 602569 602594 602569 602544 602469
856516 602469 602569 602494 602507 602457 602507 602494 602519 602519 602445 602445 602494 602445 602407 602420 602370 602370 602469 602345 602407 602457 602345 602395 602445 602395 602357 602457 602457
861048 602457 602370 602357 602395 602345 602469 602320 602494 602345 602320 602395 602407 602445 602494 602320 602370 602345 602308 602407 602370 602420 602370 602258 602370 602357
865030 602357 602345 602407 602295 602295 602345 602357 602258 602295 602270 602308 602295 602308 602370 602220 602258 602345 602308 602258 602357 602258 602158 602096 602208 602258 602158
869179 602158 602308 602196 602096 602245 602171 602121 602146 602208 602071 602158 602158 602108 602220 602196 602108 602158 602121 602071 602021 602071 602146 602196 602021 601996
873211 601996 602121 602059 602059 601971 602021 602009 601947 602009 601996 601996 601971 602021 601971 601971 601996 601959 602021 601996 601996 601971 601959 601947 601897 602009 601909 601959 601872 601959
877859 601959 601971 601872 601859 601810 601947 601847 601897 601922 601810 601772 601959 601996 601772 601772 601859 601859 601797 601822 601772 601797 601810 601810 601822 601859 601996 601947
882191 601947 601797 601822 601922 601859 601959 601797 601872 601797 601847 601947 601922 601909 601822 601909 601847 601722 601872 601897 601909 601822 601996 602021 601959
886039F01959L7j24J49P5j00%k5L8j3%O3M9q7j2O2J00K5O2j3O3l8J37j2j25L8
890188F02308J61%j2j2O2j12K5j3O2N0L8O2n0K5J49j74N0N0M9o2q7K5K5p5N0k5
894503F02569j2j3l7Q7%p5%j2j3k5m9J74k37J37K5o2n0L8M9j24j3%o2%p5L8N0
899002F02308o3P5j99J49j62J37p4j12l8%L8M9J00j49J37k00P5Q7j62%J12%q7
902850F02021J50j25n0J25k5j00J3j3N0N0l7n0J2%n0j2N0l8K5j24N0P4N0j49O2
906999F01959N0l8N0j49K5p5N0%k5n0J62j87%K5l7O2K5p5K24j49K5j12L7q7K49
911197F01959j62J12q7j24J12Q7p5j00N0P5P5j50K5N0j00N0O2q7%L8L7N0J2r9
915179F01810j62J2N0%J37j74Q7j00N0J62n0j2j3K5n0K5j24%Q7l8N0J00k24K5
$$ plain form
886039 601959 601996 601872 602021 602096 601996 601996 601971 602009 601996 601996 602059 602108 602021 602009 602071 602171 602196 602258 602245 602308 602270 602407 602395 602270 602308
890188 602308 602469 602469 602457 602445 602507 602395 602420 602407 602469 602519 602557 602619 602569 602594 602743 602569 602619 602669 602718 602656 602569 602594 602619 602544 602594 602569
894503 602569 602557 602544 602507 602594 602594 602519 602519 602507 602494 602469 602420 602594 602357 602494 602519 602457 602407 602445 602494 602370 602357 602357 602295 602295 602220 602258 602308
899002 602308 602245 602320 602121 602270 602108 602245 602171 602059 602021 602021 602059 602108 602208 602059 602196 601996 602071 602158 601996 601996 602108 602108 602021
902850 602021 602171 602046 601996 602121 602096 601996 602009 601996 602046 602096 602059 602009 602021 602021 601971 601959 602009 601971 601996 601872 601922 601996 602046 601897 601959
906999 601959 602009 601971 602021 601872 601897 601822 601872 601872 601847 601797 601959 601772 601772 601797 601760 601822 601847 601772 601996 601847 601872 601760 601797 601710 601959
911197 601959 601797 601909 601822 601698 601810 601897 601822 601722 601772 601847 601922 601772 601797 601847 601747 601797 601859 601772 601772 601810 601847 601897 601909 601810
915179 601810 601648 601660 601710 601710 601847 601673 601760 601660 601710 601872 601822 601810 601797 601822 601772 601797 601673 601673 601760 601722 601772 601872 601648 601673
919161F01673P4N0p5j2N0N0J2o2R9j49l7M9L8L7N0n0p5j2N0j37J24l7l7j3j2N0
923526F01698M9l7j2M9r9%N0O2n0j37Q7j2J24j74K12j00%n0%L8j37R9n0J3j3j2
927841F01598n0J12l7Q7J12n0k5r9R9j37J50j00N0j2k5k5P4j49J25O2j3k5K5l7
931823F01710J12p5k86J99%J3o3L8P4L8q7k5n0J24%%Q8q8%%K5r9N0J2O2j49Q7
936322F01710J00%j62K24j12J2N0%k5l7q7Q7j37J99j12L7l7l7P4%k5j2%j00K12
940520F01822k12J12j2L7%%k5K5%q7%Q7O3j12J2N0j3k5k4M9N0j37K62j62j12K24
944835F01872n0n0k5m9J2L7N0j87J00N0o2K4K5l7N0j12J62o3m9j25L7Q8M9k5J00
948984F01822n0o2j37J00Q7o2J2n0O2o2J50n0l8j12L8J2j2l8J00l7%J49p5%j49
$$ plain form
919161 601673 601747 601797 601722 601710 601760 601810 601822 601760 601859 601710 601673 601722 601760 601797 601847 601797 601722 601710 601760 601623 601747 601710 601673 601660 601648 601698
923526 601698 601747 601710 601698 601747 601648 601648 601698 601760 601710 601573 601660 601648 601772 601598 601810 601710 601710 601660 601660 601698 601561 601660 601610 601623 601610 601598
927841 601598 601548 601660 601623 601710 601822 601772 601747 601648 601747 601610 601760 601660 601710 601698 601673 601648 601722 601573 601698 601760 601747 601722 601747 601710
931823 601710 601822 601747 601461 601660 601660 601673 601610 601648 601722 601760 601673 601648 601598 601722 601722 601722 601810 601722 601722 601722 601747 601648 601698 601710 601772 601623 601710
936322 601710 601810 601810 601648 601872 601760 601772 601822 601822 601797 601760 601673 601760 601623 601822 601710 601747 601710 601673 601747 601747 601722 601710 601710 601610 601822
940520 601822 601610 601722 601710 601747 601747 601747 601722 601747 601747 601660 601660 601747 601810 601698 601710 601760 601747 601722 601698 601747 601797 601660 601922 601760 601648 601872
944835 601872 601822 601772 601747 601698 601710 601747 601797 601610 601710 601760 601698 601722 601747 601710 601760 601648 601810 601747 601698 601573 601610 601698 601747 601722 601822
948984 601822 601772 601710 601573 601673 601760 601698 601710 601660 601722 601660 601810 601760 601722 601610 601648 601660 601648 601610 601710 601673 601673 601822 601747 601747 601598
953183F01598P5%K5q8J37p4j12O2L7J3k5K5L7o2P4j2n0J3J74p5o2Q7%N0q7J49
957498F01909j87Q8L7j25J75n0k5K5n0l7J49J3o3m9J37M9%k5j61M9%J12j2O2n0
961646F01971%j49K24P5j25l7o2P4J50p5n0K5J50j75J12N0j49%l8L8J37j00l7
965512F02009o2j37J86K5L8O2j25l7N0J2k5J3l8K5J3o2M9%m9l8J62j62J50k00
969477F01859J00O2r9j3l7j3Q8j00J24j12j2J2j2O2r9l8j2L7n0K5K5j37J00R9
973509F01859j61k5%k5K24j99M9j2q7R9m9K5O2o2k5J49k12K12n0j62L8n0J00l8
977491F01660%%l7L7l7%N0%%L7j62O2O3M9K5j37J62o2o2k5N0j3Q7q7n0O3L7j37
982156F01573J37L7m9p5J99j24P4k5K5j24J24L8j62P4N0p4q8J12k11J87k5k5R9
$$ plain form
953183 601598 601673 601673 601698 601610 601747 601673 601561 601623 601660 601673 601648 601673 601710 601648 601722 601710 601660 601673 601847 601772 601710 601797 601797 601847 601760 601909
957498 601909 601722 601810 601847 601722 601897 601847 601822 601847 601797 601760 601909 601922 601859 601810 601947 601996 601996 601971 601810 601859 601859 601971 601959 602021 601971
961646 601971 601971 601822 602046 602121 601996 601959 601897 601971 602121 602046 601996 602021 602171 601996 602108 602158 602009 602009 601971 602009 602146 602046 602009
965512 602009 601947 601810 601996 602021 602059 602121 601996 601959 602009 602021 601996 602009 601971 601996 602009 601947 601996 601996 601947 601909 602071 601909 602059 601859
969477 601859 601959 602021 601922 601909 601872 601859 601947 601847 601971 601859 601847 601859 601847 601909 601810 601772 601760 601797 601747 601772 601797 601660 601760 601859
973509 601859 601698 601673 601673 601648 601872 601673 601722 601710 601623 601722 601673 601698 601760 601698 601673 601822 601610 601822 601772 601610 601648 601598 601698 601660
977491 601660 601660 601660 601623 601660 601623 601623 601673 601673 601673 601710 601548 601610 601673 601722 601747 601610 601772 601710 601648 601623 601673 601660 601747 601660 601610 601673 601710 601573
982156 601573 601710 601747 601698 601623 601822 601698 601772 601747 601772 601648 601772 601810 601648 601722 601772 601698 601610 601722 601511 601698 601673 601648 601747
986004F01747%K5o2j12N0K5%L7L7r9N0J2%o2J2L8j00J00q8J12m9Q7j99R9q7K5
990320F01598P5n0R9j24J12n0%l7N0j25P5n0Q7o2J12j00Q8%l8n0L8l8J3j00J25
994468F01648%l8j12K5p4J61r9O2j12J37q7R9j2j00k5P5N0q7q7J49N0p5K5n0N0
998667F01573j2n0R9N0r9%n0J2n0
$$ plain form
986004 601747 601747 601772 601710 601598 601648 601673 601673 601710 601747 601648 601698 601710 601710 601648 601660 601698 601598 601698 601610 601722 601673 601760 601561 601660 601573 601598
990320 601598 601673 601623 601722 601598 601710 601660 601660 601623 601673 601548 601623 601573 601660 601598 601710 601610 601698 601698 601660 601610 601648 601610 601623 601523 601648
994468 601648 601648 601610 601498 601523 601449 601610 601511 601573 601461 601598 601511 601610 601598 601498 601473 601548 601598 601511 601424 601573 601623 601548 601573 601523 601573
998667 601573 601561 601511 601610 601660 601561 601561 601511 601523 601473
##END=
