##TITLE= Headspace from cinnamon stick
##JCAMP-DX= 5.00 $$From Command Line Converter 1.0
##DATA TYPE= GAS CHROMATOGRAPH
##ORIGIN= Dept of Chem, UWI, Mona, JAMAICA
##OWNER= Dr Robert J. Lancashire
##$URL= http://wwwchem.uwimona.edu.jm:1104/software/jcampdx.html
##SPECTROMETER/DATA SYSTEM= HP 5890 GC
##DATE= 11-26-1995
##TIME= 08:53:25
##XUNITS= TIME
##YUNITS= ARBITRARY
##XFACTOR= 2.000000e-005
##YFACTOR= 3.895000e-003
##FIRSTX=   0.000000
##LASTX=  20.003
##NPOINTS= 6002
##MAXY= 51817.000000
##MINY= 47922.000000
##FIRSTY= 48453.000000
##DELTAX=   0.003333
##XYDATA= (X++(Y..Y))
$$ plain form
0 12439794 12437483 12437997 12436970 12437483 12439537 12440051 12435430 12435686 12436970 12436970 12435943 12435943 12436713 12436970 12435430 12435430 12434403
2833 12434403 12435686 12437740 12436970 12435943 12434403 12433632 12436970 12437997 12432605 12434916 12433889 12437483 12435430 12432862
5166 12432862 12434659 12433889 12434659 12434916 12434659 12434659 12430295 12431322 12430295 12429525 12433376 12431322 12432349 12431578 12429525 12432605
7833 12432605 12434403 12431578 12430808 12432349 12432349 12434659 12431322 12432349 12432349 12429525 12431578 12429781 12431322 12431578 12432349 12431322
10499 12431322 12431322 12431578 12429781 12432605 12431835 12431835 12431322 12430808 12427727 12432605 12431578 12429268 12431322 12429268 12428241 12430808
13166 12430808 12429525 12429781 12428754 12427727 12429525 12429268 12428241 12429525 12428498 12428498 12427727 12429268 12429525 12427727 12428754
15666 12428754 12428241 12426444 12427471 12427471 12429525 12427214 12427471 12427471 12426700 12426187 12427727 12428754 12423620 12426187 12427471 12428241
18349 12428241 12427727 12424390 12427471 12427471 12424646 12427214 12428498 12426700 12427727 12427727 12426700 12427214 12426700 12425673 12427214 12426444
$$ packed form
0A2439794k311N14j027N13K054N14m621K56J284%j027%P70K57j540%j027
2833A2434403J283K054p70j027j540p71L338J027n392K311j027L594k053k568
5166A2432862J797p70P70K57k57%m364J027j027p70L851k054J027p71k053L080
7833A2432605J798k825p70J541%K310l337J027%k824K053j797J541K56P71j027
10499A2431322%K56j797K824p70%n13n14l081M878j027k310K054k054j027K567
13166A2430808j283K56j027j027J798k57j027J284j027%p71J541K57j798J027
15666A2428754n13j797J027%K054k311K57%p71n13J540J027n134K567J284P70
18349A2428241n14l337L081%k825K568J284j798J027%j027N14n14j027J541p70
$$ plain form
21016 12426444 12426444 12424390 12427214 12426444 12425160 12427727 12427471 12426187 12428241 12431835 12428498 12423620 12421309 12424133 12425160
23516 12425160 12423620 12427471 12423620 12425417 12423106 12422336 12423106 12425417 12425417 12424133 12424646 12424646 12423363 12423363 12425160 12425160 12425160 12426444
26516 12426444 12423363 12423620 12423106 12426444 12423106 12425417 12424390 12423363 12425160 12423620 12424390 12425160 12422079 12425417
28849 12425417 12423620 12424646 12426187 12424133 12422593 12422336 12423363 12423620 12420282 12423363 12423363 12422593 12423363 12424133 12424133 12424390
31516 12424390 12423106 12421566 12421566 12420282 12422079 12423106 12423106 12421052 12421052 12422336 12421052 12423363 12422079 12422593 12421566 12421052
34150 12421052 12423620 12423106 12421566 12421566 12423106 12422336 12420539 12423106 12424390 12423620 12422336 12425160 12422079 12423620 12425417
36649 12425417 12425160 12424390 12424133 12426187 12428498 12424133 12423106 12426700 12423620 12424646 12424390 12424133 12423363 12425417 12427471
39150 12427471 12425160 12426444 12426187 12425673 12426444 12425417 12422336 12423363 12424133 12425673 12424133 12424390 12425417 12426187 12423620
$$ packed form
21016A2426444%k054K824p70j284K567k56j284K054L594l337m878k311K824J027
23516A2425160j540L851l851J797k311p70P70K311%j284N13%j283%J797%%J284
26516A2426444l081K57n14L338l338K311j027j027J797j540P70P70l081L338
28849A2425417j797J026J541k054j540k57J027K57l338L081%p70P70P70%K57
31516A2424390j284j540%j284J797J027%k054%J284j284K311j284N14j027n14
34150A2421052K568n14j540%J540p70j797K567J284p70j284K824l081J541J797
36649A2425417k57p70k57K054K311m365j027L594l080J026k56k57p70K054K054
39150A2427471k311J284k57n14P71j027l081J027P70J540j540K57J027P70k567
$$ plain form
41649 12423620 12425673 12423363 12422336 12423363 12424646 12428241 12425160 12425160 12426700 12425160 12426444 12426700 12423106 12426700
44016 12426700 12425417 12426700 12425417 12425673 12425160 12424390 12424646 12428241 12425673 12425673 12425673 12425673 12426700 12427471 12426444 12429268 12425673
46816 12425673 12425160 12424390 12425160 12426700 12425160 12426700 12423106 12424133 12426444 12427214 12425417 12424646 12426187 12425673 12427214
49316 12427214 12427471 12425160 12426700 12427727 12424390 12427214 12426444 12425673 12426700 12424390 12427471 12427471 12426700 12427471 12425417
51816 12425417 12427727 12426700 12425160 12427727 12426444 12427214 12425673 12426187 12426444 12427727 12429268 12424646 12426700 12425673
54149 12425673 12425417 12426444 12427727 12426444 12425417 12428498 12426700 12427471 12426187 12425417 12426700 12425160 12426187 12425160
56516 12425160 12425673 12425417 12425673 12427727 12426187 12426700 12428241 12426700 12424646 12426444 12426700 12425417 12426187 12426187 12426700 12426444
59150 12426444 12428241 12425673 12424646 12428241 12426187 12425673 12424390 12423620 12427214 12427727 12426700 12427214 12425673 12430295
$$ packed form
41649A2423620K053k310j027J027J283L595l081%J540j540J284K56l594L594
44016A2426700j283J283j283K56n13p70K56L595k568%%%J027P71j027K824l595
46816A2425673n13p70P70J540j540J540l594J027K311P70j797p71J541n14J541
49316A2427214K57k311J540J027l337K824p70p71J027k310L081%p71P71k054
51816A2425417K310j027j540K567j283P70j541N14K57J283J541m622K054j027
54149A2425673k56J027J283j283j027L081j798P71j284p70J283j540J027j027
56516A2425160N13k56K56K054j540N13J541j541k054J798K56j283P70%N13k56
59150A2426444J797k568j027L595k054n14j283p70L594N13j027N14j541M622
$$ plain form
61516 12430295 12429781 12427727 12424390 12425417 12426444 12425673 12428241 12427471 12429525 12427727 12431835 12426444 12427727 12427214
63850 12427214 12426187 12426700 12423363 12425673 12427214 12426444 12425417 12425417 12426187 12427214 12425160 12426444 12428754 12429268 12428754
66350 12428754 12426444 12429781 12428241 12429268 12429268 12429525 12429781 12429525 12428498 12430808 12428498 12430551 12432605 12436713 12436456
68850 12436456 12436456 12443645 12446213 12452374 12459306 12465725 12475481 12484210 12494480 12506546 12520154 12526315 12541720
71016 12541720 12555584 12567137 12580744 12589473 12600256 12610783 12621822 12633376 12644672 12650834 12654942
72833 12654942 12663671 12670346 12675994 12680102 12684210 12688575 12692939 12693453 12696790 12698844 12698587 12698074 12701668 12698844
75166 12698844 12699101 12698587 12695507 12694480 12694480 12689858 12686777 12686521 12680359 12679075 12672400 12671887 12668806 12667779 12660590
77666 12660590 12656996 12655712 12649550 12645699 12643132 12639024 12633889 12629011 12626700 12622593 12620539 12619768 12614890 12611810
$$ packed form
61516A2430295n14k054l337J027J027p71K568p70K054j798M108n391J283n13
63850A2427214j027N13l337K310J541p70j027%P70J027k054J284K310N14n14
66350A2428754k310L337j540J027%K57K56k56j027K310k310K053K054M108k57
68850A2436456%P189K568O161O932O419R756Q729J0270J2066J3608O161J5405
71016A2541720J3864J1553J3607Q729J0783J0527J1039J1554J1296O162M108
72833A2654942Q729O675N648M108M108M365M364N14L337K054k57n13L594k824
75166A2698844K57n14l080j027%m622l081k56o162j284o675n13l081j027p189
77666A2660590l594j284o162l851k567m108n135m878k311m107k054p71m878l080
$$ plain form
80000 12611810 12606675 12606675 12603337 12602310 12600000 12600000 12596919 12593068 12594865 12595121 12592554 12589730 12591527 12593068 12588703
82499 12588703 12587933 12585622 12585365 12583825 12583825 12581258 12580487 12580231 12580231 12576379 12576123 12578433 12570218 12570474 12569448 12566880
85166 12566880 12564826 12564056 12563286 12560975 12558151 12557894 12558664 12556097 12554557 12551732 12549679 12549935 12548395 12548908 12546854
87666 12546854 12545571 12546598 12541206 12543260 12543260 12543774 12543260 12542233 12541206 12541463 12539409 12539152 12540179 12539409 12540179 12539409
90333 12539409 12537098 12538382 12538125 12540436 12536071 12536585 12538382 12537612 12534531 12533504 12531964 12534017 12530937 12529910
92666 12529910 12526829 12528883 12528112 12526059 12525032 12522978 12524005 12522978 12518613 12518870 12519640 12516559 12517586 12514762
94999 12514762 12513735 12514762 12511424 12511424 12509884 12508344 12508600 12504492 12503722 12501668 12501668 12500385 12499358 12497560 12496534
97499 12496534 12495250 12496534 12491399 12491142 12492426 12489088 12485237 12483953 12482156 12482156 12480102 12477535 12476508 12476765 12477021
$$ packed form
80000A2611810n135%l338j027k310%l081l851J797K56k567k824J797J541m365
82499A2588703p70k311k57j540%k567p71k56%l852k56K310q215K56j026k568
85166A2566880k054p70p70k311k824k57P70k567j540k825k053K56j540N13k054
87666A2546854j283J027n392K054%N14n14j027j027K57k054k57J027p70P70p70
90333A2539409k311J284k57K311m365N14J797p70l081j027j540K053l080j027
92666A2529910l081K054p71k053j027k054J027j027m365K57P70l081J027k824
94999A2514762j027J027l338%j540j540K56m108p70k054%j283j027j798j026
97499A2496534j284J284n135k57J284l338l851j284j797%k054k567j027K57K56
$$ plain form
99999 12477021 12474454 12475481 12472400 12475481 12472657 12474711 12472913 12470603 12471630 12471373 12470346 12471373 12471630 12470346
102316 12470346 12468549 12470860 12470860 12468549 12469576 12471887 12472657 12468292 12470346 12468292 12467265 12469576 12467779 12467265 12466495
104816 12466495 12467522 12465468 12464698 12463671 12465725 12463671 12464698 12463671 12463157 12460590 12462644 12460077 12462130 12460590
107150 12460590 12461103 12461617 12460077 12459563 12457252 12457252 12458023 12457252 12456996 12455455 12458279 12456482 12454428 12456482 12453915 12455455
109816 12455455 12454942 12455969 12453915 12453915 12452374 12451347 12451861 12452888 12451091 12452374 12450834 12453145 12452374 12449807 12453401
112316 12453401 12451091 12451091 12448780 12450320 12452118 12449807 12450320 12446213 12441591 12437740 12420282 12405905 12395378 12387163
114650 12387163 12377406 12370731 12369704 12368934 12368677 12368164 12367137 12366623 12368164 12365853 12368164 12365083 12368934 12367907
116983 12367907 12366880 12366623 12367907 12365596 12369191 12366880 12367650 12368934 12369704 12366880 12366880 12368164 12367137 12366880 12367907
$$ packed form
99999A2477021k567J027l081L081k824K054j798k310J027k57j027J027K57j284
102316A2470346j797K311%k311J027K311P70m365K054k054j027K311j797n14p70
104816A2466495J027k054p70j027K054k054J027j027n14k567K054k567K053j540
107150A2460590N13N14j540n14k311%P71p71k56j541K824j797k054K054k567J540
109816A2455455n13J027k054%j541j027N14J027j797J283j540K311p71k567L594
112316A2453401k310%k311J540J798k311N13m107m622l851j7458j4377j0527q215
114650A2387163r757o675j027p70k57n13j027n14J541k311K311l081L851j027
116983A2367907j027k57J284k311L595k311P70J284P70k824%J284j027k57J027
$$ plain form
119483 12367907 12368677 12368677 12370731 12368164 12373042 12370731 12367907 12368934 12368677 12367650 12370218 12371758 12367650 12368677 12368164
121983 12368164 12368677 12371245 12371758 12369704 12365596 12369191 12368677 12368677 12367650 12365596 12368164 12365853 12365083 12366880 12368677
124483 12368677 12365596 12366110 12367137 12366623 12369191 12363029 12366110 12364569 12365596 12364826 12363543 12363799 12363799 12362002 12362002 12361745
127150 12361745 12363799 12361745 12365083 12361745 12362002 12360462 12360975 12362772 12360975 12359691 12361489 12361745 12359691 12359948
129483 12359948 12358921 12358921 12360462 12359691 12360718 12359435 12360462 12358408 12358664 12359435 12357894 12358408 12357637 12356354 12357381
131983 12357381 12359435 12357637 12357894 12358408 12358664 12356867 12356611 12355327 12357381 12356354 12354813 12356354 12354557 12352503
134316 12352503 12353786 12349165 12353786 12351219 12349679 12352246 12351219 12349165 12350449 12352503 12349679 12353530 12350192
136516 12350192 12351219 12352503 12353273 12353273 12352759 12349679 12351732 12351732 12354300 12352503 12353530 12352759 12354813 12353530 12353786 12350449
$$ packed form
119483A2367907P70%K054k567M878k311k824J027k57j027K568J540m108J027n13
121983A2368164N13K568N13k054m108L595n14%j027k054K568k311p70J797J797
124483A2368677l081N14J027n14K568o162L081j541J027p70j283K56%j797%k57
127150A2361745K054k054L338l338K57j540N13J797j797j284J798K56k054K57
129483A2359948j027%J541p71J027j283J027k054K56P71j541N14p71j283J027
131983A2357381K054j798K57N14K56j797k56j284K054j027j541J541j797k054
134316A2352503J283m621M621k567j540K567j027k054J284K054k824L851l338
136516A2350192J027J284P70%n14l080K053%K568j797J027p71K054j283K56l337
$$ plain form
139149 12350449 12354300 12353530 12352246 12353786 12354300 12351732 12353273 12352246 12355327 12352759 12353786 12351732 12353273 12352503
141516 12352503 12353786 12354300 12354300 12352759 12351732 12351219 12352503 12352503 12352759 12352759 12351732 12351219 12349679 12352503 12353273 12351476 12352503
144316 12352503 12351732 12355584 12353786 12356867 12351732 12354300 12352246 12352759 12352246 12350449 12354300 12353786 12354813 12353530
146649 12353530 12354300 12354300 12353786 12355840 12355840 12355584 12355584 12354300 12355840 12354813 12355327 12353786 12352759 12354557 12350449 12353273 12352246
149483 12352246 12351732 12350706 12351732 12353530 12352246 12353786 12352759 12352503 12352503 12353530 12353530 12349679 12352246 12351732 12353786 12352759
152150 12352759 12355327 12353273 12353273 12354557 12354300 12351732 12348652 12351476 12353786 12351476 12352503 12348138 12350192 12351219
154483 12351219 12351219 12349165 12350192 12351219 12350706 12350449 12351219 12351219 12349422 12350706 12349165 12352246 12350449 12351219 12352503 12347625
157150 12347625 12350449 12350706 12349679 12350706 12349679 12351219 12350706 12351732 12350706 12349422 12351476 12353530 12351476 12352503
$$ packed form
139149A2350449L851p70j284J540N14k568J541j027L081k568J027k054J541p70
141516A2352503J283N14%j541j027n13J284%K56%j027n13j540K824P70j797J027
144316A2352503p71L852j798L081n135K568k054N13n13j797L851n14J027j283
146649A2353530P70%n14K054%k56%j284J540j027N14j541j027J798m108K824j027
149483A2352246n14j026J026J798j284J540j027k56%J027%l851K567n14K054j027
152150A2352759K568k054%J284k57k568l080K824K310k310J027m365K054J027
154483A2351219%k054J027J027n13k57P70%j797J284j541L081j797P70J284m878
157150A2347625K824K57j027J027j027J540n13J026j026j284K054K054k054J027
$$ plain form
159483 12352503 12352503 12350449 12351219 12352759 12352246 12351219 12353273 12352246 12353273 12352503 12352246 12351732 12353273 12352246 12353273
161983 12353273 12350449 12352759 12350706 12351476 12352246 12351476 12349422 12349679 12348395 12348138 12348652 12347625 12348138 12346341 12346598
164483 12346598 12348395 12350192 12346598 12347368 12349422 12347625 12346084 12347111 12346341 12344030 12344287 12345314 12345571 12345571 12345057
166983 12345057 12345571 12343003 12344287 12344544 12344287 12342490 12345571 12343260 12343003 12345314 12342490 12346084 12342490 12343517
169316 12343517 12343517 12345314 12343260 12344030 12344544 12343517 12341463 12344030 12344544 12341976 12343003 12343003 12344030 12343517 12341463 12343517
171983 12343517 12344287 12347625 12346341 12348138 12346341 12345314 12347368 12348652 12349422 12352503 12348652 12352759 12353530 12353786
174316 12353786 12355327 12357381 12358664 12358921 12357894 12357637 12363029 12361489 12362772 12364056 12365083 12364056 12364056 12364056 12365853
176816 12365853 12366110 12366110 12368934 12366880 12368164 12367137 12369961 12366880 12369191 12369191 12365853 12367907 12370731 12368677 12364569
$$ packed form
159483A2352503%k054P70J540n13j027K054j027J027p70k57n14J541j027J027
161983A2353273k824K310k053P70P70p70k054K57j284k57N14j027N13j797K57
164483A2346598J797J797l594P70K054j797j541J027p70k311K57J027K57%n14
166983A2345057N14k568J284K57k57j797L081k311k57K311k824L594l594J027
169316A2343517%J797k054P70N14j027k054K567N14k568J027%J027n13k054K054
171983A2343517P70L338j284J797j797j027K054J284P70L081l851M107P71K56
174316A2353786J541K054J283K57j027k57N392j540J283J284J027j027%%J797
176816A2365853K57%K824k054J284j027K824l081K311%l338K054K824k054m108
$$ plain form
179316 12364569 12366623 12366110 12366880 12365083 12363799 12365083 12362516 12360975 12361489 12363543 12361489 12360975 12360462 12359691 12361489
181816 12361489 12362002 12357894 12359435 12359691 12359691 12357637 12357637 12357637 12357637 12357381 12355327 12354813 12356611 12355840 12355584 12353273 12353530 12352246
184816 12352246 12351476 12350706 12349422 12347625 12349422 12347111 12344544 12347625 12345571 12349165 12343260 12346084 12345314 12343003
187150 12343003 12344287 12342233 12344030 12343003 12343517 12343260 12342490 12346084 12341206 12343517 12343517 12343003 12344030 12341976 12343003
189650 12343003 12343003 12341206 12344544 12343003 12341463 12343003 12342490 12345314 12342490 12345057 12345314 12343260 12344030 12345057 12344287
192150 12344287 12346084 12344287 12346084 12343003 12344287 12342490 12344287 12341976 12342490 12344287 12344544 12345314 12342490 12343260
194483 12343260 12343003 12342490 12342490 12345571 12343517 12341463 12344544 12345057 12345571 12344030 12344030 12345571 12344287 12345314 12343517 12345314
197150 12345314 12346084 12344287 12346341 12344287 12345057 12347368 12346084 12346084 12345314 12345057 12345571 12345571 12348138 12346598 12348395 12345314
$$ packed form
179316A2364569K054n13P70j797j284J284k567j541N14K054k054n14n13p71J798
181816A2361489N13m108J541K56%k054%%%k56k054n14J798p71k56k311K57j284
184816A2352246p70p70j284j797J797k311k567L081k054L594n905K824p70k311
187150A2343003J284k054J797j027N14k57p70L594m878K311%n14J027k054J027
189650A2343003%j797L338j541j540J540n13K824k824K567K57k054P70J027p70
192150A2344287J797j797J797l081J284j797J797k311N14J797K57P70k824P70
194483A2343260k57n13%L081k054k054L081N13N14j541%J541j284J027j797J797
197150A2345314P70j797K054k054P70K311j284%p70k57N14%K567j540J797l081
$$ plain form
199816 12345314 12347625 12348138 12348652 12345314 12347368 12347111 12349422 12345057 12348395 12348395 12347111 12348138 12348652 12349422 12350449
202316 12350449 12350192 12350706 12352246 12350706 12352246 12350706 12350706 12352503 12353273 12355584 12354300 12356354 12355840 12357894 12361489
204816 12361489 12358921 12358664 12362002 12364056 12365596 12367907 12369191 12369704 12375866 12375866 12379974 12379460 12383055 12389216 12392811
207316 12392811 12394608 12396919 12398973 12399743 12406675 12403851 12409756 12408729 12411039 12413093 12417971 12416431 12418228 12418485
209649 12418485 12422593 12421052 12422593 12421566 12422593 12422593 12423106 12420539 12423363 12421566 12422079 12423620 12419255 12420025 12421566
212149 12421566 12419512 12420539 12419255 12419255 12421052 12416944 12419512 12418228 12418228 12418998 12420025 12423106 12423106 12424133 12427471 12430551
214816 12430551 12431835 12435943 12436713 12440564 12446983 12450320 12453915 12456482 12460333 12466238 12468806 12471373 12474711 12478818
217149 12478818 12480872 12483697 12486264 12488318 12489345 12490115 12489858 12492939 12492426 12493196 12491912 12493196 12491399 12493453
$$ packed form
199816A2345314K311N13N14l338K054k57K311m365L338%j284J027N14P70J027
202316A2350449k57N14J540j540J540j540%J797P70K311j284K054n14K054L595
204816A2361489k568k57L338K054J540K311J284N13O162%M108n14L595O161L595
207316A2392811J797K311K054P70O932k824N905j027K310K054M878j540J797K57
209649A2418485M108j541J541j027J027%N13k567K824j797N13J541m365P70J541
212149A2421566k054J027j284%J797m108K568j284%P70J027L081%J027L338L080
214816A2430551J284M108P70L851O419L337L595K567L851N905K568K567L338M107
217149A2478818K054K825K567K054J027P70k57L081n13P70j284J284j797K054
$$ plain form
219483 12493453 12490885 12492939 12488318 12488318 12484724 12483953 12480872 12478818 12474711 12469833 12471630 12466238 12464441 12462387
221816 12462387 12458536 12455455 12452374 12450064 12449037 12444159 12441848 12437483 12436970 12433889 12430808 12428498 12427214 12421309
224149 12421309 12421052 12415404 12414377 12411296 12408985 12406675 12405905 12402824 12401026 12399486 12396662 12392297 12391270 12390243
226516 12390243 12389216 12386392 12386649 12383311 12385622 12381001 12382284 12376893 12377150 12376379 12375353 12374839 12373042 12372015
228849 12372015 12368934 12368934 12367907 12366880 12367650 12367137 12365083 12362772 12363799 12362772 12363029 12362002 12363543 12363543 12361745 12363543
231516 12363543 12363029 12364056 12363799 12365853 12364569 12366110 12369704 12369961 12369961 12372272 12375096 12375096 12378433 12378177 12382541 12382028
234149 12382028 12387163 12387676 12389216 12391784 12390757 12392811 12396405 12402567 12398459 12398973 12402567 12403080 12402824 12403080 12402824
236649 12402824 12403851 12404107 12404107 12405134 12405905 12405134 12402053 12404621 12401540 12402053 12401026 12401540 12399486 12398973 12397689 12394865
$$ packed form
219483A2493453k568K054m621%l594p71l081k054m107m878J797n392j797k054
221816A2462387l851l081l081k310j027m878k311m365n13l081l081k310j284n905
224149A2421309k57n648j027l081k311k310p70l081j798j540k824m365j027j027
226516A2390243j027k824K57l338K311m621J283n391K57p71j026n14j797j027
228849A2372015l081%j027j027P70n13k054k311J027j027K57j027J541%j798J798
231516A2363543n14J027k57K054j284J541L594K57%K311K824%L337k56M364n13
234149A2382028N135N13J540K568j027K054L594O162m108N14L594N13k56K56k56
236649A2402824J027K56%J027P71p71l081K568l081N13j027N14k054n13j284k824
$$ plain form
239316 12394865 12392811 12394865 12391527 12393581 12388703 12389473 12389473 12386392 12386136 12383568 12381514 12381258 12382284 12376893 12378433
241816 12378433 12378947 12376379 12374839 12374326 12373299 12372272 12371758 12369704 12369191 12372015 12368164 12366623 12364056 12366110
244149 12366110 12365083 12364826 12362516 12362516 12362772 12364056 12360975 12361745 12359435 12357637 12358921 12359435 12358664 12356611 12358664
246649 12358664 12357894 12357637 12354813 12354813 12355584 12358664 12354557 12356867 12356867 12353786 12356354 12355840 12359691 12357894 12359691 12357637
249316 12357637 12357637 12358408 12358408 12357894 12360462 12358921 12359691 12361489 12356867 12356867 12359435 12360718 12359691 12358664 12359691 12360718
251983 12360718 12358664 12359691 12358921 12356354 12355584 12354557 12357381 12357637 12358408 12357381 12357637 12354300 12356354 12357637 12356611
254483 12356611 12354300 12354813 12355584 12355327 12354813 12352246 12352759 12353530 12353530 12353530 12350706 12350449 12351732 12349679 12350192 12350192 12350449 12348138
257500 12348138 12351219 12349422 12350192 12347625 12345571 12346598 12346084 12346341 12347368 12344287 12345314 12345057 12344287 12346598 12346084
$$ packed form
239316A2394865k054K054l338K054m878P70%l081k56k568k054k56J026n391J540
241816A2378433N14k568j540n13j027j027n14k054n13K824l851j541k567K054
244149A2366110j027k57k310%K56J284l081P70k310j798J284N14p71k053K053
246649A2358664p70k57k824%P71L080m107K310%l081K568n14L851j797J797k054
249316A2357637%P71%n14K568j541P70J798m622%K568J283j027j027J027J027
251983A2360718k054J027p70k567p70j027K824K56P71j027K56l337K054J283j026
254483A2356611k311N13P71k57n14k567N13P71%%k824k57J283k053N13%K57k311
257500A2348138L081j797P70k567k054J027n14K57J027l081J027k57p70K311n14
$$ plain form
260000 12346084 12345314 12344544 12344287 12344030 12343517 12345057 12344544 12346084 12344030 12343517 12343003 12343517 12344030 12345057 12344030 12343260
262666 12343260 12343003 12342233 12342490 12340949 12345571 12346084 12344287 12343260 12343260 12343003 12343260 12347111 12344287 12345314 12346341 12346341
265333 12346341 12345057 12345057 12347368 12346598 12344287 12347625 12346598 12346341 12348395 12348395 12347368 12348138 12348395 12346341 12349679 12348395
267999 12348395 12349679 12349165 12351476 12350449 12350706 12350706 12353273 12353273 12352759 12355327 12353530 12356867 12357381 12357637 12358408 12363543
270666 12363543 12359691 12360975 12363543 12365853 12368677 12368677 12370731 12369191 12369961 12373299 12374069 12376123 12376379 12377150 12378947
273166 12378947 12378177 12379204 12379460 12379974 12381258 12381258 12381514 12382541 12383311 12379974 12378947 12382541 12381001 12382284 12380487
275666 12380487 12380231 12382028 12381001 12378177 12379204 12379974 12378433 12375096 12377150 12376123 12374326 12373042 12372785 12369191
277999 12369191 12370218 12370218 12370731 12367907 12370218 12367650 12364056 12366623 12365853 12365083 12360718 12362516 12361745 12363543 12360462
$$ packed form
260000A2346084p70p70k57k57n13J540n13J540k054n13n14N14N13J027j027p70
262666A2343260k57p70K57j541M622N13j797j027%k57K57L851k824J027J027%
265333A2346341j284%K311p70k311L338j027k57K054%j027P70K57k054L338j284
267999A2348395J284n14K311j027K57%K567%n14K568j797L337N14K56P71N135
270666A2363543l852J284K568K310K824%K054j540P70L338P70K054K56P71J797
273166A2378947p70J027K56N14J284%K56J027P70l337j027L594j540J283j797
275666A2380487k56J797j027k824J027P70j541l337K054j027j797j284k57l594
277999A2369191J027%N13k824K311k568l594K567p70p70m365J798p71J798l081
$$ plain form
280499 12360462 12358408 12359691 12356611 12360462 12356354 12356354 12356611 12355584 12353786 12353530 12353530 12351732 12354557 12351732 12350192
282999 12350192 12350192 12349679 12350192 12348652 12348138 12349422 12349679 12345057 12346341 12348395 12346341 12348138 12347625 12346598 12346084 12347625
285666 12347625 12344287 12343260 12347111 12345314 12346084 12344030 12344544 12345057 12341463 12343260 12342233 12344030 12345314 12344030
287999 12344030 12344030 12344287 12344030 12343260 12345314 12347368 12346598 12344287 12344544 12345314 12344030 12345571 12346084 12345057 12345314 12345571
290666 12345571 12346598 12344544 12345314 12346341 12346084 12345571 12348395 12348138 12348138 12347368 12347368 12346341 12347111 12348138 12347368 12349422 12351732
293516 12351732 12347368 12348395 12352246 12350706 12351219 12351219 12348652 12348652 12348138 12348652 12349679 12348395 12350192 12348138 12351219 12350192
296183 12350192 12352759 12349422 12348138 12348652 12347111 12349422 12346084 12348395 12348395 12346341 12348395 12347111 12347368 12345571 12348652
298683 12348652 12347111 12346598 12347625 12345314 12345571 12347368 12344030 12345571 12345314 12343517 12345314 12343260 12344030 12344287 12344544
$$ packed form
280499A2360462k054J283l080L851m108%K57j027j798k56%j798K825k825j540
282999A2350192%n13N13j540n14J284K57m622J284K054k054J797n13j027n14J541
285666A2347625l338j027L851j797P70k054N14N13l594J797j027J797J284j284
287999A2344030%K57k57p70K054K054p70k311K57P70j284J541N13j027K57K57
290666A2345571J027k054P70J027k57n13K824k57%p70%j027P70J027p70K054K310
293516A2351732m364J027L851j540N13%k567%n14N14J027j284J797k054L081j027
296183A2350192K567l337j284N14j541K311l338K311%k054K054j284K57j797L081
298683A2348652j541n13J027k311K57J797l338J541k57j797J797k054P70K57K57
$$ plain form
301183 12344544 12341206 12343003 12343003 12344030 12344544 12343260 12345057 12343003 12341976 12344287 12343260 12344544 12342490 12345057
303516 12345057 12343003 12344544 12345057 12346341 12343517 12343517 12344287 12344030 12344544 12344030 12345571 12344287 12342233 12346598 12344544
306016 12344544 12344287 12344544 12344030 12343517 12344544 12345314 12346084 12347111 12346084 12346598 12346341 12348395 12348395 12348138 12350706 12349165
308683 12349165 12351732 12351732 12352246 12349679 12350192 12351219 12352759 12353273 12352503 12351732 12351732 12351732 12351476 12351476 12352759 12353273 12350449 12352503
311649 12352503 12353530 12352759 12350706 12352759 12348652 12350706 12349679 12350192 12349679 12353786 12352759 12350192 12349165 12350449
314016 12350449 12353273 12351476 12351732 12352246 12352246 12350706 12352503 12354557 12353530 12354557 12354813 12354300 12357381 12357381 12358408 12357894
316650 12357894 12358408 12359691 12355840 12360718 12359691 12358921 12359948 12361489 12359435 12358664 12361745 12360975 12360462 12358921 12359691
319150 12359691 12361489 12358664 12358921 12361745 12360462 12358408 12359435 12360975 12360462 12360975 12360975 12359435 12357637 12359435 12359691
$$ packed form
301183A2344544l338J797%J027N14j284J797k054j027K311j027J284k054K567
303516A2345057k054J541N13J284k824%P70k57N14n14J541j284k054M365k054
306016A2344544k57K57n14n13J027P70P70J027j027N14k57K054%k57K568j541
308683A2349165K567%N14k567N13J027J540N14p70p71%%k56%J283N14k824K054
311649A2352503J027p71k053K053m107K054j027N13n13M107j027k567j027J284
314016A2350449K824j797K56N14%j540J797K054j027J027K56n13L081%J027n14
316650A2357894N14J283l851M878j027p70J027J541k054p71L081p70n13j541P70
319150A2359691J798k825K57K824j283k054J027J540n13N13%j540j798J798K56
$$ plain form
321649 12359691 12359435 12360975 12358408 12358921 12356867 12356611 12357894 12357637 12353786 12355840 12355327 12358921 12356354 12354300 12356354
324149 12356354 12354813 12352246 12354300 12353786 12352759 12352503 12352759 12352503 12352503 12351732 12352503 12352759 12354813 12352503 12351732 12350706
326816 12350706 12349165 12350706 12350449 12353273 12352246 12351732 12352246 12351219 12348395 12349165 12353273 12349165 12350192 12351219
329150 12351219 12352246 12353530 12351732 12352759 12354300 12350706 12351476 12351732 12351476 12352503 12352503 12351219 12352246 12351219 12349422
331650 12349422 12353530 12353530 12351732 12355327 12352759 12352246 12354557 12355327 12353530 12352246 12351476 12353273 12351732 12352246 12352759
334149 12352759 12353273 12349165 12353786 12353530 12350449 12350449 12351219 12352503 12352503 12351219 12350706 12348652 12353273 12351219 12349165 12351732
336816 12351732 12351476 12350192 12352246 12351732 12352503 12352503 12351476 12353786 12355840 12355327 12353273 12356611 12355840 12357381 12357894 12360462
339483 12360462 12359691 12363029 12362002 12362516 12363029 12364569 12362772 12361745 12363029 12365596 12365596 12367650 12365853 12365596 12366110
$$ packed form
321649A2359691k56J540k567N13k054k56J283k57l851K054n13L594k567k054K054
324149A2356354j541k567K054n14j027k56K56k56%p71P71K56K054k310p71j026
326816A2350706j541J541k57K824j027n14N14j027k824P70M108m108J027J027
329150A2351219J027J284j798J027J541l594P70K56k56J027%j284J027j027j797
331650A2349422M108%j798L595k568n13K311P70j797j284p70J797j541N14N13
334149A2352759N14m108M621k56l081%P70J284%j284n13k054M621k054k054K567
336816A2351732k56j284K054n14P71%j027K310K054n13k054L338p71J541N13K568
339483A2360462p71L338j027N14N13J540j797j027J284K567%K054j797k57N14
$$ plain form
341983 12366110 12368164 12368164 12368934 12367907 12365083 12367907 12368677 12367907 12368934 12367650 12364826 12364826 12366110 12366110 12366880 12364056 12363543
344816 12363543 12364826 12364569 12363029 12363029 12362516 12360975 12362516 12361745 12363799 12360462 12358921 12360462 12358921 12355840 12357637
347316 12357637 12356354 12356867 12355584 12353530 12354557 12353273 12351476 12350706 12351219 12351219 12353273 12351219 12351732 12350192 12348652
349816 12348652 12347625 12345057 12349422 12346598 12349165 12346341 12349679 12345057 12347111 12348138 12348138 12346084 12349422 12349165
352149 12349165 12351732 12353273 12354300 12355327 12355584 12360462 12360462 12365853 12372272 12374839 12379460 12385365 12391270 12396662
354483 12396662 12407702 12412836 12421052 12431322 12439537 12449037 12456482 12462387 12476508 12486264 12492939 12502695 12512965
356650 12512965 12524261 12534531 12541463 12552503 12556867 12568164 12573042 12579717 12587933 12594094 12598716 12603080
358683 12603080 12607188 12608729 12612836 12615917 12617715 12617971 12616944 12618485 12617458 12617971 12614377 12613607 12610269 12610783
$$ packed form
341983A2366110K054%P70j027k824K824P70p70J027j284k824%J284%P70k824n13
344816A2363543J283k57j540%n13j541J541p71K054l337j541J541j541l081J797
347316A2357637j283N13j283k054J027j284j797p70N13%K054k054N13j540j540
349816A2348652j027k568M365k824K567k824L338m622K054J027%k054L338k57
352149A2349165K567J541J027J027K57M878%N391O419K567M621N905N905N392
354483A2396662J1040N134Q216J0270Q215R500P445N905J4121R756O675R756J0270
356650A2512965J1296J0270O932J1040M364J1297M878O675Q216O161M622M364
358683A2603080M108J541M107L081J798K56j027J541j027N13l594p70l338N14
$$ plain form
361016 12610783 12607188 12605134 12605134 12603594 12602567 12602310 12603594 12599229 12602567 12607188 12609242 12613350 12618485 12624903
363350 12624903 12634403 12643132 12655712 12671116 12686521 12699101 12718613 12735815 12755070 12781771 12804364
365166 12804364 12828241 12851861 12877792 12906290 12929653 12957381 12986649 13013863 13038510 13064441 13089345
366983 13089345 13112451 13138382 13157894 13182284 13204107 13220795 13234659 13249293 13264441 13274711 13282926
368849 13282926 13292169 13296277 13300385 13303465 13303465 13301412 13297560 13290372 13283953 13277278 13270089 13257509 13246983 13233632
371183 13233632 13217201 13205134 13189987 13176379 13157894 13140436 13122978 13102182 13082926 13066495 13047753
372999 13047753 13029525 13008985 12988703 12973042 12952503 12933247 12915275 12897047 12880616 12860847 12846726
374816 12846726 12829268 12813607 12799229 12782284 12769961 12757124 12738639 12724518 12709884 12699101 12689345
$$ packed form
361016A2610783l595k054%j540j027k57J284m365L338M621K054M108N135O418
363350A2624903R500Q729J2580J5404J5405J2580J9512J7202J9255K6701K2593
365166A2804364K3877K3620K5931K8498K3363K7728K9268K7214K4647K5931K4904
366983A3089345K3106K5931J9512K4390K1823J6688J3864J4634J5148J0270Q215
368849A3282926R243M108M108L080%k053l852p188o419o675p189j2580j0526j3351
371183A3233632j6431j2067j5147j3608j8485j7458j7458k0796j9256j6431j8742
372999A3047753j8228k0540k0282j5661k0539j9256j7972j8228j6431j9769j4121
374816A2846726j7458j5661j4378j6945j2323j2837j8485j4121j4634j0783r756
$$ plain form
376650 12689345 12673427 12662901 12650320 12641078 12628241 12616431 12605391 12597175 12587676 12578433 12568421 12560205
378683 12560205 12553530 12544544 12538639 12530166 12524261 12516046 12509627 12503209 12497560 12488831 12482156 12476765 12470603
380849 12470603 12466495 12461103 12454942 12451347 12446213 12441848 12438510 12435430 12431835 12427471 12423106 12420282 12420539 12416944
383166 12416944 12414377 12409756 12405134 12404621 12404621 12396919 12395635 12395892 12395378 12390500 12390757 12389216 12387676 12388189 12381001
385666 12381001 12380231 12380231 12377920 12377150 12376379 12375096 12374069 12373042 12372272 12371245 12369704 12369961 12367650 12369961 12368164
388166 12368164 12367650 12364826 12366110 12364569 12363029 12362002 12365083 12360975 12360462 12359691 12359435 12357637 12359948 12355840
390499 12355840 12355327 12355327 12354813 12355327 12355327 12353273 12353273 12352246 12350706 12353530 12348652 12350706 12350706 12350192 12348652 12347625 12350706
393349 12350706 12348652 12347111 12347111 12349422 12348138 12348138 12349422 12347368 12348652 12348395 12344030 12347111 12347111 12346341 12348138 12345057
$$ packed form
376650A2689345j5918j0526j2581r242j2837j1810j1040q216r499r243j0012q216
378683A2560205o675q986n905q473n905q215o419o418n649q729o675n391o162
380849A2470603m108n392o161l595n134m365l338l080l595m364m365k824K57l595
383166A2416944k567m621m622n13%p702j284K57n14m878K57j541j540N13p188
385666A2381001p70%k311p70p71j283j027j027p70j027j541K57k311K311j797
388166A2368164n14k824J284j541j540j027L081m108n13p71k56j798K311m108
390499A2355840n13%n14N14%k054%j027j540K824m878K054%n14j540j027L081
393349A2350706k054j541%K311j284%J284k054J284k57m365L081%p70J797l081
$$ plain form
396016 12345057 12345314 12345057 12344030 12344544 12343260 12345057 12346084 12345314 12344287 12340949 12341463 12342490 12341463 12342490 12342490
398516 12342490 12343003 12340949 12342490 12342490 12341976 12341463 12343517 12344544 12343003 12340436 12343003 12341976 12344030 12341463 12340179
401016 12340179 12342490 12338382 12342233 12340179 12338896 12338125 12343517 12340949 12339922 12342233 12345057 12339922 12340179 12339409
403350 12339409 12339152 12339152 12340179 12339922 12340436 12340436 12340949 12339152 12338896 12337355 12339152 12340179 12339409 12338896 12339922 12339152 12342233
406183 12342233 12340179 12342490 12338382 12342490 12341206 12341463 12340436 12344030 12342490 12339152 12342233 12341206 12340949 12343003
408516 12343003 12339922 12337869 12343003 12339922 12341463 12340949 12340949 12341463 12340179 12340436 12338896 12339152 12339152 12339922 12340179 12340179 12340436
411350 12340436 12339409 12340949 12339152 12336842 12340436 12341206 12339409 12340436 12341463 12341206 12339922 12340949 12340949 12341206 12342490
413850 12342490 12339922 12342490 12341206 12342233 12343003 12344030 12342233 12344030 12341976 12344287 12345057 12342490 12343517 12344030
$$ packed form
396016A2345057K57k57j027N14j284J797J027p70j027l338N14J027j027J027%
398516A2342490N13k054J541%n14n13K054J027j541k567K567j027K054k567j284
401016A2340179K311m108L851k054j283p71N392k568j027K311K824n135K57p70
403350A2339409k57%J027k57N14%N13j797k56j541J797J027p70n13J026p70L081
406183A2342233k054K311m108M108j284K57j027L594j540l338L081j027k57K054
408516A2343003l081k053N134l081J541n14%N14j284K57j540K56%P70K57%K57
411350A2340436j027J540j797k310L594P70j797J027J027k57j284J027%K57J284
413850A2342490k568K568j284J027P70J027j797J797k054K311P70k567J027N13
$$ plain form
416183 12344030 12343003 12343260 12342490 12345057 12343003 12345057 12344287 12346084 12345314 12348138 12345314 12344287 12341206 12345057
418516 12345057 12342233 12344287 12346084 12343003 12342490 12344287 12343260 12342233 12342490 12340179 12342490 12341976 12344030 12342233
420849 12342233 12342233 12343517 12343003 12341463 12343517 12341206 12341206 12342233 12339152 12341976 12338896 12340949 12341463 12343260 12340179
423350 12340179 12343260 12343003 12342233 12339409 12341206 12341463 12341976 12339409 12341463 12341463 12339152 12340949 12340436 12338896 12344030
425849 12344030 12341463 12339152 12339922 12340949 12341976 12339922 12338382 12340949 12341463 12341463 12338382 12339922 12339152 12340949 12342233
428350 12342233 12338896 12337869 12339409 12339922 12339152 12338125 12337355 12336328 12339409 12340436 12339152 12335815 12338896 12335301
430666 12335301 12335815 12337869 12337869 12337355 12337098 12337869 12338382 12337869 12336842 12338382 12336328 12336842 12337869 12336328 12335044 12338382
433349 12338382 12336328 12335815 12338896 12335815 12334788 12335301 12335301 12335044 12334274 12336071 12335044 12335301 12335044 12336071 12333247 12332991
$$ packed form
416183A2344030j027K57p70K567k054K054p70J797p70K824k824j027l081L851
418516A2345057k824K054J797l081n13J797j027j027K57k311K311n14K054j797
420849A2342233%J284n14j540K054k311%J027l081K824l080K053N14J797l081
423350A2340179L081k57p70k824J797K57N13k567K054%k311J797n13j540N134
425849A2344030k567k311P70J027J027k054j540K567N14%l081J540p70J797J284
428350A2342233l337j027J540N13p70j027p70j027L081J027j284l337L081l595
430666A2335301N14K054%n14k57P71N13n13j027J540k054N14J027j541j284L338
433349A2338382k054n13L081l081j027N13%k57p70J797j027K57k57J027k824k56
$$ plain form
436016 12332991 12337355 12336071 12335815 12334274 12335301 12336071 12338382 12335044 12335815 12337355 12336071 12336842 12336071 12337355 12337098
438516 12337098 12340179 12339922 12335301 12339922 12338125 12338382 12343260 12339409 12340179 12340436 12338125 12339152 12340179 12338382
440850 12338382 12340179 12339922 12341976 12340179 12341206 12341976 12344030 12337869 12341206 12341976 12343517 12342233 12340949 12341976
443166 12341976 12343003 12341463 12340949 12340949 12341206 12340949 12342233 12342233 12340949 12339922 12339922 12343003 12343260 12340179 12340436 12338896 12339922
446016 12339922 12336071 12339409 12339922 12338382 12337869 12339922 12339152 12338125 12337355 12337355 12337098 12335044 12337355 12338382 12335815
448516 12335815 12339922 12338125 12336071 12338125 12333247 12336071 12335815 12334017 12334017 12335301 12333247 12332220 12335301 12333761
450849 12333761 12333247 12335301 12332220 12332734 12332734 12333247 12332220 12331707 12333247 12334017 12331193 12330680 12334274 12330166 12331193 12333761
453516 12333761 12335044 12330166 12333247 12331193 12331964 12331964 12329653 12329653 12328883 12334274 12330680 12333247 12330937 12331193 12332991 12332220
$$ packed form
436016A2332991M364j284k56j541J027P70K311l338P71J540j284P71p71J284k57
438516A2337098L081k57m621M621j797K57M878l851P70K57k311J027J027j797
440850A2338382J797k57K054j797J027P70K054o161L337P70J541j284j284J027
443166A2341976J027j540n14%K57k57J284%j284j027%L081K57l081K57j540J026
446016A2339922l851L338N13j540n13K053p70j027p70%k57k054K311J027k567
448516A2335815M107j797k054K054m878K824k56j798%J284k054j027L081j540
450849A2333761n14K054l081N14%N13j027n13J540P70k824n13L594m108J027K568
453516A2333761J283m878L081k054P71%k311%p70N391l594K567k310K56J798p71
$$ plain form
456183 12332220 12331964 12332220 12331193 12331707 12332220 12330166 12331964 12333761 12330937 12333761 12331707 12332734 12330680 12330166 12330937
458683 12330937 12330937 12330680 12331193 12328626 12332220 12330680 12332734 12331707 12332220 12331193 12330680 12330937 12334017 12332734 12331964 12330937
461350 12330937 12335044 12331707 12331193 12332220 12335301 12333761 12334788 12334274 12332734 12335301 12335044 12335301 12334788 12334788 12335044 12332734
464016 12332734 12333761 12334274 12334788 12333761 12332991 12335044 12335301 12334274 12335044 12335301 12335044 12335044 12334788 12337869 12337355 12335815
466650 12335815 12335815 12335044 12335815 12338896 12335301 12332220 12335815 12332734 12337869 12337098 12336842 12337869 12337098 12336842 12337098 12333761
469316 12333761 12336842 12336071 12336328 12336842 12337355 12336842 12335301 12336328 12337355 12338382 12335301 12339152 12335815 12336842 12338382
471816 12338382 12335815 12337355 12337355 12339409 12335301 12338125 12338896 12337869 12339922 12336842 12339409 12336842 12337869 12336842
474150 12336842 12339152 12339922 12338382 12337098 12339409 12339922 12337869 12338896 12338896 12337869 12338125 12339409 12339152 12336842 12339409
$$ packed form
456183A2332220k56K56j027N14N13k054J798J797k824K824k054J027k054n14P71
458683A2330937%k57N13k567L594j540K054j027N13j027n13K57L080j283p70j027
461350A2330937M107l337n14J027L081j540J027n14j540K567k57K57n13%K56k310
464016A2332734J027N13N14j027p70K053K57j027P70K57k57%k56L081n14j540
466650A2335815%p71P71L081l595l081L595l081N135p71k56J027p71k56K56l337
469316A2333761L081p71K57N14N13n13j541J027J027J027l081L851l337J027J540
471816A2338382k567J540%K054m108K824P71j027K053l080K567k567J027j027
474150A2336842K310P70j540j284K311N13k053J027%j027K56J284k57k310K567
$$ plain form
476649 12339409 12335815 12339409 12336328 12338125 12334017 12337355 12339409 12335301 12336842 12337869 12336842 12337098 12337098 12337098 12334788
479149 12334788 12337869 12339152 12336328 12335815 12338125 12337869 12338382 12339152 12336842 12337098 12340436 12338125 12337355 12338125 12339152
481649 12339152 12337355 12338382 12339922 12335815 12337869 12337869 12339409 12338896 12337355 12338382 12339922 12339922 12338896 12339152 12340179
484149 12340179 12338125 12339922 12336071 12341206 12338382 12339922 12340436 12339922 12341976 12339152 12342490 12341206 12339922 12341206
486516 12341206 12339922 12340949 12340179 12343260 12340436 12340436 12339409 12338896 12341463 12341463 12341976 12343003 12343003 12340949 12343517 12342233
489149 12342233 12343003 12345057 12343517 12343517 12343517 12343003 12344287 12342233 12345057 12344544 12346341 12347111 12345314 12348138 12345571 12345314
491816 12345314 12345314 12345571 12347625 12347111 12346598 12347368 12349679 12348395 12348652 12347368 12348652 12349679 12348138 12348395 12347625 12352246
494483 12352246 12349679 12352759 12348138 12349422 12347625 12348395 12351219 12351219 12351476 12352246 12353273 12351476 12352246 12350192 12353273
$$ packed form
476649A2339409l594L594l081J797m108L338K054m108J541J027j027K56%%k310
479149A2334788L081J283k824n13K310k56N13P70k310K56L338k311p70P70J027
481649A2339152j797J027J540m107K054%J540n13j541J027J540%j026K56J027
484149A2340179k054J797l851N135k824J540N14n14K054k824L338j284j284J284
486516A2341206j284J027p70L081k824%j027n13K567%N13J027%k054K568j284
489149A2342233P70K054j540%%n14J284k054K824n13J797P70j797K824k567k57
491816A2345314%K57K054n14n13P70K311j284K57j284J284J027j541K57p70M621
494483A2352246k567L080m621J284j797P70K824%K57P70J027j797P70k054L081
$$ plain form
496983 12353273 12354557 12355840 12352246 12352759 12353786 12353530 12353530 12351476 12352503 12357381 12355327 12356867 12351476 12352246 12356354
499483 12356354 12353273 12353786 12354300 12353786 12352759 12354300 12353530 12354557 12354557 12353273 12355584 12354557 12354557 12356867 12356867 12355327 12356611
502316 12356611 12355840 12356611 12355584 12353786 12353786 12356354 12356867 12356611 12355584 12356611 12356354 12357894 12358408 12359435 12355327 12357894
504999 12357894 12357637 12356354 12356867 12357894 12360462 12359435 12359435 12359691 12359948 12362516 12362002 12360975 12359435 12362516 12360462
507500 12360462 12360462 12364826 12361745 12360718 12360462 12363029 12362002 12362002 12362002 12360718 12361745 12361745 12362516 12362772 12360975 12363543 12360975
510333 12360975 12361745 12362002 12362516 12360975 12361489 12361489 12362516 12360975 12361745 12362002 12363029 12361745 12361745 12361745 12360718 12362772 12360718
513166 12360718 12362516 12359948 12361745 12361489 12361745 12361745 12360462 12363029 12362516 12362772 12362002 12362516 12360462 12362772 12361489 12362002
515849 12362002 12359948 12362516 12361745 12362516 12359948 12363029 12363799 12361745 12360462 12363029 12365083 12360718 12362772 12363029
$$ packed form
496983A2353273J284J283l594N13J027k56%k054J027M878k054J540n391P70M108
499483A2356354l081N13N14n14j027J541p70J027%j284K311j027%K310%j540J284
502316A2356611p71P71j027j798%K568N13k56j027J027k57J540N14J027m108K567
504999A2357894k57j283N13J027K568j027%K56K57K568n14j027j540L081k054
507500A2360462%M364l081j027k56K567j027%%j284J027%P71K56j797K568k568
510333A2360975P70K57N14j541N14%J027j541P70K57J027j284%%j027K054k054
513166A2360718J798k568J797k56K56%j283K567n13K56p70N14k054K310j283N13
515849A2362002k054K568p71P71k568L081P70k054j283K567K054m365K054K57
$$ plain form
518166 12363029 12360718 12360975 12360975 12362772 12362772 12363799 12364826 12362002 12363799 12365596 12363029 12363029 12363029 12362516 12365083 12362772 12364056
521016 12364056 12365596 12362516 12362516 12365083 12365596 12365083 12365596 12365083 12366110 12364056 12363543 12362772 12366880 12365853 12366110 12363543
523683 12363543 12362516 12364569 12364569 12362772 12363543 12363799 12362002 12362516 12362002 12361745 12360975 12363029 12360462 12363029 12361489 12360462
526350 12360462 12363029 12363543 12359948 12364056 12362002 12360718 12361489 12361745 12361489 12361745 12360975 12357381 12359435 12360718 12359948
528850 12359948 12358664 12360975 12358664 12358664 12360718 12357894 12357894 12358408 12358408 12359435 12357381 12357894 12359435 12355584 12360462 12355584
531516 12355584 12356611 12356611 12354813 12360462 12356354 12358408 12357894 12357894 12361489 12359691 12357637 12357894 12358408 12359948 12359948 12359691 12359691
534316 12359691 12358921 12359948 12360462 12359691 12362002 12359435 12359948 12359691 12361745 12359691 12358921 12359948 12361489 12358408 12357894
536816 12357894 12360975 12360975 12363543 12359948 12362516 12361745 12361489 12362516 12359948 12359948 12363029 12362002 12362772 12363029 12360975 12362772
$$ packed form
518166A2363029k311K57%J797%J027J027k824J797J797k567%%n13K567k311J284
521016A2364056J540l080%K567N13n13N13n13J027k054n13p71M108j027K57k567
523683A2363543j027K053%j797P71K56j797N14n14k57p70K054k567K567j540j027
526350A2360462K567N14l595M108k054j284P71K56k56K56p70l594K054J283p70
528850A2359948j284K311k311%K054k824%N14%J027k054N13J541l851M878m878
531516A2355584J027%j798N649m108K054n14%L595j798k054K57N14J540%k57%
534316A2359691p70J027N14p71K311k567N13k57K054k054p70J027J541l081n14
536816A2357894L081%K568l595K568p71k56J027k568%L081j027P70K57k054J797
$$ plain form
539483 12362772 12362002 12363799 12359691 12362516 12361489 12361489 12363543 12362772 12362002 12360975 12362516 12363543 12361489 12362772 12362516
541983 12362516 12364826 12365083 12361745 12362516 12361489 12360718 12362002 12365596 12363543 12362002 12362002 12362772 12361745 12361745 12362002 12363543
544650 12363543 12361489 12364056 12363799 12364569 12362002 12363543 12360718 12360462 12362516 12360975 12360718 12359435 12356867 12358664
546983 12358664 12356354 12358408 12358408 12356867 12358408 12354557 12355840 12355327 12356867 12354813 12354300 12355327 12355584 12355327 12353273
549483 12353273 12356354 12354813 12353786 12351732 12354300 12354557 12355327 12353786 12352759 12352759 12353786 12350706 12351476 12351476 12350706 12352503
552150 12352503 12352246 12352246 12350449 12349422 12351732 12348138 12348652 12349165 12348652 12348395 12347368 12348652 12348395 12351219 12347625 12349165
554816 12349165 12348395 12348395 12343517 12346341 12346084 12345571 12348395 12344030 12347368 12344030 12344544 12345057 12343260 12344287 12347625
557316 12347625 12347111 12346084 12343517 12348138 12345314 12345314 12343260 12342490 12346598 12341976 12343517 12341206 12343260 12343260 12343260 12341463
$$ packed form
539483A2362772p70J797m108K825j027%K054p71p70j027J541J027k054J283k56
541983A2362516K310K57l338P71j027p71J284L594k053j541%P70j027%K57J541
544650A2363543k054K567k57P70k567J541k825k56K054j541k57j283k568J797
546983A2358664k310K054%j541J541l851J283n13J540k054n13J027K57k57k054
549483A2353273L081j541j027k054K568K57P70j541j027%J027l080P70%p70J797
552150A2352503k57%j797j027K310l594N14N13n13k57j027J284k57K824l594J540
554816A2349165p70%m878K824k57n13K824m365L338l338N14N13j797J027L338
557316A2347625n14j027k567M621k824%k054p70M108m622J541k311K054%%j797
$$ plain form
559999 12341463 12343260 12339922 12340949 12340436 12340179 12342233 12341463 12341976 12339409 12339922 12339409 12337098 12340949 12337869 12339152
562500 12339152 12337098 12339152 12339409 12339152 12336842 12336071 12339152 12336328 12338896 12335044 12336842 12336328 12337355 12335044
564816 12335044 12335301 12335044 12335815 12334788 12335301 12332991 12332991 12338896 12331707 12334017 12335044 12335044 12334274 12334274 12334274 12335815 12336328 12330680
567833 12330680 12335044 12330937 12334788 12334788 12333761 12333761 12333247 12334274 12331964 12334017 12334274 12330937 12331193 12331193 12332991 12333247 12332220
570666 12332220 12329910 12334017 12330937 12330937 12332991 12330937 12334788 12330937 12331964 12333247 12332734 12332220 12333247 12332991 12334274
573166 12334274 12330937 12336071 12332734 12330680 12330680 12333247 12330680 12330166 12329653 12331964 12330680 12332991 12330937 12330937 12331964
575666 12331964 12329910 12333247 12334017 12330937 12329653 12330937 12329910 12330937 12328883 12330166 12330680 12330166 12329910 12329910 12329910 12330680
578350 12330680 12331964 12330166 12328626 12329910 12330166 12330166 12332220 12328883 12330937 12328626 12333247 12331193 12330680 12330680 12332220
$$ packed form
559999A2341463J797l338J027n13k57K054p70N13k567N13n13k311L851l080J283
562500A2339152k054K054K57k57k310p71L081k824K568l852J798n14J027k311
564816A2335044K57k57P71j027N13k310%N905p189K310J027%p70%%J541N13n648
567833A2330680M364m107L851%j027%n14J027k310K053K57l337K56%J798K56j027
570666A2332220k310M107l080%K054k054L851l851J027J283n13n14J027k56J283
573166A2334274l337N134l337k054%K567k567n14n13K311j284K311k054%J027
575666A2331964k054L337P70l080j284J284j027J027k054J283N14n14k56%%P70
578350A2330680J284j798j540J284K56%K054l337K054k311M621k054n13%J540
$$ plain form
580850 12332220 12332734 12332734 12332734 12334017 12331707 12329910 12333761 12331707 12336842 12333761 12333761 12334017 12332734 12334788 12335301 12336842
583516 12336842 12334017 12339152 12335815 12337869 12337098 12338896 12334788 12336328 12339922 12338896 12337869 12340179 12339152 12335815
585850 12335815 12339409 12339922 12343260 12338896 12338125 12335301 12335815 12338382 12338896 12336842 12335301 12336842 12333761 12339922
588166 12339922 12335044 12335301 12335301 12335301 12337355 12337355 12335301 12335044 12335301 12335044 12338896 12331964 12334788 12334788 12330680 12334788 12331707
591016 12331707 12334017 12333247 12334017 12333247 12334274 12332734 12331964 12330937 12331964 12333761 12332220 12332734 12330680 12334274 12330937
593516 12330937 12334788 12331193 12330680 12333247 12330937 12334788 12331964 12332734 12330680 12330166 12332220 12332991 12330166 12330937 12331964
596016 12331964 12331707 12330937 12328626 12330166 12331193 12330166 12330166 12331193 12330680 12329910 12333247 12331707 12332220 12329653 12331964
598516 12331964 12330937 12334017 12330937 12331964 12332991 12334274 12332220 12331193 12332220 12334274 12330680 12330937 12334788 12333247
$$ packed form
580850A2332220N14%%J283k310j797L851k054N135l081%K56j283K054N13J541
583516A2336842k825N135l337K054p71J798m108J540L594j026j027K310j027l337
585850A2335815L594N13L338m364p71k824N14K567N14k054j541J541l081O161
588166A2339922m878K57%%K054%k054k57K57k57L852o932K824%m108M108l081
591016A2331707K310p70P70p70J027j540p70j027J027J797j541N14k054L594l337
593516A2330937L851l595n13K567k310L851k824P70k054n14K054P71k825P71J027
596016A2331964k57p70k311J540J027j027%J027n13p70L337j540N13k567K311
598516A2331964j027L080l080J027J027J283k054j027J027K054l594K57L851j541
$$ plain form
600849 12333247 12332220 12334788 12332991 12336071 12334017 12332734 12331964 12333247 12332734 12332991 12335044 12333761 12330937 12331964
603166 12331964 12334274 12331707 12331193 12330680 12332734 12334274 12333247 12332734 12334017 12330680 12335044 12334017 12331193 12335044
605500 12335044 12331964 12333247 12335044 12330680 12336071 12334274 12331964 12332991 12335815 12334274 12335044 12334274 12332220 12334788
607833 12334788 12334788 12333761 12335815 12332991 12332991 12333761 12334788 12334017 12333247 12334788 12334017 12331707 12334788 12335301 12335044 12334788 12331193
610666 12331193 12337098 12333761 12334274 12337869 12334274 12337355 12335301 12336328 12335815 12338125 12339152 12339152 12337098 12335044 12337355
613166 12337355 12337098 12332991 12335301 12334274 12337869 12336071 12337098 12337098 12333761 12337869 12335044 12336071 12335815 12338382 12335044
615666 12335044 12336328 12334017 12335815 12339409 12335301 12339409 12339409 12340179 12335815 12335301 12337098 12335044 12338125 12339922 12335301
618166 12335301 12335815 12339409 12335301 12335815 12338382 12336842 12335044 12334017 12331707 12335815 12336842 12332991 12337355 12333247
$$ packed form
600849A2333247j027K568j797L080k054j283p70J283n13K57K053j283k824J027
603166A2331964K310k567n14n13K054J540j027n13J283l337M364j027k824L851
605500A2335044l080J283J797m364N391j797k310J027K824j541P70p70k054K568
607833A2334788%j027K054k824%P70J027p71p70J541p71k310L081N13k57k56l595
610666A2331193N905l337N13L595l595L081k054J027n13K310J027%k054k054K311
613166A2337355k57m107K310j027L595j798J027%l337M108k825J027k56K567l338
615666A2335044J284k311J798L594m108M108%P70m364n14J797k054L081J797m621
618166A2335301N14L594m108N14K567j540j798j027k310M108J027l851M364m108
$$ plain form
620500 12333247 12331964 12331707 12332734 12332734 12330166 12334788 12334788 12333247 12332991 12335044 12330680 12333761 12330937 12334788 12331193
623000 12331193 12334274 12331193 12334017 12332991 12331964 12331707 12334017 12335044 12330166 12333247 12331964 12330937 12327599 12331193
625333 12331193 12329653 12331193 12328626 12331193 12330166 12326829 12328626 12329910 12329653 12328112 12328883 12329139 12331707 12329139
627666 12329139 12331964 12331707 12328626 12329139 12330937 12331964 12329910 12329139 12328112 12328112 12327599 12324775 12326829 12328112 12326572
630166 12326572 12324775 12326572 12322721 12324775 12323748 12323748 12324518 12320924 12321694 12319383 12318613 12317843 12317843 12316559 12318870 12316302
632833 12316302 12320410 12319383 12319640 12322721 12321951 12318356 12319640 12319897 12318356 12321694 12322721 12319640 12321951 12321437
635166 12321437 12321694 12321437 12319897 12318356 12316559 12318870 12318613 12318870 12317843 12318870 12318356 12317329 12316816 12314762 12313735
637666 12313735 12312708 12313222 12312708 12311168 12310141 12308344 12308087 12311168 12310141 12309114 12308344 12307060 12307317 12308087 12306033
$$ packed form
620500A2333247j283k57J027%k568M622%j541k56K053m364L081k824L851l595
623000A2331193L081l081K824j026j027k57K310J027m878L081j283j027l338L594
625333A2331193j540J540k567K567j027l337J797J284k57j541P71K56K568k568
627666A2329139K825k57l081N13J798J027k054p71j027%n13k824K054J283j540
630166A2326572j797J797l851K054j027%P70l594P70k311p70p70%j284K311k568
632833A2316302M108j027K57L081p70l595J284K57j541L338J027l081K311n14
635166A2321437K57k57j540j541j797K311k57K57j027J027n14j027n13k054j027
637666A2313735j027N14n14j540j027j797k57L081j027j027p70j284K57P70k054
$$ plain form
640166 12306033 12308087 12309114 12305006 12306290 12305519 12306033 12305006 12303465 12304236 12305006 12306546 12305006 12305263 12308087 12306290
642666 12306290 12306290 12306033 12307573 12306033 12307573 12308087 12305263 12308087 12307060 12307060 12307060 12305519 12305006 12307317 12304492 12305263 12305006
645500 12305006 12305263 12306033 12305263 12306290 12312195 12307573 12308087 12306290 12309114 12307317 12308344 12308344 12305006 12307060 12307573
648000 12307573 12306546 12309627 12308344 12308344 12311424 12309627 12309627 12311424 12313222 12313222 12311681 12314762 12314762 12317329 12317329 12313735 12314505
650849 12314505 12315532 12315532 12314505 12316302 12317586 12318870 12316559 12321437 12321951 12319640 12320924 12320667 12321437 12319383 12322721
653350 12322721 12320410 12322721 12321437 12324005 12324518 12326059 12321437 12324775 12322978 12323491 12320667 12324775 12324775 12324005 12323748
655850 12323748 12321437 12327086 12325545 12324518 12325802 12325032 12325802 12324005 12325032 12326572 12325545 12325032 12324775 12324518 12325032
658349 12325032 12325032 12323491 12323748 12324518 12325545 12323491 12324775 12324518 12323491 12327086 12324775 12324005 12323491 12325032 12326829
$$ packed form
640166A2306033K054J027m108J284p71N14j027j541P71P70J540j540K57K824j797
642666A2306290%k57J540j540J540N14k824K824j027%%j541n13K311k825P71k57
645500A2305006K57P70p70J027N905m622N14j797K824j797J027%l338K054N13
648000A2307573j027L081j283%L080j797%J797J798%j541L081%K567%l594P70
650849A2314505J027%j027J797J284J284k311M878N14k311J284k57P70k054L338
653350A2322721k311K311j284K568N13J541m622L338j797N13k824M108%p70k57
655850A2323748k311N649j541j027J284p70P70j797J027J540j027n13k57k57N14
658349A2325032%j541K57P70J027k054J284k57j027L595k311p70n14J541J797
$$ plain form
660850 12326829 12326572 12325802 12327599 12323491 12325545 12326829 12324518 12328112 12326572 12328112 12326059 12324775 12326059 12328112
663166 12328112 12325032 12328626 12325032 12325802 12330680 12327856 12325545 12327856 12328626 12326829 12327086 12329653 12327856 12329139
665500 12329139 12330166 12328883 12328112 12330166 12328883 12330680 12328112 12329139 12329139 12327599 12328883 12328883 12327856 12330680 12330166
668000 12330166 12328883 12331707 12328626 12328883 12331193 12330937 12328112 12330937 12330937 12329139 12330166 12330680 12331964 12329139 12329910
670500 12329910 12330937 12330680 12330166 12330680 12331707 12330937 12334274 12330166 12329653 12330166 12331193 12330680 12331193 12328112 12330680
673000 12330680 12330166 12330937 12333247 12330680 12330680 12330680 12332991 12328883 12331707 12330937 12330937 12333247 12328883 12332220 12332734 12329910 12330937
675849 12330937 12331964 12330166 12330166 12331707 12329910 12332220 12330166 12331707 12333247 12331193 12330680 12328883 12331193 12331964 12330937
678350 12330937 12328112 12329910 12328112 12330680 12330937 12328626 12328626 12330937 12330166 12328626 12329139 12328112 12330166 12329653 12329910
$$ packed form
660850A2326829k57p70J797m108K054J284k311L594j540J540k053j284J284K053
663166A2328112l080L594l594P70M878k824k311K311P70j797K57K567j797J283
665500A2329139J027j283p71K054j283J797k568J027%j540J284%j027K824n14
668000A2330166j283K824l081K57K310k56k825K825%j798J027N14J284k825P71
670500A2329910J027k57n14N14J027p70L337m108n13N13J027n13N13l081K568
673000A2330680n14P71K310k567%%K311m108K824p70%K310m364L337N14k824J027
675849A2330937J027j798%J541j797K310k054J541J540k054n13j797K310P71j027
678350A2330937k825J798j798K568K57k311%K311p71j540N13j027K054n13K57
$$ plain form
680850 12329910 12330166 12329139 12328626 12330680 12330680 12334274 12331964 12329139 12332734 12331964 12333247 12331707 12331193 12331707 12332220 12330937
683516 12330937 12330166 12330680 12333247 12334788 12333247 12332991 12333761 12336842 12333761 12332991 12334274 12334788 12334274 12333761 12335301
686016 12335301 12337098 12335044 12336328 12334274 12334788 12335301 12335044 12336328 12335301 12337869 12335815 12335044 12335301 12335044 12335815
688516 12335815 12337869 12336842 12335044 12335301 12338382 12336842 12336071 12338896 12339409 12336071 12338382 12338896 12338896 12339409 12337355
691016 12337355 12337869 12337869 12337355 12339409 12337869 12337869 12338896 12337869 12340179 12338896 12338125 12337355 12339409 12339409 12339152 12339409 12340949
693850 12340949 12337869 12338896 12340436 12340179 12341976 12341463 12340179 12341463 12340436 12340179 12340949 12341206 12343260 12339922 12343517
696350 12343517 12342233 12341976 12341463 12343517 12341463 12339922 12344287 12343260 12339409 12344544 12342233 12344287 12347111 12342490
698683 12342490 12344544 12347111 12344544 12345057 12343517 12343260 12343260 12341976 12344287 12341463 12342233 12340949 12339922 12338896 12338896 12335815
$$ packed form
680850A2329910K56j027n13K054%L594k310k825L595p70J283j540n14N14N13j283
683516A2330937p71N14K567J541j541k56P70L081l081p70J283N14n14n13J540
686016A2335301J797k054J284k054N14N13k57J284j027K568k054p71K57k57P71
688516A2335815K054j027j798K57L081j540p71K825N13l338K311N14%N13k054
691016A2337355N14%n14K054j540%J027j027K310j283p71p70K054%k57K57J540
693850A2340949l080J027J540k57J797n13j284J284j027k57P70K57K054l338L595
696350A2343517j284k57n13K054k054j541M365j027l851N135k311K054K824m621
698683A2342490K054K567k567N13j540k57%j284K311k824P70j284j027j026%l081
$$ plain form
701350 12335815 12339409 12339152 12337869 12338382 12336071 12338382 12337869 12338125 12341463 12338896 12340179 12339409 12338125 12336842 12338896
703850 12338896 12341463 12337098 12338896 12339409 12339922 12340949 12340179 12339922 12344030 12343260 12343260 12340179 12339922 12342490 12342233 12343517
706516 12343517 12343517 12343003 12345057 12345571 12344287 12345314 12345571 12347625 12344544 12344544 12346598 12347368 12347368 12347368 12347368 12347111 12349165 12347625
709483 12347625 12348138 12348395 12348138 12349165 12347368 12349422 12347625 12349165 12346598 12348395 12347625 12348652 12350192 12351476
711816 12351476 12347111 12350192 12348395 12350449 12350192 12349422 12348138 12348652 12349679 12351476 12349165 12350706 12351732 12352246
714149 12352246 12350449 12349422 12349422 12350449 12350449 12350706 12350449 12351219 12354300 12352246 12353273 12352246 12353273 12354300 12354557 12354813
716816 12354813 12355584 12357894 12357381 12356867 12356354 12357894 12357894 12357381 12356867 12357637 12359435 12358408 12357637 12357637 12357381 12359691 12359948
719650 12359948 12360975 12362772 12361489 12360718 12361489 12363799 12362772 12362002 12363543 12363029 12364056 12364826 12364569 12365083 12366110
$$ packed form
701350A2335815L594k57j283N13k311K311n13K56L338k567J283p70j284j283K054
703850A2338896K567m365J798N13N13J027p70k57M108p70%l081k57K568k57J284
706516A2343517%n14K054N14j284J027K57K054l081%K054P70%%%k57K054j540
709483A2347625N13K57k57J027j797K054j797J540k567J797p70J027J540J284
711816A2351476m365L081j797K054k57p70j284N14J027J797k311J541J026N14
714149A2352246j797j027%J027%K57k57P70L081k054J027j027J027J027K57K56
716816A2354813P71K310n13n14n13J540%n13n14P70J798j027p71%k56K310K57
719650A2359948J027J797j283p71P71K310j027p70J541n14J027P70k57N14J027
$$ plain form
722150 12366110 12365596 12367137 12367137 12366880 12367907 12366623 12368677 12366880 12368677 12367137 12368164 12369191 12366880 12368677 12369191
724650 12369191 12366623 12368677 12368934 12369191 12370218 12367650 12369191 12369961 12369704 12371245 12371245 12372015 12370218 12371245 12370731 12370731
727316 12370731 12370731 12373299 12372015 12369191 12370988 12373812 12370218 12374069 12371245 12370988 12371245 12370988 12372785 12370218 12372272
729816 12372272 12374839 12372272 12373812 12373812 12373812 12374839 12373299 12373042 12372272 12373042 12370731 12373042 12372785 12373812 12371245 12370218
732500 12370218 12369191 12371758 12372785 12369961 12370731 12371245 12370218 12371758 12372272 12370731 12370218 12370731 12368677 12370731 12369961
734999 12369961 12370731 12367137 12370988 12368677 12368164 12369704 12369704 12366623 12367907 12367650 12367137 12366880 12367137 12365596 12367137 12367907
737666 12367907 12366623 12366110 12365596 12366880 12364056 12366880 12365083 12366110 12365596 12365853 12364569 12364826 12363543 12363799 12364826
740166 12364826 12363029 12363029 12362002 12362516 12362772 12360718 12360718 12362772 12363029 12362516 12364056 12358921 12360975 12362002 12360462 12361489
$$ packed form
722150A2366110n14J541%k57J027j284K054j797J797j540J027J027k311J797N14
724650A2369191k568K054K57K57J027k568J541P70k57J541%P70j797J027n14%
727316A2370731%K568j284k824J797K824l594L851k824k57K57k57J797k567K054
729816A2372272K567k567J540%%J027j540k57p70P70k311K311k57J027k567j027
732500A2370218j027K567J027k824P70N14j027J540N14j541n13N13k054K054p70
734999A2369961P70l594L851k311n13J540%l081J284k57n13k57K57j541J541P70
737666A2367907j284n13n14J284k824K824j797J027n14K57j284K57j283K56J027
740166A2364826j797%j027N14K56k054%K054K57n13J540n135K054J027j540J027
$$ plain form
742833 12361489 12359948 12360718 12359691 12358664 12357381 12357381 12358921 12358664 12358921 12359691 12357637 12354813 12354813 12357637 12356867 12356867 12356354
745666 12356354 12355327 12357381 12356867 12357894 12353273 12353530 12359691 12355327 12351732 12353786 12354813 12352759 12354557 12354557 12352503
748166 12352503 12350449 12354300 12355327 12351732 12351219 12351476 12351732 12351732 12351219 12349679 12353530 12353273 12350706 12350192 12350706 12347625
750849 12347625 12347368 12348138 12349165 12346341 12350192 12346341 12348138 12349422 12350192 12348652 12350192 12350449 12349679 12349422 12349422 12349679
753516 12349679 12350706 12350706 12349422 12347368 12349422 12348138 12346084 12345314 12345314 12343003 12345314 12344287 12343517 12342233 12343517
756016 12343517 12341463 12342490 12344287 12341976 12340949 12344030 12344287 12343260 12341463 12340949 12342233 12340436 12337869 12341206
758349 12341206 12342490 12340949 12339922 12342490 12341976 12340179 12340436 12339409 12341206 12337869 12340436 12341976 12338382 12340949
760666 12340949 12339152 12340436 12340179 12339152 12337355 12338125 12340179 12340179 12341463 12335815 12335301 12338125 12336071 12339409 12336328
$$ packed form
742833A2361489j541P70j027j027j283%J540k57K57P70k054k824%K824p70%n13
745666A2356354j027K054n14J027m621K57O161m364l595K054J027k054J798%k054
748166A2352503k054L851J027l595n13K57K56%n13j540L851k57k567n14N14l081
750849A2347625k57P70J027k824L851l851J797J284P70j540J540K57p70k57%K57
753516A2349679J027%j284k054K054j284k054p70%k311K311j027p70j284J284
756016A2343517k054J027J797k311j027L081K57j027j797n14J284j797k567L337
758349A2341206J284j541j027K568n14j797K57j027J797l337K567J540l594K567
760666A2340949j797J284k57j027j797P70K054%J284n648n14K824k054L338l081
$$ plain form
763166 12336328 12336071 12337869 12337355 12339152 12335815 12334274 12337098 12338382 12336328 12337355 12336071 12334274 12335301 12335301 12330680
765666 12330680 12338125 12335044 12331707 12335301 12331193 12334017 12331193 12332220 12331964 12332220 12332991 12333247 12331964 12332220 12332220
768166 12332220 12330937 12329139 12330166 12330166 12329139 12329910 12329653 12327599 12329653 12329653 12326572 12327086 12326829 12327086 12327599 12329910
770849 12329910 12326829 12326059 12326829 12327086 12327856 12325032 12326572 12327086 12326829 12324518 12325802 12327086 12324005 12326829 12325802
773350 12325802 12326829 12325545 12326059 12326572 12325802 12325802 12325032 12326572 12326829 12326572 12325545 12326829 12324518 12326829 12326829 12324775
776016 12324775 12325032 12324005 12322978 12326059 12324518 12325545 12323748 12324775 12324775 12322464 12325545 12324518 12324518 12325032 12324518 12325545
778683 12325545 12325802 12326059 12323491 12324005 12322978 12324005 12321951 12324518 12322721 12325802 12325032 12325032 12322978 12321951 12325545
781183 12325545 12322721 12323491 12322978 12322464 12323491 12322464 12320924 12321694 12320924 12322721 12320410 12320924 12321694 12321437 12322464
$$ packed form
763166A2336328k57J798n14J797l337j541K824J284k054J027j284j797J027%m621
765666A2330680P445l081l337L594m108K824k824J027k56K56P71K56j283K56%
768166A2332220j283j798J027%j027P71k57k054K054%l081N14k57K57N13K311
770849A2329910l081p70P70K57P70k824J540N14k57k311J284J284l081K824j027
773350A2325802J027j284N14N13p70%p70J540K57k57j027J284k311K311%k054
776016A2324775K57j027j027L081j541J027j797J027%k311L081j027%N14n14J027
778683A2325545K57K57k568N14j027J027k054K567j797L081p70%k054j027L594
781183A2325545k824P70n13n14J027j027j540P70p70J797k311N14P70k57J027
$$ plain form
783683 12322464 12319897 12319383 12321437 12321694 12315789 12319383 12318613 12320410 12317843 12320667 12318356 12319897 12319640 12320667
786016 12320667 12318356 12319897 12319383 12317843 12319383 12321437 12319640 12319897 12319383 12320667 12320667 12320410 12318870 12316302 12318356
788516 12318356 12316302 12319897 12317586 12317843 12316816 12318870 12317329 12317329 12318613 12318356 12320924 12316559 12316559 12318870 12318870 12316816
791183 12316816 12318613 12316816 12316302 12317843 12318613 12316559 12316302 12315789 12317843 12317329 12317843 12316816 12318356 12316816 12316559
793683 12316559 12315275 12315532 12318870 12316816 12318356 12318356 12319897 12318356 12317843 12316816 12316816 12317843 12318613 12317586 12318356 12315789
796350 12315789 12318356 12317329 12315532 12315789 12316302 12316816 12315789 12315789 12317329 12316816 12316302 12317586 12316559 12316816 12316559 12317843
799016 12317843 12316559 12315275 12318870 12316302 12316816 12314505 12317586 12315532 12315789 12316559 12316559 12318870 12316559 12316816 12314505
801516 12314505 12318613 12316816 12315275 12318870 12315275 12314762 12315275 12315789 12314249 12316559 12316559 12314505 12315275 12316302 12314505
$$ packed form
783683A2322464k567n14K054K57n905L594p70J797k567K824k311J541k57J027
786016A2320667k311J541n14j540J540K054j797K57n14J284%k57j540k568K054
788516A2318356k054L595k311K57j027K054j541%J284k57K568m365%K311%k054
791183A2316816J797j797n14J541P70k054k57n13K054n14N14j027J540j540k57
793683A2316559j284K57L338k054J540%J541j541n13j027%J027P70j027P70k567
796350A2315789K567j027j797K57N13N14j027%J540n13n14J284j027K57k57J284
799016A2317843j284j284L595k568N14k311L081k054K57P70%K311k311K57k311
801516A2314505M108j797j541L595l595n13N13N14j540K310%k054P70J027j797
$$ plain form
804016 12314505 12317329 12313735 12316816 12316816 12314249 12314762 12315789 12317843 12316816 12314249 12317586 12315789 12315275 12314762 12317329
806516 12317329 12316559 12316559 12315275 12312708 12314505 12313478 12314762 12315275 12315532 12313735 12316559 12316559 12315789 12316302 12317586 12317586 12315789
809316 12315789 12316559 12316302 12317586 12315275 12317843 12319383 12318613 12319897 12317329 12318356 12321437 12317586 12318870 12319897
811650 12319897 12319897 12320924 12319383 12321951 12322464 12320410 12322721 12321437 12322721 12320924 12322464 12322464 12319897 12319897 12319897 12321437 12320410
814483 12320410 12319640 12318870 12317586 12319383 12317329 12318356 12318356 12317329 12317586 12318356 12317329 12316302 12314249 12316816 12316559
816983 12316559 12316559 12316302 12316302 12315275 12317329 12316559 12317586 12317586 12318870 12317586 12317843 12316559 12315789 12317329 12316559 12316302 12316302 12319383
819999 12319383 12315275 12318356 12315532 12314762 12317843 12316559 12318870 12316816 12318613 12315532 12315532 12316302 12316302 12315532 12318870 12319640
822666 12319640 12318613 12318613 12316816 12319383 12316302 12317843 12319383 12318356 12318356 12317843 12317843 12317586 12320410 12318870 12317586 12319897
$$ packed form
804016A2314505K824l594L081%k567N13J027K054j027k567L337j797n14n13K567
806516A2317329p70%j284k567J797j027J284N13K57j797K824%p70N13J284%j797
809316A2315789P70k57J284k311K568J540p70J284k568J027L081l851J284J027
811650A2319897%J027j541K568N13k054K311j284J284j797J540%k567%%J540j027
814483A2320410p70p70j284J797k054J027%j027K57P70j027j027k053K567k57
816983A2316559%k57%j027K054p70J027%J284j284K57j284p70J540p70k57%L081
819999A2319383m108L081k824p70L081j284K311k054J797l081%P70%p70L338P70
822666A2319640j027%j797K567l081J541J540j027%n13%k57K824j540j284K311
$$ plain form
825333 12319897 12318356 12319383 12318870 12319383 12320410 12320410 12319897 12318870 12318613 12317329 12319383 12320410 12321694 12319897 12316559
827833 12316559 12319897 12319383 12318613 12319897 12319897 12322464 12319640 12320924 12319897 12319897 12321437 12322464 12320924 12321437 12320667 12323491
830500 12323491 12320410 12322464 12321437 12322978 12321437 12321951 12321694 12321951 12322721 12324775 12323491 12324518 12321694 12323748
832833 12323748 12324005 12324518 12324005 12327086 12326572 12326059 12326829 12323491 12322978 12326059 12324775 12321694 12326572 12325802 12324518
835333 12324518 12324518 12325802 12324775 12326059 12327856 12325802 12327856 12326572 12325802 12328112 12323748 12326059 12327856 12326572
837666 12326572 12327856 12328112 12326059 12326572 12326059 12330166 12327599 12329910 12328883 12329653 12330937 12329139 12329910 12329910 12327856
840166 12327856 12330166 12331193 12330680 12331193 12332991 12331964 12331707 12330937 12331193 12331193 12331707 12333761 12335044 12332220 12333761 12338896
842833 12338896 12334017 12333247 12334017 12336328 12338125 12335815 12335301 12335044 12336071 12336328 12338125 12338896 12335301 12337098 12337869
$$ packed form
825333A2319897j541J027n13N13J027%n13j027k57j284K054J027J284j797l338
827833A2316559L338n14p70J284%K567k824J284j027%J540J027j540N13p70K824
830500A2323491l081K054j027J541j541N14k57K57P70K054j284J027k824K054
832833A2323748K57N13n13L081n14n13P70l338n13L081j284l081M878p70j284
835333A2324518%J284j027J284J797k054K054j284p70K310m364K311J797j284
837666A2326572J284K56k053N13n13M107k567K311j027P70J284j798P71%k054
840166A2327856K310J027n13N13J798j027k57p70K56%N14K054J283k824J541N135
842833A2338896m879p70P70K311J797k310n14k57J027K57J797P71l595J797P71
$$ plain form
845333 12337869 12337869 12338125 12335815 12339152 12338382 12340949 12338896 12342233 12342233 12340179 12342490 12341463 12342490 12340949 12341206 12342233
848000 12342233 12341463 12343003 12344030 12343260 12342490 12344030 12344544 12344544 12342490 12341206 12345314 12343517 12344030 12345571 12343260
850500 12343260 12347111 12344544 12345314 12346084 12346084 12347111 12350706 12349422 12347368 12348652 12349422 12349165 12350706 12351732 12350192
853000 12350192 12352503 12354300 12351732 12352759 12353273 12356354 12354300 12352503 12353273 12353786 12357637 12356611 12356354 12356354 12358408
855500 12358408 12359435 12359435 12359691 12359691 12359691 12360975 12359948 12362002 12363029 12363029 12363543 12365083 12364569 12364569 12366880 12365596 12367907 12366110
858516 12366110 12366623 12368677 12370731 12373042 12373299 12372015 12371245 12372015 12373299 12376379 12376379 12375353 12375353 12376893 12378177 12378433
861183 12378433 12377406 12376893 12380487 12379204 12377920 12380487 12382028 12383055 12381258 12383055 12384082 12383055 12383311 12383055
863516 12383055 12383055 12383055 12385622 12386392 12386136 12385365 12385109 12386136 12388446 12383568 12386136 12385365 12387676 12390243 12388189 12389216
$$ packed form
845333A2337869%K56k310L337p70K567k053L337%k054K311j027J027j541K57J027
848000A2342233p70J540J027p70p70J540N14%k054j284M108j797N13J541k311
850500A2343260L851k567P70P70%J027L595j284k054J284P70k57J541J026j540
853000A2350192K311J797k568J027N14L081k054j797P70N13L851j026k57%K054
855500A2358408J027%K56%%J284j027K054J027%N14J540n14%K311j284K311j797
858516A2366110N13K054K054K311K57j284p70P70J284L080%j026%J540J284K56
861183A2378433j027n13L594j283j284K567J541J027j797J797J027j027K56k56
863516A2383055%%K567P70k56p71k56J027K310m878K568p71K311K567k054J027
$$ plain form
866183 12389216 12388189 12388446 12389730 12389216 12389216 12391270 12391784 12392297 12393838 12392811 12393838 12395892 12394351 12396405 12399743
868683 12399743 12400000 12399743 12400000 12398716 12401540 12403851 12404878 12403594 12404107 12404621 12405134 12406931 12408215 12405905 12407958
871183 12407958 12407958 12407958 12410783 12408985 12409756 12410012 12408985 12411039 12411039 12410012 12411296 12410783 12412836 12410269 12414377 12414377 12414890
874016 12414890 12417971 12416944 12414890 12414890 12414120 12413350 12415917 12416431 12419255 12420025 12419512 12421309 12420025 12421052 12421566 12423363
876650 12423363 12423106 12423106 12425417 12422336 12426444 12425160 12426444 12427471 12424133 12427471 12429525 12430295 12432349 12428498 12431322
879149 12431322 12432605 12429525 12431835 12434403 12432862 12433889 12436970 12433889 12439537 12442618 12437740 12440051 12438510
881350 12438510 12440051 12441591 12441848 12441591 12443902 12443902 12444672 12443645 12447240 12446983 12449807 12448267 12445699 12446213 12446983 12448010
884016 12448010 12447240 12449293 12449807 12451347 12450834 12453145 12452118 12452888 12453401 12453915 12452888 12454428 12453915 12454428 12458536
$$ packed form
866183A2389216j027K57J284n14%K054N14N13J541j027J027K054j541K054L338
868683A2399743K57k57K57j284K824K311J027j284N13N14N13J797J284k310K053
871183A2407958%%K825j798P71K56j027K054%j027J284n13K053k567M108%N13
874016A2414890L081j027k054%p70p70K567N14K824P70n13J797j284J027N14J797
876650A2423363k57%K311l081M108j284J284J027l338L338K054P70K054l851K824
879149A2431322J283l080K310K568j541J027L081l081N648L081m878K311j541
881350A2438510J541J540K57k57K311%P70j027L595k57K824j540k568N14P70J027
884016A2448010p70K053N14J540n13K311j027P70N13N14j027J540n13N13M108
$$ plain form
886516 12458536 12457252 12459306 12460590 12461360 12461103 12459306 12459306 12463157 12462130 12462387 12465211 12464698 12463157 12466238 12465468
889016 12465468 12464698 12468549 12465211 12467265 12465725 12467522 12467522 12471373 12468549 12467779 12471887 12471887 12470860 12470603 12474967 12472913
891649 12472913 12472657 12474454 12474967 12476765 12475994 12472913 12475994 12474967 12475994 12474711 12475481 12479075 12478562 12478562 12479845
894149 12479845 12478818 12479075 12478818 12479075 12480616 12482670 12481129 12481643 12480102 12480872 12480872 12481643 12480616 12482926 12482926 12484210
896816 12484210 12483183 12485237 12483953 12482926 12484210 12482156 12485237 12485750 12486777 12484724 12486264 12483697 12486777 12488061
899150 12488061 12487034 12485237 12486777 12487804 12488061 12489088 12488061 12488318 12490372 12490115 12491399 12488831 12493453 12490885
901516 12490885 12490115 12491912 12491142 12487804 12491912 12490885 12490372 12490115 12494223 12493966 12490885 12491912 12492426 12491912 12492426
904016 12492426 12490885 12492426 12491142 12492939 12490885 12494993 12494223 12494223 12492939 12491142 12492426 12493196 12491912 12493196 12491912
$$ packed form
886516A2458536j284K054J284P70k57j797%L851j027K57K824n13j541L081p70
889016A2465468p70L851l338K054j540J797%L851k824p70M108%j027k57M364k054
891649A2472913k56J797N13J798p71l081L081j027J027j283P70L594n13%J283
894149A2479845j027K57k57K57J541K054j541N14j541P70%P71j027K310%J284
896816A2484210j027K054j284j027J284k054L081N13J027k053J540k567L080J284
899150A2488061j027j797J540J027K57J027j027K57K054k57J284k568M622k568
901516A2490885p70J797p70l338M108j027n13k57M108k57l081J027N14n14N14
904016A2492426j541J541j284J797k054M108p70%j284j797J284P70j284J284j284
$$ plain form
906516 12491912 12491142 12491142 12491142 12493453 12491399 12492426 12490885 12493196 12491399 12490885 12489858 12490885 12494480 12490885 12489858
909016 12489858 12491399 12490885 12489345 12488831 12491399 12490885 12494223 12491142 12493196 12491912 12490885 12492169 12488061 12490885
911349 12490885 12490372 12486264 12492939 12489088 12488318 12489088 12485237 12487804 12485237 12486007 12487291 12485237 12488061 12487804 12485237
913850 12485237 12486007 12485237 12483183 12488061 12486264 12487804 12484980 12482670 12484980 12484724 12483697 12485237 12483183 12482670
916183 12482670 12483697 12485750 12484210 12482926 12482156 12480102 12483183 12480102 12481643 12476765 12476765 12474967 12477792 12477021 12476765
918683 12476765 12474967 12475481 12476765 12474967 12472657 12472913 12472913 12472657 12471630 12469319 12468292 12468806 12468549 12470860 12468292
921183 12468292 12468806 12469319 12467779 12466238 12466752 12467265 12463671 12465725 12466495 12463157 12463414 12463157 12461360 12463157 12461360
923683 12461360 12460077 12461360 12460333 12459563 12460590 12458536 12458023 12460077 12456996 12455969 12454428 12455969 12454172 12452888
$$ packed form
906516A2491912p70%%K311k054J027j541K311j797n14j027J027L595l595j027
909016A2489858J541n14j540n14K568n14L338l081K054j284j027J284m108K824
911349A2490885n13m108O675l851p70P70l851K567k567P70J284k054K824k57k567
913850A2485237P70p70k054M878j797J540k824k310K310k56j027J540k054n13
916183A2482670J027K053j540j284p70k054L081l081J541m878%j798K825p71k56
918683A2476765j798N14J284j798k310K56%k56j027k311j027N14k57K311k568
921183A2468292N14N13j540j541N14N13l594K054P70l338K57k57j797J797j797
923683A2461360j283J283j027p70J027k054n13K054l081j027j541J541j797j284
$$ plain form
926016 12452888 12454942 12453401 12453145 12450320 12451091 12452374 12451861 12450064 12448010 12450064 12450834 12448267 12445186 12445956 12446983
928516 12446983 12444159 12444672 12445186 12441591 12442875 12443132 12441591 12441848 12442618 12441848 12440051 12440821 12438510 12439537 12438767
931016 12438767 12437483 12437740 12436713 12436713 12436713 12434403 12433632 12433376 12432349 12431578 12430808 12429781 12431578 12430551 12431322 12432349
933683 12432349 12430295 12429781 12427214 12428241 12429781 12427471 12427214 12426700 12426700 12428754 12423620 12426700 12426187 12423620 12425673
936183 12425673 12425417 12423620 12422336 12423106 12420539 12420025 12419255 12420025 12420025 12420539 12420025 12418485 12417201 12417458 12414890 12415917
938850 12415917 12415917 12415147 12416174 12416174 12416431 12418228 12413863 12414890 12414890 12411810 12413350 12410269 12411810 12411039 12409242 12410783
941516 12410783 12408985 12410012 12410012 12410269 12410783 12410783 12411039 12410012 12408729 12406931 12407958 12407958 12406675 12407702 12405648 12406161 12407702
944316 12407702 12408985 12406675 12408729 12408985 12407958 12406675 12409756 12411039 12407702 12406931 12406675 12406161 12407958 12407702 12405134
$$ packed form
926016A2452888K054j541k56k825P71J283n13j797k054K054P70k567l081P70J027
928516A2446983k824N13N14l595J284K57j541K57P70p70j797P70k311J027p70
931016A2438767j284K57j027%%k310p71k56j027p71p70j027J797j027P71J027
933683A2432349k054n14k567J027J540k310k57n14%K054n134L080n13k567K053
936183A2425673k56j797j284P70k567n14p70P70%N14n14j540j284K57k568J027
938850A2415917%p70J027%K57J797m365J027%l080J540l081J541p71j797J541
941516A2410783j798J027%K57N14%K56j027j283j798J027%j283J027k054N13J541
944316A2407702J283k310K054K56j027j283L081J283l337p71k56n14J797k56k568
$$ plain form
946816 12405134 12406931 12405905 12405134 12402824 12404107 12403594 12406931 12402567 12401026 12401540 12401026 12400513 12402053 12400513 12401797
949316 12401797 12400770 12401797 12401026 12400513 12399743 12400513 12401540 12400513 12401540 12400770 12401026 12401026 12401540 12398459 12399743 12400513
951983 12400513 12400770 12398973 12398716 12399486 12397689 12397432 12401026 12400000 12398973 12399743 12400513 12399743 12401026 12401026 12400000 12397689
954649 12397689 12400000 12400770 12400000 12399743 12399486 12398716 12400770 12398973 12400770 12400770 12400513 12398716 12401026 12401797 12398973 12398459
957316 12398459 12401797 12398973 12399486 12401540 12398716 12399743 12401797 12401540 12401540 12402053 12399486 12398973 12397946 12401797 12401026
959816 12401026 12400513 12400770 12404621 12401540 12399743 12400000 12404621 12398973 12402824 12399743 12401540 12401026 12398973 12401540
962150 12401540 12401026 12399743 12401026 12398459 12399743 12400513 12398716 12401540 12401540 12400513 12400000 12400513 12401540 12397432 12399743
964650 12399743 12398973 12401797 12398973 12400770 12401026 12398459 12399486 12397689 12399743 12400513 12399743 12397432 12398716 12398973 12398459
$$ packed form
946816A2405134J797j026p71k310J283n13L337m364j541N14n14n13J540j540J284
949316A2401797j027J027p71n13p70P70J027j027J027p70K56%N14l081J284P70
951983A2400513K57j797k57P70j797k57L594j026j027P70P70p70J283%j026k311
954649A2397689K311P70p70k57k57p70K054j797J797%k57j797K310P71k824n14
957316A2398459L338k824N13K054k824J027K054k57%N13k567n13j027L851p71
959816A2401026n13K57L851l081j797K57M621n648L851l081J797n14k053K567
962150A2401540n14j283J283k567J284P70j797K824%j027n13N13J027m108K311
964650A2399743p70K824k824J797K56k567J027j797K054P70p70k311J284K57n14
$$ plain form
967149 12398459 12401026 12400770 12399486 12398459 12397432 12398716 12399486 12398973 12397432 12400000 12400770 12399486 12397432 12399486
969483 12399486 12395892 12398459 12397946 12395635 12395378 12394865 12394351 12395378 12394865 12394351 12394351 12396662 12396405 12392554 12394608 12395635
972150 12395635 12392297 12396919 12393324 12393324 12392297 12393838 12394351 12390757 12391784 12389730 12387676 12390500 12390500 12389473 12388446
974650 12388446 12387676 12385622 12384338 12386649 12382284 12383568 12382284 12383568 12383311 12381258 12380231 12379974 12379460 12378433
976983 12378433 12378433 12378947 12378947 12381258 12379204 12380231 12378177 12378433 12379974 12375353 12376893 12378177 12377150 12375866 12375096 12375866
979649 12375866 12374839 12375353 12373812 12373812 12372785 12373812 12373812 12371758 12375353 12372015 12374326 12373812 12371758 12369704 12371758
982150 12371758 12370218 12370988 12369961 12368164 12366110 12365853 12366110 12366623 12363799 12364569 12361745 12365853 12364056 12360975 12361745
984650 12361745 12362516 12362772 12362772 12362516 12360975 12360462 12359948 12357894 12359691 12357637 12358664 12356354 12354813 12359435 12354813
$$ packed form
967149A2398459K567k56j284j027j027J284P70n13j541K568P70j284k054K054
969483A2399486l594K567n13k311k57n13n14J027n13n14%K311k57l851K054J027
972150A2395635l338M622l595%j027J541N13l594J027k054k054K824%j027j027
974650A2388446p70k054j284K311m365J284j284J284k57k053j027k57n14j027
976983A2378433%N14%K311k054J027k054K56J541m621J540J284j027j284p70P70
979649A2375866j027N14j541%j027J027%k054L595l338K311n14k054k054K054
982150A2371758j540P70j027j797k054k57K57N13k824P70k824M108j797l081P70
984650A2361745P71K56%k56j541n13n14k054J797k054J027k310j541M622m622
$$ plain form
987150 12354813 12355327 12356611 12357381 12355327 12356354 12352503 12353273 12354557 12352759 12353786 12350706 12351476 12353273 12350192
989483 12350192 12346598 12348395 12349679 12347368 12350192 12349679 12348395 12349679 12346341 12346598 12346341 12346084 12347111 12346598 12346084
991983 12346084 12344544 12345314 12344544 12344544 12344544 12342233 12341976 12343003 12343260 12342490 12341463 12342233 12341976 12340179 12341206 12337869 12341463
994816 12341463 12340179 12340179 12338125 12339922 12339409 12337098 12338382 12336328 12337098 12337098 12335815 12339152 12339409 12337869 12337355 12335044
997499 12335044 12335301 12337869 12337355 12331193 12336842 12337098 12335815 12333247 12336842 12335301 12334788 12332734 12335044 12333761
999816 12333761 12333761 12335301
$$ packed form
987150A2354813N14J284P70k054J027l851P70J284j798J027l080P70J797l081
989483A2350192l594J797J284k311K824n13j284J284l338K57k57k57J027n13n14
991983A2346084j540P70p70%%k311k57J027K57p70j027P70k57j797J027l337L594
994816A2341463j284%k054J797n13k311J284k054P70%j283L337K57j540n14k311
997499A2335044K57K568n14o162N649K56j283k568L595j541n13k054K310j283
999816A2333761%J540
##END=
