##TITLE= Headspace from ginger
##JCAMP-DX= 5.00 $$From Command Line Converter 1.0
##DATA TYPE= GAS CHROMATOGRAPH
##ORIGIN= Dept of Chem, UWI, Mona, JAMAICA
##OWNER= Dr Robert J. Lancashire
##$URL= http://wwwchem.uwimona.edu.jm:1104/software/jcampdx.html
##SPECTROMETER/DATA SYSTEM= HP 5890 GC
##DATE= 11-26-1995
##TIME= 08:53:03
##XUNITS= TIME
##YUNITS= ARBITRARY
##XFACTOR= 2.000700e-005
##YFACTOR= 1.398110e-001
##FIRSTX=   0.000000
##LASTX=  20.01
##NPOINTS= 6004
##MAXY= 188380.000000
##MINY= 48569.000000
##FIRSTY= 50297.000000
##DELTAX=   0.003333
##XYDATA= (X++(Y..Y))
$$ plain form
0 359749 359892 359907 359985 359985 360043 360136 360157 360179 360164 360136 360193 360136 360157 360093 360050 360078 360078 359907 359878 359807 359792 359735 359671 359585 359442 359435 359349
4481 359349 359263 359106 359049 358905 358870 358791 358662 358476 358491 358326 358205 358119 357976 357833 357732 357561 357496 357346 357289 357103 357031
7997 357031 357010 356760 356674 356602 356445 356416 356266 356152 356037 355916 355844 355723 355637 355551 355429 355315 355272 355186 354986 354914 354807 354700
11645 354700 354585 354571 354485 354435 354256 354206 354149 354128 354013 353884 353841 353713 353698 353541 353441 353484 353427 353341 353312 353141 353205 353112 353026
15494 353026 353083 352997 352862 352897 352833 352812 352719 352626 352640 352604 352568 352575 352554 352404 352454 352432 352411 352397 352311 352339 352354 352311 352261 352261 352232 352239 352139
19993 352139 352232 352211 352111 352146 352204 352239 352146 352096 352003 352082 352010 352010 352053 352060 351996 352003 351968 352010 351982 351982 351946 351925 351982 352003 352025 351953 352010 351925 351946
24807 351946 351939 351968 351896 351946 351939 351917 351860 351996 351853 351925 351925 351896 351889 351889 351860 351832 351925 351896 351832 351867 351882 351810 351896 351824 351810 351860 351853 351810 351832
29639 351832 351860 351860 351803 351774 351839 351782 351803 351782 351839 351803 351853 351803 351796 351882 351824 351796 351853 351774 351810 351724 351839 351796 351803 351746 351767 351767 351796 351774 351782
$$ packed form
0C59749J43J5P8%N8R3K1K2j5k8N7n7K1o4m3K8%j71k9p1j5n7o4q6j43pq6
4481C59349q6j57n7j44l5p9j29j86J5j65j21q6j43j43j01j71o5j50n7j86p2
7997C57031k1k50q6p2j57k9j50j14j15j21p2j21q6q6j22j14m3q6k00p2j07j07
11645C54700j15j4q6n0j79n0n7k1j15j29m3j28j5j57j00M3n7q6k9j71O4r3q6
15494C53026N7q6j35L5o4k1r3r3J4l6l6Pk1j50N0k2k1j4q6K8J5m3n0%k9Pj00
19993C52139R3k1j00L5N8L5r3n0r3P9p2%M3Po4Pl5M2k8%l6k1N7K1K2p2N7q5K1
24807C51946pK9p2N0pk2n7J36j43P2%k9p%k9k8R3k9o4L5J5p2Q6p2j4N0pm3K2
29639C51832K8%n7k9O5n7K1k1N7l6N0n0pQ6n8k8N7p9L6q6J15m3Pn7K1%K9k2Q
$$ plain form
34471 351782 351767 351767 351803 351724 351782 351739 351767 351746 351667 351753 351782 351660 351739 351753 351631 351660 351739 351710 351717 351681 351774 351710 351681 351696 351681 351631 351667
39003 351667 351667 351667 351710 351746 351681 351696 351717 351724 351696 351631 351581 351660 351653 351739 351653 351638 351696 351624 351667 351638 351596 351596 351631 351631 351660 351581 351653 351631 351624 351653 351538
44134 351538 351638 351610 351653 351603 351638 351631 351653 351667 351689 351660 351689 351660 351660 351596 351681 351689 351689 351603 351624 351689 351681 351631 351631 351631 351689 351603 351660 351681 351610 351631
49132 351631 351660 351631 351660 351638 351638 351631 351689 351596 351631 351553 351603 351631 351610 351696 351638 351574 351610 351574 351574 351610 351574 351553 351538 351574 351631 351603 351517 351553 351624
53997 351624 351610 351553 351517 351603 351596 351553 351581 351638 351603 351546 351653 351553 351596 351567 351610 351631 351610 351631 351610 351624 351739 351746 351710 351739 351739 351746 351810 351867
58662 351867 351839 351925 351889 351889 351975 352039 352096 352025 352082 352082 352146 352196 352204 352268 352204 352297 352347 352397 352311 352375 352432 352454 352382 352482 352525 352525 352440 352454 352547
63494 352547 352518 352511 352482 352454 352397 352432 352490 352411 352397 352375 352454 352397 352347 352382 352432 352382 352382 352397 352382 352411 352368 352347 352375 352397 352318 352382 352354 352347 352404
68326 352404 352268 352289 352347 352397 352468 352511 352626 352661 352840 352976 353183 353326 353548 353770 354056 354271 354521 354757 355000 355351
$$ packed form
34471C51782j5%L6p9N8m3K8k1p9Q6K9j22P9J4j22K9P9k9Pl6R3o4k9J5j5n0L6
39003C51667%%M3L6o5J5K1Pk8o5n0P9pQ6q6j5N8p2M3k9m2%L5%K9p9P2k2pK9j15
44134C51538J00k8M3n0L5pK2J4K2k9K9k9%o4Q5Q%q6K1O5qn0%%N8q6N7K1p1K1
49132C51631K9k9K9k2%pN8r3L5p8N0K8k1Q6n8o4L6l6%L6l6k1j5L6N7k8q6L6P1
53997C51624j4n7l6Q6pm3K8N7l5n7J07j00M3k9M3K1k1K1k1J4J15Pl6K9%PO4N7
58662C51867k8Q6l6%Q6O4N7p1N7%O4N0QO4o4R3N0N0q6O4N7K2p2J00M3%q5J4R3
63494C52547k9pk9k8n7L5N8p9j4k2P9n7n0L5N0n0%J5j5K9m3k1K8K2p9O4k8pN7
68326C52404j36K1N8N0P1M3J15L5J79J36K07J43K22K22K86K15K50K36K43L51
$$ plain form
71624 355351 355494 355701 355973 356295 356524 356760 356946 357124 357361 357504 357618 357804 357983 357990 358176 358262 358405 358469 358491 358634
74973 358634 358612 358677 358705 358727 358705 358705 358641 358669 358619 358548 358612 358591 358498 358548 358469 358412 358390 358319 358362 358348 358269 358190 358183 358097 358004 358047 357933 357904
79622 357904 357847 357868 357904 357847 357811 357775 357783 357732 357747 357754 357725 357732 357718 357775 357761 357775 357775 357783 357783 357754 357639 357690 357632 357611 357618 357611 357489 357446 357439 357296
84620 357296 357275 357203 357117 357160 357046 356981 356974 356867 356896 356803 356760 356753 356724 356731 356760 356702 356788 356781 356860 356874 356953 357074 357153 357203 357260 357346 357418 357525
89285 357525 357618 357639 357747 357783 357918 357918 357990 358097 358090 358076 358104 358176 358190 358119 358147 358147 358154 358147 358133 358047 357976 357954 357947 357833 357747 357718 357647 357575
93983 357575 357561 357418 357353 357289 357153 357067 357010 356860 356788 356660 356617 356502 356495 356352 356266 356130 356073 355930 355901 355801 355644 355665 355522
97799 355522 355458 355322 355208 355129 355086 354957 354943 354893 354814 354693 354693 354550 354521 354500 354407 354371 354299 354199 354170 354170 354085 354006 353999 353927 353870 353920
102114 353920 353813 353841 353770 353656 353684 353634 353670 353627 353584 353548 353613 353512 353462 353555 353441 353412 353434 353319 353405 353319 353348 353369 353298 353298 353241
$$ packed form
71624C55351J43K07K72L22K29K36J86J78K37J43J14J86J79PJ86Q6J43O4K2J43
74973C58634k2O5K8K2k2%o4K8n0p1O4k1r3N0p9n7k2p1M3j4p9p9pq6r3M3j14k9
79622C57904n7K1L6n7l6l6Qn1J5Pk9Pj4N7j4J4%Q%k9j15N1n8k1Ppj22m3pj43
84620C57296k1p2q6M3j14o5pj07K9r3m3pk9PK9n8Q6pP9J4P9J21P9N0N7Q6P2J07
89285C57525R3K1J08L6J35%P2J07pj4K8P2J4p1K8%Ppj4q6p1k2pj14q6k9p1p2
93983C57575j4j43o5o4j36q6n7j50p2j28m3j15pj43q6j36n7j43k9j00j57K1j43
97799C55522o4j36j14p9m3j29j4n0p9j21%j43k9k1r3l6p2j00k9%q5p9pp2n7N0
102114C53920j07K8p1j14K8n0L6m3m3l6O5j01n0R3j14k9K2j15Q6q6K9K1p1%n7
$$ plain form
106312 353241 353176 353262 353098 353098 353083 353098 353040 352983 353069 353005 352983 352997 353040 352926 352940 352912 352940 352926 352919 352912 352926 352869 352969 352926 352869 352969 352940
110811 352940 352969 353083 353148 353176 353234 353262 353269 353377 353312 353412 353441 353441 353412 353484 353520 353541 353462 353348 353226 352940 352540 352146 351889 351524
114776 351524 351402 351281 351259 351238 351181 351152 351152 351181 351088 351174 351138 351088 351095 351138 351088 350995 351045 351031 351023 350945 350930 350988 350902 350902 350909 350909 350880 350880 350873 350859
119774 350859 350845 350852 350859 350873 350823 350880 350859 350859 350823 350795 350816 350795 350730 350773 350709 350702 350702 350716 350709 350651 350644 350587 350623 350516 350573 350501 350544 350451 350444 350480 350415
124956 350415 350473 350358 350458 350201 350344 350301 350301 350215 350315 350201 350280 350129 350136 350165 350079 350079 350058 350108 350058 350043 349943 350058 349986 349915
128971 349915 349972 349929 349936 349900 349850 349929 349843 349815 349843 349872 349793 349815 349800 349815 349743 349786 349743 349714 349757 349672 349629 349686 349614 349643 349593 349672 349593 349571
133636 349571 349557 349586 349564 349571 349600 349593 349643 349614 349614 349593 349571 349621 349629 349564 349621 349629 349571 349614 349621 349657 349586 349600 349650 349657 349643 349614 349614 349714 349629 349629 349643
138801 349643 349629 349629 349679 349679 349679 349679 349672 349672 349743 349621 349643 349672 349650 349657 349679 349672 349629 349600 349736 349707 349686 349714 349657 349643 349672 349650 349586 349629 349593 349729
$$ packed form
106312C53241o5Q6j64%j5J5n8n7Q6o4k2J4M3j14J4k8K8j4ppJ4n7J00m3n7J00k9
110811C52940K9J14O5K8N8K8PJ08o5J00K9%k9P2L6K1p9j14j22k86m00l94k57l65
114776C51524j22j21k2k1n7k9%K9r3Q6l6n0PM3n0r3N0j4qp8j5N8q6%P%k9%pj4
119774C50859j4PPJ4n0N7k1%l6k8K1k1o5M3o4p%J4pn8pn7L6j07N7p2M3r3pL6o5
124956C50415N8j15J00k57J43m3%q6J00j14P9j51PK9q6%k1N0n0j5j00J15p2p1
128971C49915N7m3Pl6n0P9q6k8K8K9p9K2j5J5p2M3m3k9M3q5m3N7p2K9n0P9p9k2
133636C49571j4K9k2PK9pN0k9%k1k2N0Qo5N7Qn8M3PL6p1J4N0Pj4k9%J00q5%J4
138801C49643j4%N0%%%p%P1j22K2K9k2PK2pm3k9J36k9k1K8n7j4K9k2o4M3l6J36
$$ plain form
143799 349729 349650 349614 349650 349679 349700 349736 349743 349765 349822 349793 349886 349850 349993 349993 350072 350079 350172 350229 350330 350394 350594 350558 350659 350766 350787 350887
148114 350887 351002 351045 351138 351231 351324 351295 351374 351259 351453 351438 351460 351467 351524 351546 351538 351603 351610 351553 351538 351553 351546 351524 351460 351460 351460 351345 351402 351374
152779 351374 351324 351324 351202 351166 351195 351109 351109 351059 351031 351066 351002 350938 350916 350916 350816 350916 350787 350773 350787 350730 350730 350659 350644 350680 350644 350566 350566 350487
157444 350487 350530 350508 350451 350458 350487 350473 350387 350365 350444 350337 350430 350315 350280 350258 350194 350251 350222 350194 350165 350136 350108 350108 350072 350129 350051 350015 350079
161926 350079 349993 349958 349936 349972 349900 349900 349886 349822 349800 349800 349822 349757 349765 349743 349736 349672 349707 349679 349650 349621 349629 349614 349621 349571 349621 349586 349557 349486 349457 349514
166924 349514 349529 349507 349536 349514 349500 349500 349450 349471 349486 349507 349543 349471 349514 349486 349529 349529 349514 349593 349536 349629 349672 349700 349743 349858 349958 350001 350201
171456 350201 350272 350458 350702 350830 351095 351381 351603 351860 352139 352368 352575 352862 353119 353291 353520 353698 353913 354156 354292
174588 354292 354464 354542 354671 354693 354800 354886 354957 354986 354922 354972 355000 355065 354922 354950 354893 354836 354800 354814 354635 354585 354435 354414 354385 354263
$$ packed form
143799C49729p9l6L6K9K1L6PK2N7k9R3l6J43%P9PR3N7J01O4K00l6J01J07K1J00
148114C50887J15M3R3R3R3k9P9j15J94j5K2PN7K2qO5Pn7j5J5pk2o4%%j15N7k8
152779C51374n0%j22l6K9q6%n0k8L5o4o4k2%j00J00j29j4J4n7%p1j5L6l6p8%p9
157444C50487M3k2n7PK9j4q6k2P9j07R3j15l5k2o4N7k9k8k9k9k8%l6N7p8l6O4
161926C50079q6l5k2L6p2%j4o4k2%K2o5Qk2po4L5k8k9k9Qj5Pn0N0l5k9p1k9N7
166924C49514J5k2K9k2j4%n0K1J5K1L6p2M3k8M3%j5P9n7R3M3K8M3J15J00M3K00
171456C50201P1J86K44J28K65K86K22K57K79K29K07K87K57J72K29J78K15K43J36
174588C54292J72P8J29K2J07Q6P1K9o4N0K8O5j43K8n7n7l6J4j79n0j50k1k9j22
$$ plain form
178620 354263 354256 354128 354142 354113 354063 354085 353985 354042 354063 354092 354199 354185 354113 354128 354185 354263 354285 354314 354428 354442 354464 354485 354492 354557 354600 354578
182935 354578 354614 354614 354614 354528 354528 354514 354471 354442 354399 354349 354242 354213 354120 354063 354006 353884 353813 353727 353663 353548 353441 353291 353241 353141 353062 352983
187251 352983 352869 352690 352633 352547 352518 352382 352289 352261 352089 352060 351968 351882 351796 351660 351638 351596 351524 351438 351345 351288 351166 351145 351109 351023
191283 351023 350988 350930 350902 350852 350845 350766 350744 350730 350594 350601 350587 350516 350501 350473 350423 350373 350358 350337 350315 350330 350315 350280 350222 350172 350201 350165 350144 350115
195948 350115 350158 350086 350043 350144 350079 350101 350072 350101 350072 349986 350001 350029 350079 349972 350001 349993 349943 349993 349993 350043 349972 349972 350051 349915 350001 350043 350072
200429 350072 350158 350315 350315 350480 350702 350916 351252 351546 351968 352347 352862 353434 354042 354628 355401 356152 356989 357818 358669
203612 358669 359478 360422 361273 362138 362968 363855 364685 365457 366201 366909 367560 368197 368747 369341 369799 370149 370507 370800
206577 370800 371115 371208 371408 371515 371494 371522 371422 371401 371151 371036 370915 370650 370292 369999 369663 369362 369048 368661 368275 367825
$$ packed form
178620C54263pj28J4k9n0K2j00N7K1K9J07j4p2J5N7P8K2K9J14J4K2K1PO5M3k2
182935C54578L6%%q6%j4m3k9m3n0j07k9r3n7n7j22p1q6o4j15j07j50n0j00p9p9
187251C52983j14j79n7q6k9j36r3k8j72k9r2q6q6j36k2m2p2q6r3n7j22k1l6q6
191283C51023l5n8k8n0pp9k2j4j36Pj4p1j5k8n0n0j5k1k2J5j5l5n8n0K9l6k1k9
195948C50115M3p2m3J01o5K2k9K9k9q6J5K8N0j07K9qn0N0%N0p1%P9j36Q6M2K9
200429C50072Q6J57%J65K22K14L36K94M22L79N15N72O08N86P73P51Q37Q29Q51
203612C58669Q09R44Q51Q65Q30Q87Q30P72P44P08O51O37N50N94M58L50L58K93
206577C70800L15R3K00J07k1K8j00k1k50j15j21k65l58k93l36l01l14l87l86m50
$$ plain form
209926 367825 367424 366959 366544 366108 365622 365185 364849 364441 364127 363791 363619 363454 363505 363612 363884 364513 365300 366487
212925 366487 367968 369877 372238 375084 378525 382423 387008 392215 397908 404260 411190 418743 426718 434851
215257 434851 443484 452560 461351 470499 480298 489768 498236 507656 516246 523814 532490 540164 547081 553332
217590 553332 558754 564540 569347 573710 577508 580648 583094 585125 586527 587321 588036 587786 586920 585991 584353
220089 584353 582514 579882 576649 573309 570069 566815 563260 559254 555063 549863 545371 540944 536109 531338
222422 531338 526739 521611 515674 510632 505325 500933 495926 490691 485963 481128 476436 471901 467767 463633
224738 463633 459320 455085 451051 447260 443040 439364 435802 432469 429100 425717 422434 419194 416154 413293
227070 413293 410547 407886 405297 402965 400569 398223 396149 394146 392372 390462 388824 387508 386285 385370
$$ packed form
209926C67825m01m65m15m36m86m37l36m08l14l36j72j65N1J07K72O29P87J187
212925C66487J481J909K361K846L441L898M585N207N693O352O930P553P975Q133
215257D34851Q633R076Q791R148R799R470Q468R420Q590P568Q676P674O917O251
217590E53332N422N786M807M363L798L140K446K031J402P94P15k50q66r29j638
220089E84353j839k632l233l340l240l254l555m006m191n200m492m427m835m771
222422E31338m599n128n937n042n307m392n007n235m728m835m692m535m134m134
224738D63633m313m235m034l791m220l676l562l333l369l383l283l240l040k861
227070D13293k746k661k589k332k396k346k074k003j774j910j638j316j223r15
$$ plain form
229403 385370 384805 384590 385019 385835 387566 390098 393788 398666 404810 412556 422119 433613 447268 462588
231735 462588 480863 500354 522591 547174 573281 601433 631509 663424 696590 730521 765247
233601 765247 801224 837387 874459 910729 946484 980881 1015900 1049588 1082382 1112759 1141905
235417 1141905 1171095 1196994 1218902 1240839 1260730 1279162 1296714 1311062 1323787 1332227 1338743
237233 1338743 1343270 1346989 1347390 1345816 1341375 1335502 1326133 1314188 1302029 1289219 1274127 1256832 1239931
239399 1239931 1221749 1202544 1182396 1161661 1140718 1119933 1097810 1075401 1053436 1030684 1007724
241265 1007724 985852 964509 943924 923446 903519 882512 862907 843882 825249 806431 788285
243081 788285 770547 753645 737395 721638 706324 691497 676992 663259 650306 637038 624936
$$ packed form
229403C85370n65k15M29Q16J731K532L690M878O144P746R563J1494J3655J5320
231735D62588J8275J9491K2237K4583K6107K8152L0076L1915L3166L3931L4726
233601G65247L5977L6163L7072L6270L5755L4397L5019L3688L2794L0377K9146
235417A141905K9190K5899K1908K1937J9891J8432J7552J4348J2725Q440O516
237233A338743M527L719M01j574m441n873r369j1945j2159j2810j5092j7295j6901
239399A239931j8182j9205k0148k0735k0943k0785k2123k2409k1965k2752k2960
241265A007724k1872k1343k0585k0478j9927k1007j9605j9025j8633j8818j8146
243081G88285j7738j6902j6250j5757j5314j4827j4505j3733j2953j3268j2102
$$ plain form
244914 624936 612655 601233 590239 579346 569404 560485 550600 541588 533062 525394 517334 509509 502728
247063 502728 496348 489260 482951 476979 471558 466472 461122 455944 451237 446753 442354 438112 434336 430838
249396 430838 427148 423686 420310 417220 414352 411534 408930 406398 404024 401821 399567 397608 395734 393888
251728 393888 392043 390284 388724 387222 385892 384504 383167 381929 380785 379769 378782 377810 376830 375957 375063
254227 375063 374176 373539 372774 372066 371401 370829 370121 369563 368962 368433 367882 367367 366888 366416 366029 365564 365193 364728
257226 364728 364298 363927 363598 363218 362939 362560 362267 361988 361638 361359 361008 360694 360350 360100 359807 359435 359120 358834
260242 358834 358619 358355 358154 357904 357675 357525 357346 357210 356981 356874 356695 356638 356466 356323 356173 356145 356037 355973 355873
263424 355873 355866 355808 355715 355744 355701 355744 355837 355830 355873 355916 356002 356152 356273 356302 356445 356502 356645 356838 356931 357060 357246 357346 357461 357561
$$ packed form
244914F24936j2281j1422j0994j0893r942q919r885r012q526p668q060p825o781
247063E02728o380p088o309n972n421n086n350n178m707m484m399m242l776l498
249396D30838l690l462l376l090k868k818k604k532k374k203k254j959j874j846
251728C93888j845j759j560j502j330j388j337j238j144j016r87r72r80q73q94
254227C75063q87o37p65p08o65n72p08n58o01n29n51n15m79m72l87m65l71m65
257226C64728m30l71l29l80k79l79k93k79l50k79l51l14l44k50k93l72l15k86
260242C58834k15k64k01k50k29j50j79j36k29j07j79n7j72j43j50k8j08o4j00
263424C55873pn8r3K9m3M3R3pM3M3Q6J50J21K9J43N7J43J93R3J29J86J00J15J00
$$ plain form
267406 357561 357697 357833 357926 358090 358219 358362 358534 358648 358805 359091 359349 359642 359964 360150 360593 360865 361266 361752 362131
270571 362131 362639 363154 363698 364306 364771 365307 365915 366473 367117 367632 368175 368683 369219 369634 370078 370421 370922 371265
273587 371265 371608 371766 371966 372173 372309 372309 372352 372467 372295 372152 372037 371916 371708 371465 371172 370829 370543 370221 369713
276719 369713 369255 368683 368139 367574 366966 366366 365736 365078 364449 363841 363276 362768 362210 361752 361273 360851 360472 359964
279718 359964 359563 359149 358820 358383 358069 357732 357418 357132 356781 356402 356102 355873 355587 355293 355043 354814 354585 354378
282734 354378 354113 353834 353605 353441 353205 353098 352940 352797 352518 352454 352339 352196 352125 352039 351975 351860 351860 351832 351767 351882 351882 351975
286416 351975 351982 352111 352297 352461 352597 352883 353148 353491 353834 354271 354771 355358 355951 356788 357504 358390 359499 360665
289382 360665 361967 363333 364971 366687 368547 370421 372488 374713 377059 379483 382087 384833 387437 390083
$$ packed form
267406C57561J36J36R3J64J29J43J72J14J57K86K58K93L22J86M43K72M01M86L79
270571C62131N08N15N44O08M65N36O08N58O44N15N43N08N36M15M44L43N01L43
273587C71265L43J58K00K07J36%M3J15j72j43j15j21k08k43k93l43k86l22n08
276719C69713m58n72n44n65o08o00o30o58o29o08n65n08n58m58m79m22l79n08
279718C59964m01m14l29m37l14l37l14k86l51l79l00k29k86k94k50k29k29k07
282734C54378k65k79k29j64k36j07j58j43k79o4j15j43p1q6o4j15%k8o5J15%R3
286416C51975PJ29J86J64J36K86K65L43L43M37N00N87N93Q37P16Q86J109J166
289382C60665J302J366J638J716J860J874K067K225K346K424K604K746K604K646
$$ plain form
291714 390083 392773 395555 398416 401084 403780 406262 408608 410904 413036 414981 416741 418450 420017 421418
294047 421418 422620 423800 424837 425367 425824 425996 426125 426110 425953 425717 425281 424837 423943 423085 422034 420996 419873
296879 419873 418679 417299 415875 414416 412900 411362 409667 408201 406663 405175 403551 401935 400297 398766
299211 398766 397157 395533 394031 392501 391085 389568 388066 386750 385248 383939 382673 381400 380127 378854
301544 378854 377731 376465 375385 374262 373354 372295 371315 370378 369505 368683 367832 366945 366244 365557 364828 364127 363454
304376 363454 362868 362188 361781 361280 360636 360164 359692 359192 358755 358240 357868 357518 357189 356846 356502 356116 355844 355558
307392 355558 355301 355036 354800 354521 354235 354056 353863 353605 353491 353262 353119 352947 352804 352654 352525 352382 352289 352175 352032
310557 352032 351896 351782 351689 351667 351567 351517 351431 351381 351352 351367 351374 351453 351431 351488 351596 351710 351824 351996 352196 352518 352654 352997
$$ packed form
291714C90083K690K782K861K668K696K482K346K296K132J945J760J709J567J401
294047D21418J202J180J037N30M57J72J29j5j57k36m36m44q94q58j051j038j123
296879D19873j194j380j424j459j516j538j695j466j538j488j624j616j638j531
299211C98766j609j624j502j530j416j517j502j316j502j309j266j273j273j273
301544C78854j123j266j080j123r08j059r80r37q73q22q51q87p01o87p29p01o73
304376C63454n86o80m07n01o44m72m72n00m37n15l72l50l29l43l44l86k72k86
307392C55558k57k65k36k79k86j79j93k58j14k29j43j72j43j50j29j43r3j14j43
310557C52032j36j14r3k2j00n0q6n0k9J5PP9k2N7J08J14J14J72K00L22J36L43
$$ plain form
314206 352997 353319 353691 354128 354600 355072 355551 356123 356731 357418 358047 358698 359327 360014 360708 361366 362067 362768 363440
317205 363440 364163 364742 365328 365858 366459 366945 367417 367889 368275 368633 368990 369219 369477 369677 369906 370092 370092 370135 370256
320387 370256 370285 370199 370142 370113 369920 369892 369663 369534 369234 369112 368819 368561 368368 368018 367674 367460 367145 366788 366480 366158
323736 366158 365915 365572 365328 364985 364685 364391 364170 363798 363569 363283 362925 362703 362453 362217 361881 361809 361409 361194 361023
326868 361023 360701 360529 360336 360121 359928 359707 359563 359335 359163 358991 358863 358727 358669 358448 358262 358126 358004 357761 357661
330051 357661 357589 357411 357303 357146 357117 356846 356774 356602 356474 356373 356209 356044 356016 355858 355723 355615 355522 355379 355315 355179
333399 355179 355086 354914 354900 354743 354578 354514 354521 354342 354170 354027 353949 353927 353799 353598 353462 353484 353377 353262 353234 353155 353069 353026
337032 353026 353033 352869 352897 352869 352833 352826 352754 352747 352711 352783 352668 352769 352711 352719 352747 352769 352711 352804 352747 352797 352833 352812 352840 352854 352812 352883 352840 352833
$$ packed form
314206C52997L22L72M37M72M72M79N72O08O87O29O51O29O87O94O58P01P01O72
317205C63440P23N79N86N30O01M86M72M72L86L58L57K29K58K00K29J86%M3J21
320387C70256K9q6n7k9j93k8k29j29l00j22k93k58j93l50l44k14l15l57l08l22
323736C66158k43l43k44l43l00k94k21l72k29k86l58k22k50k36l36p2m00k15j71
326868C61023l22j72j93k15j93k21j44k28j72j72j28j36n8k21j86j36j22k43j00
330051C57661p2j78j08j57k9k71p2j72j28j01j64j65k8j58j35j08r3j43o4j36
333399C55179r3j72j4j57j65o4Pj79j72j43p8k2j28k01j36K2j07j15k8p9q6m3
337032C53026Pj64K8k8l6pp2pl6P2j15J01n8QK8K2n8R3n7N0L6k1K8J4m2P1m3p
$$ plain form
341697 352833 352804 352862 352833 352833 352862 352812 352804 352812 352769 352812 352690 352697 352683 352640 352626 352518 352511 352411 352382 352368 352311 352282 352225 352146 352139 352053 351996 352039 351925
346528 351925 351882 351860 351746 351746 351681 351638 351546 351510 351410 351395 351345 351309 351181 351138 351081 351031 350966 350887 350887 350852 350787 350773 350659 350680 350601 350573
350893 350573 350530 350501 350473 350423 350415 350387 350394 350337 350251 350280 350272 350301 350272 350244 350337 350315 350394 350415 350458 350480 350623 350644 350659 350830 350945 350995 351138
355375 351138 351195 351352 351431 351638 351717 351824 351910 352068 352153 352311 352382 352511 352633 352769 352869 352897 352983 353090 353234 353148 353284
358891 353284 353369 353462 353541 353484 353613 353748 353834 353920 354006 354099 354349 354664 354922 355286 355773 356409 357146 357890 358934 360164
362189 360164 361480 363083 364906 366909 369305 371909 374870 378160 381758 385828 390140 394747 399732 404889
364522 404889 410296 416140 422205 428528 435251 442182 449099 456480 463289 470327 477780 485076 492049 498344
366854 498344 505732 512427 518986 524543 530830 536810 542088 547367 552009 555893 559104 562838 565785 568016
$$ packed form
341697C52833k9N8k9%K9n0qQm3M3j22Pj4m3j4j08pj00k9j4n7k9n7p9pq6n7M3j14
346528C51925m3k2j14%o5m3r2l6j00j5n0l6j28m3n7n0o5p9%l5o5j4j14K1p9k8
350893C50573m3k9k8n0qk8Pn7q6K9qK9k9k8R3k2P9K1M3K2J43K1J5J71J15N0J43
355375C51138N7J57P9K07P9J07Q6J58Q5J58P1J29J22J36J00K8Q6J07J44q6J36
358891C53284Q5R3P9n7J29J35Q6Q6Q6R3K50L15K58L64M87O36P37P44J044J230
362189C60164J316J603J823K003K396K604K961L290L598M070M312M607M985N157
364522D04889N407N844O065O323O723O931O917P381O809P038P453P296O973O295
366854D98344P388O695O559N557O287N980N278N279M642L884L211L734K947K231
$$ plain form
369187 568016 570162 572150 573531 574754 575591 575684 575355 574911 574496 574475 573867 573595 573123 572551 572394 572422 572365 572279 573023
372369 573023 573273 573266 573009 572387 572136 571643 571364 570920 570069 568925 567644 566543 564826 563546 561937 560399 558389
375202 558389 555693 552431 549720 546938 543776 540386 537132 533935 530602 527118 523342 518957 515102 511061
377534 511061 507170 503336 499302 495254 491055 487450 483781 479547 475398 471486 467810 464176 460156 456459
379867 456459 452611 449378 446102 442697 439543 436489 433656 430617 427555 424680 422191 419530 417077 414330
382182 414330 412006 409724 407457 405340 403323 401363 399324 397386 395634 393896 392208 390527 388953 387523
384515 387523 386056 384733 383317 382001 380671 379591 378396 377481 376386 375442 374376 373396 372538 371694 370879
387014 370879 370056 369291 368647 367932 367281 366644 365972 365457 364856 364327 363848 363383 362825 362467 362010 361538 361166 360844
$$ packed form
369187E68016K146J988J381J223Q37R3l29m44m15k1o08k72m72n72j57K8n7q6P44
372369E73023K50pk57o22k51m93k79m44q51j144j281j101j717j280j609j538k010
375202E58389k696l262k711k782l162l390l254l197l333l484l776m385l855m041
377534E11061l891l834m034m048m199l605l669m234m149l912l676l634m020l697
379867D56459l848l233l276l405l154l054k833l039l062k875k489k661k453k747
382182D14330k324k282k267k117k017j960k039j938j752j738j688j681j574j430
384515C87523j467j323j416j316j330j080j195r15j095r44j066r80q58q44q15
387014C70879q23p65o44p15o51o37o72n15o01n29m79m65n58l58m57m72l72l22
$$ plain form
390030 360844 360365 359950 359664 359349 358977 358705 358441 358097 357840 357475 357318 357067 356846 356545 356345 356145 355894 355687
393029 355687 355494 355315 355150 354857 354743 354550 354356 354228 354120 353927 353841 353670 353555 353412 353348 353255 353112 353012 352940 352833
396377 352833 352697 352597 352525 352397 352368 352311 352261 352111 352003 352053 351925 351917 351896 351910 351953 351803 351510 351681 351667 351681 351681 351610 351574 351624
400359 351624 351667 351660 351774 351739 351753 351796 351853 351939 351946 352060 352125 352268 352282 352375 352468 352554 352583 352690 352783 352783 352897 352976 353012 353033 353026 353090 353169
404858 353169 353205 353241 353241 353312 353241 353341 353262 353255 353226 353326 353183 353183 353098 353069 353083 352947 352897 352826 352804 352697 352575 352518 352411 352354 352225
409006 352225 352096 352003 351889 351774 351739 351667 351453 351410 351295 351224 351181 351016 351002 350902 350852 350773 350744 350673 350623 350587 350558 350487 350501 350423
413022 350423 350365 350430 350330 350330 350330 350280 350272 350308 350244 350272 350244 350201 350194 350165 350194 350215 350187 350108 350108 350101 350058 350115 350101 350043 350051 350015 349986 349943 349965 349858
418020 349858 349908 349886 349879 349872 349815 349800 349757 349736 349765 349714 349679 349686 349650 349571 349543 349536 349457 349428 349457 349385 349393 349335 349335 349328 349314 349335 349314 349242 349192 349214 349214
$$ packed form
390030C60844m79m15k86l15l72k72k64l44k57l65j57k51k21l01k00k00k51k07
393029C55687j93j79j65k93j14j93j94j28j08j93q6j71j15j43o4r3j43j00p2j07
396377C52833j36j00p2j28k9n7n0j50j08N0j28qk1J4M3j50k93J71j4J4%p1l6N0
400359C51624M3pJ14l5J4M3N7Q6PJ14O5J43J4R3R3Q6K9J07R3%J14P9L6K1pO4P9
404858C53169L6L6%P1p1J00p9pk9J00j43%q5k9J4j36n0p1k2j07j22n7j07n7j29
409006C52225j29r3j14j15l5p2k14m3j15p1m3j65j4j00n0p9k9p1n0l6k9p1J4p8
413022C50423n8O5j00%%n0qL6o4K8k8m3pk9K9K1k8p9%pm3N7j4n8Ql6k9m3K2j07
418020C49858N0k2ppn7j5m3k1K9n1l5Pl6p9k8pp9k9K9p2Qn8%pj4K1k1p2n0K2%
$$ plain form
423201 349214 349221 349199 349157 349171 349171 349071 349114 349142 349107 349085 349078 349099 349014 348999 348992 348985 349028 348928 348992 348985 348956 348942 348878 348885 348963 348820 348935 348885 348906
428016 348906 348913 348870 348878 348813 348849 348878 348849 348913 348856 348878 348828 348842 348792 348820 348763 348820 348799 348763 348799 348799 348763 348685 348727 348770 348742 348699 348685 348685 348727
432848 348727 348656 348592 348656 348613 348613 348620 348642 348656 348599 348620 348649 348677 348677 348613 348592 348677 348649 348685 348677 348627 348642 348706 348699 348713 348742 348792 348828 348792 348828 348870
437846 348870 348870 348885 348971 348906 349028 349142 349078 349078 349185 349214 349300 349364 349471 349571 349621 349593 349707 349772 349829 349858 349915 350001 350029 350115 350172
441995 350172 350222 350215 350401 350358 350423 350373 350430 350451 350501 350508 350573 350530 350444 350558 350487 350444 350558 350537 350473 350394 350430 350444 350415 350373 350308 350258 350215
446493 350215 350201 350229 350129 350158 350129 350086 350043 349986 350022 349915 349872 349858 349858 349772 349757 349822 349679 349672 349600 349614 349571 349478 349571 349457 349478 349443
450858 349443 349393 349364 349328 349364 349300 349228 349257 349228 349228 349185 349114 349107 349099 349128 349142 349049 349107 349142 349078 349042 349028 349014 349049 348985 348999 348928 348971 348906 348906
455690 348906 348878 348956 348849 348842 348913 348785 348828 348842 348842 348785 348792 348756 348885 348792 348792 348727 348685 348763 348699 348713 348706 348670 348685 348620 348570 348599 348699 348627
$$ packed form
423201C49214Pk2m2J4%j00M3K8l5k2pK1q5j5ppM3j00O4pk9j4o4PP8j43J15n0K1
428016C48906Pm3Qo5L6K9k9O4n7K2n0J4n0K8n7N7k1l6L6%l6p8M2M3k8m3j4%M2
432848C48727p1o4O4m3%PK2J4n7K1K9K8%o4k1Q5k8L6qn0J5O4pJ4K9N0L6l6L6M2
437846C48870%J5Q6o5J22J14o4%J07K9Q6O4J07J00N0k8J14O5N7K9N7Q6K8Q6N7
441995C50172N0pJ86m3O5n0N7K1N0PO5m3q6J14p1m3J14k1o4p9L6J4k9m2o5n0m3
446493C50215j4K8j00K9k9m3m3n7L6j07m3j4%q6j5O5j43pp2J4m3r3R3j14K1l5
450858C49443n0k9l6L6o4p2K9k9%m3p1pqK9J4r3N8L5o4l6j4j4L5o4J4p1M3o5%
455690C48906k8P8j07pP1j28M3J4%n7Pl6J29r3%o5m2P8o4J4pl6J5o5n0K9J00p2
$$ plain form
460338 348627 348670 348613 348706 348642 348599 348627 348613 348599 348627 348613 348599 348556 348613 348599 348584 348599 348627 348527 348584 348563 348477 348534 348556 348556 348584 348570 348570 348499
465003 348499 348592 348620 348556 348627 348627 348642 348656 348627 348685 348685 348599 348677 348699 348649 348706 348677 348685 348685 348706 348713 348699 348677 348742 348763 348699 348763 348763 348763 348820 348792 348842
470168 348842 348756 348770 348756 348770 348763 348828 348770 348742 348706 348792 348742 348763 348828 348820 348828 348792 348785 348828 348813 348785 348785 348763 348792 348813 348792 348799 348785 348820 348799 348813
475167 348813 348735 348842 348828 348735 348756 348770 348727 348699 348685 348735 348813 348727 348735 348706 348813 348756 348656 348685 348756 348742 348742 348706 348742 348706 348735 348685 348713
479648 348713 348713 348713 348713 348677 348685 348677 348677 348656 348642 348685 348620 348642 348677 348599 348627 348642 348642 348599 348599 348613 348592 348534 348620 348563 348563 348584 348556 348506 348570 348584 348592 348499
484996 348499 348613 348541 348506 348584 348563 348513 348484 348513 348513 348499 348477 348420 348441 348420 348527 348477 348556 348541 348456 348506 348420 348427 348456 348527 348470 348484 348513
489478 348513 348527 348556 348534 348584 348627 348570 348563 348613 348656 348620 348685 348627 348649 348670 348756 348799 348770 348763 348792 348842 348870 348870 348756 348878 348906 348913 348906 348906 348956
494310 348956 348985 348963 349014 349021 349042 348999 348999 348942 348971 349014 348985 349021 349021 348999 348942 348992 348985 348971 348928 348935 348992 348942 348992 348913 348928 348928 348885 348942 348842 348842
$$ packed form
460338C48627M3n7R3o4m3K8j4j4K8j4j4m3N7j4j5J5K8j00N7k1q6N7K2%K8j4%p1
465003C48499R3K8o4P1%J5J4k9N8%q6P8K2n0N7k9Q%K1Pj4k2O5K1o4O4%%N7k8N0
470168C48842q6J4j4J4pO5n8k8l6Q6n0K1O5qQl6pM3j5k8%k2K9K1k1Pj4L5k1J4
475167C48813p8J07j4r3K1J4m3k8j4N0P8q6Qk9J07n7j00K9P1j4%l6L6l6K9n0K8
479648C48713%%%l6Qq%k1j4M3o5K2L5p8K8J5%m3%J4k1n8Q6n7%K1k8n0O4J4Qr3
484996C48499J14p2l5P8k1n0k9K9%j4k2n7K1k1J07n0P9j5q5N0q6PK9P1n7J4K9
489478C48513J4K9k2N0M3n7pN0M3l6O5n8K2K1Q6M3k9pK9N0K8%j14J22K8Pp%N0
494310C48956K9k2N1PK1m3%n7K9M3k9L6%k2n7N0pj4m3PN7n0N0p9J5%m3N7j00%
$$ plain form
499308 348842 348820 348828 348820 348799 348785 348799 348842 348820 348842 348770 348742 348792 348763 348742 348763 348727 348670 348742 348706 348642 348670 348656 348649 348699 348685 348599 348642 348627 348613
504140 348613 348570 348599 348613 348592 348592 348613 348527 348556 348527 348563 348513 348456 348499 348499 348456 348506 348456 348477 348506 348499 348484 348470 348427 348441 348384 348420 348420 348420 348427 348427 348477
509305 348477 348477 348470 348370 348484 348427 348448 348420 348484 348420 348456 348456 348398 348470 348413 348384 348441 348370 348398 348355 348456 348370 348413 348355 348398 348363 348413 348420 348313
513970 348313 348370 348413 348313 348398 348420 348391 348420 348327 348363 348370 348391 348341 348363 348384 348363 348334 348305 348313 348327 348398 348341 348370 348355 348363 348413 348456 348398 348441
518668 348441 348398 348506 348534 348513 348506 348563 348613 348584 348670 348706 348756 348756 348792 348842 348799 348792 348942 349042 348992 349071 349085 349114 349142 349157 349250 349257 349285 349335
523333 349335 349364 349393 349457 349443 349450 349514 349514 349564 349629 349600 349614 349700 349657 349743 349757 349829 349858 349958 349943 350001 350129 350222 350337 350487 350573 350716
527648 350716 350873 351023 351209 351338 351538 351753 351982 352297 352454 352804 353040 353319 353634 353977 354271 354578 355000 355301
530664 355301 355608 356037 356431 356688 357039 357361 357704 357990 358333 358612 358977 359156 359413 359692 359978 360157 360350 360479
$$ packed form
499308C48842k2Qqk1j4J4M3k2K2p2k8N0k9k1K1l6n7P2l6o4K8j4pN0j4q6M3j5j4
504140C48613m3K9J4k1%K1q6K9k9L6n0n7M3%m3N0n0K1K9pj5j4m3J4n7L6%%P%N0
509305C48477%pj00J14n7K1k8O4o4L6%n8P2n7k9N7p1K8m3J01q6M3n8M3l5N0Pj07
513970C48313N7M3j00Q5K2k9K9r3L6PK1n0K2K1k1k9k9QJ4P1n7K9j5QN0M3n8M3
518668C48441m3J08K8k1pN7N0k9Q6L6N0%L6N0m3pJ50J00n0P9J4K9K8J5R3PK8N0
523333C49335K9K9O4j4PO4%N0O5k9J4Q6m3Q6J4P2K9J00j5N8J28R3J15J50Q6J43
527648C50716J57J50J86J29K00K15K29L15J57L50K36K79L15L43K94L07M22L01
530664C55301L07M29L94K57L51L22L43K86L43K79L65J79K57K79K86J79J93J29
$$ plain form
533663 360479 360651 360779 360930 360922 361023 361123 361166 361151 361180 361080 361073 360872 360808 360779 360644 360436 360365 360121 359950 359764 359549 359378
537311 359378 359127 358870 358691 358390 358183 357933 357725 357468 357210 357003 356753 356517 356259 356073 355787 355522 355372 355029
540310 355029 354836 354635 354385 354178 354035 353784 353641 353398 353226 353083 352969 352661 352554 352432 352261 352139 351975 351882 351746
543493 351746 351581 351453 351309 351259 351081 351002 350959 350816 350802 350737 350630 350558 350530 350415 350373 350330 350287 350222 350187 350187 350079 350072 350101 350022
547475 350022 349993 350051 349972 349993 349972 349908 349858 349900 349908 349843 349757 349772 349707 349736 349700 349679 349672 349629 349629 349614 349571 349564 349593 349543 349529 349486 349471 349450 349414
552306 349414 349443 349371 349328 349357 349314 349371 349278 349285 349214 349228 349164 349228 349171 349185 349171 349071 349114 349128 349078 349056 349085 349049 349049 349085 349085 349056 349021 349099
556955 349099 349042 349071 349135 349214 349157 349192 349300 349242 349364 349364 349335 349314 349364 349428 349486 349414 349507 349507 349450 349593 349614 349557 349557 349621 349629 349614 349672 349643
561620 349643 349564 349621 349543 349543 349543 349543 349557 349564 349514 349529 349457 349500 349500 349486 349514 349478 349471 349500 349421 349471 349393 349414 349328 349400 349443 349414 349414 349400 349421 349393 349357
$$ packed form
533663C60479J72J28J51qJ01J00M3j5K9j00pk01o4k9j35k08p1k44j71j86k15j71
537311C59378k51k57j79l01k07k50k08k57k58k07k50k36k58j86k86k65j50l43
540310C55029j93k01k50k07j43k51j43k43j72j43j14l08j07j22j71j22j64r3j36
543493C51746j65j28j44n0j78p9m3j43j4o5j07p2k8j15m2m3m3o5l5%j08pK9p9
547475C50022k9N8p9K1k1o4n0M2Qo5q6J5o5K9l6k1pm3%j5m3pK9n0j4m3j5k1l6
552306C49414K9p2m3K9m3N7r3Pp1J4o4O4n7J4j4j00M3J4n0k2K9l6%L6%k9l5P8
556955C49099n7K9O4P9n7L5J08n8J22%k9k1N0O4N8p2R3%n7J43K1n7%O4Qj5N8k9
561620C49643p9N7p8%%%J4Pn0J5p2M3%j4K8l6pK9p9N0p8K1q6P2M3k9%j4K1k8l6
$$ plain form
566784 349357 349500 349536 349500 349471 349571 349514 349557 349600 349593 349600 349614 349686 349586 349700 349564 349621 349679 349657 349657 349679 349672 349679 349621 349571 349593 349557 349564 349557
571449 349557 349514 349500 349514 349478 349450 349385 349385 349428 349385 349421 349457 349343 349385 349307 349307 349307 349300 349257 349199 349185 349171 349078 349128 349042 349042 349028 348992 348971 348985
576314 348985 348935 348956 348992 348928 348956 348906 348906 348878 348928 348992 348985 348999 349042 349085 349135 349135 349221 349300 349364 349428 349571 349643 349757 349829 349993 350108 350258
580813 350258 350451 350573 350744 350859 351081 351252 351410 351567 351832 352053 352232 352432 352683 352826 353055 353183 353412 353455 353663
583945 353663 353863 354027 354128 354242 354428 354528 354607 354721 354814 354800 354871 354922 354943 354979 354900 354886 354929 354857 354800 354786 354685 354664 354550
587794 354550 354500 354399 354399 354285 354128 354070 353942 353777 353727 353627 353541 353348 353312 353098 352976 352955 352869 352711 352547 352482 352368 352225
591442 352225 352139 351925 351917 351739 351653 351567 351481 351352 351224 351138 350995 350959 350902 350802 350709 350644 350601 350394 350401 350244 350201 350194 350058 349965
595458 349965 349943 349929 349822 349829 349700 349672 349643 349564 349536 349478 349457 349393 349421 349343 349307 349307 349257 349257 349214 349199 349085 349049 349014 349056 349049 348999 348985 348985
$$ packed form
566784C49357J43L6l6k9J00n7M3M3pPJ4P2j00J14j36N7N8k2%K2pPn8n0K2l6Pp
571449C49557m3j4J4l6k8o5%M3m3L6L6j14M2p8%%pm3n8j4j4r3N0q6%j4l6k1J4
576314C48985n0K1L6o4K8n0%k8N0O4pJ4M3M3N0%Q6P9O4O4J43P2J14P2J64J15J50
580813C50258J93J22J71J15K22J71J58J57K65K21J79K00K51J43K29J28K29M3K08
583945C53663K00J64J01J14J86J00P9J14R3j4P1N1K1L6p9j4M3p2n7j4j01k1j14
587794C54550n0j01%j14j57n8j28j65n0j00q6j93l6k14j22k1q6j58j64o5j14j43
591442C52225q6k14qj78q6q6q6j29j28q6j43l6n7j00r3o5m3k07Pj57m3pj36r3
595458C49965k2j4j07Pj29k8k9p9k8n8k1o4K8p8l6%n0%m3j5j14l6l5M2pn0j4%
$$ plain form
600123 348985 348899 348906 348899 348856 348906 348856 348813 348828 348792 348799 348727 348785 348813 348713 348763 348756 348706 348699 348706 348713 348685 348677 348727 348677 348613 348642 348642 348613 348627 348592 348592 348620
605454 348620 348570 348541 348513 348506 348541 348570 348570 348563 348556 348484 348484 348456 348499 348513 348506 348398 348448 348448 348456 348456 348448 348470 348370 348413 348384 348384 348441 348363 348313 348398 348313 348334
610802 348334 348370 348298 348341 348313 348305 348363 348327 348370 348341 348305 348327 348270 348305 348270 348298 348363 348363 348341 348391 348298 348298 348270 348298 348255 348241 348284 348334 348277 348270
615634 348270 348212 348284 348305 348327 348270 348284 348277 348355 348363 348270 348341 348398 348355 348370 348363 348456 348427 348441 348441 348527 348499 348470 348513 348534 348556 348556 348620 348649 348677 348727
620632 348727 348699 348799 348735 348813 348820 348813 348906 348885 348906 348956 348956 349056 349078 349078 349128 349164 349257 349300 349343 349364 349414 349507 349457 349486 349621 349629 349614 349700
625281 349700 349621 349707 349714 349707 349743 349765 349772 349765 349822 349786 349850 349772 349815 349793 349822 349786 349800 349772 349765 349743 349643 349707 349729 349707 349672 349672 349657 349679 349593 349514
630279 349514 349500 349557 349536 349450 349428 349428 349385 349400 349364 349300 349257 349250 349228 349192 349228 349199 349157 349142 349142 349128 349135 349142 349014 349014 349014 348963 348999 348913 348956 348935
635277 348935 348928 348899 348870 348813 348742 348899 348878 348842 348770 348785 348763 348770 348813 348742 348727 348713 348727 348699 348670 348685 348563 348713 348656 348642 348642 348670 348563
$$ packed form
600123C48985q6Ppm3N0n0m3J5l6Pp2N8K8j00N0pn0pPPk8qN0n0o4K9%k9J4l5%K8
605454C48620n0k9k8pL5K9%ppp2%k8M3J4pj08N0%Q%qK2j00M3k9%N7p8n0Q5q5K1
610802C48334L6p2M3k8qN8l6M3k9l6K2n7L5l5K8O5%k2N0r3%k8K8m3j4M3N0n7p
615634C48270n8P2K1K2n7J4pP8Qr3P1N7m3J5pR3k9J4%Q6k8k9M3K1K2%O4K9K8N0
620632C48727k8J00o4P8PpR3k1K1N0%J00K2%N0L6R3M3M3K1N0R3n0K9J35Qj5Q6
625281C49700p9Q6PpL6K2PpN7l6O4p8M3k2K9l6J4k8pk2j00O4K2k2l5%j5K2q6p9
630279C49514j4N7k1q6k2%m3J5l6o4m3pk2l6L6k9m2j5%j4PPj28%%n1L6q6M3k1
635277C48935pk9k9n7p1J57k1l6p2J5k2PM3p1j5j4J4k8k9J5j22J50n7j4%K8j07
$$ plain form
639776 348563 348599 348570 348599 348599 348592 348599 348592 348541 348563 348613 348627 348599 348592 348599 348670 348685 348627 348699 348685 348756 348735 348699 348735 348756 348770 348813 348856 348935 348985 349014
644774 349014 348999 349014 349128 349199 349192 349278 349314 349343 349357 349393 349514 349643 349600 349707 349729 349908 349908 350072 350072 350101 350222 350244 350415 350387 350487
648922 350487 350516 350644 350680 350716 350787 350759 350916 350909 351002 350995 351045 351052 351081 351052 351088 351116 351016 351095 351045 351181 351066 351045 350995 350973 350945 350959
653288 350959 350880 350880 350852 350737 350744 350702 350659 350594 350501 350473 350394 350401 350251 350244 350280 350136 350101 350051 349993 349986 349936 349858 349800 349714 349643 349643 349621 349586 349557
658119 349557 349500 349443 349400 349343 349271 349228 349228 349185 349185 349142 349114 349056 349135 349114 349099 349049 349049 349085 349107 349071 349085 349135 349099 349071 349078 349085 349078 349085 349171 349171 349135
663284 349135 349164 349114 349135 349157 349214 349099 349142 349099 349085 349142 349114 349071 349071 349107 349042 349014 349028 348992 349014 348935 348992 348942 348942 348956 348885 348885 348935 348856
667932 348856 348813 348820 348785 348820 348820 348785 348785 348735 348735 348770 348742 348727 348706 348735 348642 348699 348670 348592 348584 348677 348627 348584 348527 348599 348513 348506 348484 348499 348484 348499
672931 348499 348499 348527 348534 348477 348413 348398 348413 348327 348384 348341 348370 348355 348363 348341 348284 348363 348327 348305 348363 348305 348248 348255 348284 348220 348241 348227 348255 348313 348270
$$ packed form
639776C48563L6k9K9%pPpn1K2N0J4k8pPP1J5n8P2j4P1k1l6L6K1J4M3M3P9N0K9
644774C49014j5J5J14P1pQ6L6K9J4L6J21J29m3J07K2J79%J64%K9J21K2J71k8J00
648922C50487K9J28L6L6P1k8J57pR3pN0PK9k9L6K8j00P9n0J36j15k1n0k2k8J4
653288C50959p9%k8j15Pm2m3o5r3k8p9Pj50pL6j44l5n0n8pn0p8n8q6p1%k2l5k9
658119C49557n7n7m3n7p2m3%m3%m3k8n8P9k1j5n0%L6K2l6J4N0l6k8PPpPQ6%l6
663284C49135K9n0K1K2N7j15M3m3j4N7k8m3%L6o5k8J4l6K2p9N7n0%J4p1%N0p9
667932C48856m3Pl5L5%l5%n0%L5k8j5k1K9r3N7k9p8qR3n0m3n7P2q6pk2J5j5J5
672931C48499%K8Pn7o4j5J5q6N7m3K9j5Qk2n7P9l6k2N8n8n7PK9o4K1j4K8N8m3
$$ plain form
677762 348270 348170 348227 348198 348220 348227 348248 348255 348227 348198 348212 348155 348220 348112 348227 348277 348184 348134 348170 348162 348198 348170 348162 348198 348184 348184 348227 348198 348191 348134
682594 348134 348220 348184 348162 348105 348198 348084 348141 348198 348098 348170 348155 348184 348134 348105 348184 348141 348098 348098 348077 348105 348134 348170 348134 348127 348184 348184 348141 348155
687259 348155 348248 348127 348127 348191 348134 348098 348098 348112 348105 348212 348220 348098 348141 348048 348098 348155 348170 348098 348141 348184 348170 348155 348134 348141 348055 348069 348112 348077
691907 348077 348077 348069 348041 348112 347991 348098 348026 348026 348048 348019 348012 347998 347962 347998 348019 347998 348055 347991 348069 347969 348069 347984 348069 348019 347998 348077 348012
696406 348012 348069 347991 348069 347998 348048 348077 348048 348019 347991 348012 348019 348077 348019 348055 348184 348112 348084 348098 348069 348098 348105 348105 348191 348098 348134 348134 348134 348112 348112 348105
701404 348105 348141 348055 348105 348270 348305 348212 348055 348141 348170 348270 348241 348248 348241 348341 348384 348391 348470 348413 348534 348656 348642 348756 348756 348885 348942
705603 348942 349078 349171 349257 349385 349507 349536 349657 349822 349915 350022 350129 350280 350365 350451 350558 350702 350816 350852 351059 351109 351238
709068 351238 351324 351410 351510 351517 351660 351660 351860 351824 351889 352010 352082 352153 352118 352239 352204 352289 352411 352411 352354 352461 352511 352547 352568 352575 352568 352597
$$ packed form
677762C48270j00N7k9K2PK1Pk8k9J4n7O5j08J15N0r3n0L6qL6k8qL6j4%M3k9pn7
682594C48134Q6l6k2n7R3j14N7N7j00P2j5K9n0k9P9m3m3%k1K8K9L6l6pN7%m3J4
687259C48155R3j21%O4n7l6%J4pJ07Qj22M3r3N0N7J5p2M3M3j4j5k1Pq6J4M3l5
691907C48077%qk8P1j21J07p2%K2k9pj4l6L6K1k1N7o4P8j00J00q5Q5n0k1P9o5
696406C48012N7p8P8p1N0K9k9k9k8K1PN8n8L6J29p2k8J4k9K9P%Q6r3L6%%k2%p
701404C48105L6q6N0J65L5r3j57Q6K9J00k9PpJ00M3PP9n7J21J22j4J14%J29N7
705603C48942J36R3Q6J28J22K9J21J65R3J07J07J51Q5Q6J07J44J14L6K07N0J29
709068C51238Q6Q6J00PJ43%K00l6O5J21P2P1l5J21l5Q5J22%n7J07N0L6K1PpK9
$$ plain form
713433 352597 352683 352661 352690 352661 352668 352719 352754 352769 352783 352754 352747 352740 352747 352783 352747 352769 352769 352854 352747 352776 352776 352776 352697 352740 352719 352611 352604 352597 352597 352697 352490
718598 352490 352525 352454 352404 352318 352289 352318 352268 352261 352196 352168 352125 352118 352082 352082 351946 352010 351882 351925 351889 351782 351753 351746 351710 351810 351624 351653 351631
723096 351631 351603 351546 351553 351524 351495 351453 351431 351410 351453 351281 351317 351317 351309 351267 351324 351295 351231 351224 351124 351116 351088 351124 351116 351095 351045 351016 350995 350909 350916 350859
728095 350859 350945 350902 350773 350802 350759 350823 350795 350766 350680 350687 350623 350573 350623 350544 350501 350458 350501 350373 350401 350473 350373 350401 350344 350280 350272 350287 350222
732576 350222 350215 350187 350172 350158 350201 350187 350129 350086 350136 350079 350058 349993 349993 350022 350015 349965 349993 349936 349965 349886 349843 349858 349915 349850 349858 349793 349757 349793 349765
737408 349765 349707 349700 349743 349686 349657 349629 349614 349600 349650 349593 349564 349593 349571 349543 349557 349478 349536 349507 349557 349450 349428 349385 349414 349421 349421 349393 349364 349307
742056 349307 349364 349357 349364 349328 349257 349278 349192 349221 349250 349157 349271 349192 349228 349192 349242 349199 349199 349157 349199 349157 349185 349135 349157 349199 349135 349049 349135 349071
746721 349071 349078 348971 349056 349049 349114 349099 349049 349056 349014 349028 349028 349049 348985 348956 348985 348935 348963 348906 348935 348928 348899 348842 348870 348885 348849 348842 348792 348828 348742 348799
$$ packed form
713433C52597Q6k2K9k9PN1L5J5J4k9ppPL6l6K2%Q5j07K9%%p9M3k1j08pp%J00k07
718598C52490L5p1n0q6k9K9n0po5k8m3pl6%j36O4j28M3l6j07k9pl6J00j86K9k2
723096C51631k8n7Pk9k9m2k2k1M3j72L6%qm2N7k9o4pj00qk8L6qk1n0k9k1q6Pn7
728095C50859Q6m3j29K9m3O4k8k9q6Po4n0N0p9m3m3M3j28K8P2j00K8n7o4qJ5o5
732576C50222pk8j5j4M3j4n8m3N0n7k1o5%K9pn0K8n7K9p9m3J5N7o5Qo5l6L6k8
737408C49765n8pM3n7k9k8j5j4N0n7k9K9k2k8J4p9N8k9N0j07k2m3K9P%k8k9n7
742056C49307N7pPl6p1K1q6K9K9r3J14p9L6l6N0m3%m2M2m2K8n0K2M2o4q6Q6o4
746721C49071Pj07Q5pO5j5n0Pm2J4%K1o4k9K9n0K8n7K9pk9n7K8J5l6pn0L6q6N7
$$ plain form
751720 348799 348813 348706 348763 348706 348713 348699 348742 348727 348685 348649 348642 348699 348627 348599 348570 348563 348513 348556 348592 348592 348556 348556 348534 348613 348477 348534 348456 348506 348534
756551 348534 348470 348470 348477 348448 348398 348420 348370 348427 348398 348355 348341 348413 348420 348470 348355 348391 348370 348355 348298 348370 348334 348327 348341 348277 348305 348284 348255 348270 348277
761383 348277 348248 348313 348313 348255 348248 348305 348327 348248 348241 348184 348198 348248 348298 348248 348198 348305 348277 348313 348298 348355 348341 348413 348420 348484 348534 348599 348649 348763
766081 348763 348770 348849 348956 349078 349228 349257 349428 349457 349621 349672 349822 349872 349858 349965 350051 350086 350079 350201 350287 350251 350258 350258 350301 350287 350358
770230 350358 350387 350387 350337 350401 350373 350337 350201 350308 350272 350251 350315 350165 350215 350215 350129 350115 350079 350136 350022 350001 350058 349972 349936 349850 349872 349815
774545 349815 349793 349793 349772 349765 349714 349629 349614 349614 349593 349529 349564 349586 349557 349414 349443 349314 349428 349357 349285 349285 349314 349300 349300 349257 349214 349185 349199 349164
779210 349164 349099 349142 349164 349128 349199 349135 349028 349056 349078 349056 349049 349085 349028 349056 349049 348999 349042 349028 349056 349056 349014 348985 349014 348971 349014 348956 348999 349021
783875 349021 349056 348971 348992 348992 348935 349021 349021 349028 348992 349028 348928 348971 349014 348971 348985 348913 348942 348942 348913 348942 348928 348992 348878 348935 348913 348935 348971 348928
$$ packed form
751720C48799J4j07N7n7Pj4M3j5m2l6pN7p2k8k9pn0M3L6%l6%k2P9j36N7p8N0K8
756551C48534o4%Pk9n0K2n0N7k9m3j4P2PN0j15L6k1j5n7P2l6pJ4o4K8k1k9J5P
761383C48277k9O5%n8pN7K2p9pn7J4N0N0n0n0J07k8L6j5N7j4P2PO4N0O5N0J14
766081C48763PP9J07J22J50K9J71K9J64N1J50N0j4J07Q6L5pJ22Q6l6P%M3j4P1
770230C50358K9%n0O4k8l6j36J07l6k1O4j50N0%q6j4l6N7j14k1N7q6l6q6K2n7
774545C49815k2%k1pn1q5j5%k1o4L5K2k9j43K9j29J14p1p2%K9j4%m3m3k9J4l5
779210C49164o5M3K2l6P1o4j07K8K2k2pL6n7K8pn0M3j4K8%m2k9K9m3M3n8M3K2
783875C49021L5q5K1%n7Q6%Pl6L6j00M3M3m3J4p2K9%k9K9j4O4j14N7k2K2L6m3
$$ plain form
788574 348928 348885 348906 348870 348906 348870 348870 348870 348820 348799 348842 348792 348799 348842 348785 348842 348785 348756 348785 348763 348713 348785 348785 348727 348713 348727 348699 348685 348706 348563
793405 348563 348735 348642 348570 348613 348613 348563 348563 348499 348484 348563 348470 348541 348556 348470 348499 348499 348499 348427 348513 348448 348384 348484 348448 348413 348391 348420 348391 348363
798070 348363 348355 348284 348341 348313 348384 348341 348277 348305 348305 348220 348191 348241 348284 348227 348227 348162 348220 348241 348184 348170 348191 348198 348112 348112 348069 348155 348162 347991 348105
802885 348105 348055 348084 348084 348098 348098 348084 347998 348019 348026 348077 347984 348026 348105 348084 348069 348012 348055 347941 348019 348048 347991 348026 347984 347998 347969 348019 347955 347984
807550 347984 348048 348012 347991 347998 347969 347962 348069 347969 347969 348019 347998 347962 347962 347969 347962 347905 347969 347905 347905 347926 347941 347869 347898 347905 347941 347955 347898 347876 347912 347869
812548 347869 347869 347812 347841 347883 347905 347790 347869 347905 347905 347912 347969 347912 347941 347933 347898 347876 347883 347933 347876 347933 347905 347905 347926 347926 347941 347876 347841 347955 347898 347912
817547 347912 347898 347941 347984 347941 347855 347933 347876 347962 347984 347962 348041 347926 347883 347962 347869 347969 347876 347926 347926 347969 347955 347955 347962 347898 347984 347905 347991 347912
822212 347912 347905 347962 347933 347955 347869 347933 347933 347848 347941 347941 347898 347898 347848 347926 347969 347905 347905 347898 347912 347933 347876 347933 347926 347898 347898 347898 347955 347926 347912 347991 347883
$$ packed form
788574C48928m3K1l6L6l6%%n0k1M3n0PM3n7N7n7k9K9k2n0P2%n8j4J4k8j4K1j43
793405C48563J72r3p2M3%n0%o4j5P9r3P1J5q6K9%%p2Q6o5o4J00l6l5k2K9k9k8
798070C48363qp1N7k8P1m3o4K8%q5k9N0M3n7%o5N8K1n7j4K1Pq6%m3Q6Pj71J14
802885C48105n0K9%J4%j4q6K1PN1r3M2P9k1j5n7M3j14P8K9n7L5m2J4k9N0o4K9
807550C47984O4l6k1Pk9pJ07j00%N0k1l6%Ppn7O4o4%K1J5p2K9PL6J4n7k2L6m3
812548C47869%n7K9M2K2j15P9L6%PN7n7K9ql5k2PN0n7N7k8%K1%J5o5l5J14n7J4
817547C47912j4M3M3m3q6P8n7Q6K2k2P9j15m3P9r3J00r3N0%M3j4%Po4Q6p9Q6p9
822212C47912pN7k9K2q6O4%q5R3%m3%n0P8M3o4%pJ4K1n7N7pk8%%N7k9j4P9j08
$$ plain form
827377 347883 347898 347955 347898 347941 347926 347962 347955 348041 347984 347962 347962 347955 348084 347991 348069 348084 348098 348098 348112 348084 348198 348112 348227 348155 348170 348162 348141 348141 348191
832208 348191 348191 348198 348170 348270 348198 348284 348313 348355 348363 348398 348355 348398 348448 348527 348470 348484 348470 348541 348570 348556 348613 348592 348649 348649 348685 348706 348756 348742 348727
837023 348727 348799 348792 348792 348878 348849 348856 348856 348842 348913 348906 348942 348935 348985 348963 348878 348963 348999 349021 349042 348992 349014 348999 348992 349028 349014 349028 349021 348992 349028 349056 349021
842205 349021 348992 348992 348971 348956 348956 348913 348942 348985 348842 348856 348842 348813 348785 348713 348763 348735 348699 348713 348649 348642 348649 348584 348627 348592 348563 348506 348527 348484 348499
847020 348499 348427 348456 348470 348363 348413 348391 348341 348398 348277 348327 348298 348248 348227 348198 348212 348134 348227 348220 348184 348041 348084 348098 348069 348012 348041 348041 347998
851518 347998 347984 347962 347933 347998 347998 347926 347969 347955 347933 347984 347869 347941 347933 347869 347848 347898 347855 347841 347819 347769 347841 347841 347812 347819 347798 347755 347869 347883
856217 347883 347783 347826 347819 347755 347783 347790 347783 347783 347783 347783 347740 347769 347783 347783 347762 347798 347826 347790 347726 347783 347755 347848 347755 347812 347783 347783 347812 347755 347740 347733 347726 347762
861515 347762 347726 347769 347812 347712 347762 347705 347697 347640 347676 347712 347669 347669 347669 347640 347676 347712 347640 347647 347726 347655 347676 347676 347697 347712 347655 347740 347726 347697 347726
$$ packed form
827377C47883J5N7n7M3j5L6pQ6n7k2%pJ29r3P8J5J4%J4k8J14q6J15p2J5qk1%N0
832208C48191%Pk8J00p2Q6K9M2QL5m3M3N0P9n7J4j4P1K9j4N7k1N7%L6K1N0j4j5
837023C48727P2p%Q6k9P%j4P1pL6pN0k2q5Q5L6K2K1n0K2j5pL6j4J4pk9L6K8l5
842205C49021k9%k1j5%m3K9M3j43J4j4k9k8p2N0k8l6J4o4pPo5M3l5k9n7K1m3J5
847020C48499p2K9J4j07N0k2n0N7j21N0k9n0k1k9J4p8R3pl6j43M3J4k9n7K9%m3
851518C47998j4k2k9O5%p2M3j4k2N1j15P2qo4k1N0m3j4k2n0P2%k9Pk1m3J14J4
856217C47883j00M3po4K8Pp%%%m3K9J4%k1L6K8l6o4N7k8R3r3N7k9%K9n7j5ppL6
861515C47762l6M3M3j00N0n7qn7L6L6m3%%k9L6L6p2PP9p1K1%K1J5n7Q5j4k9K9
$$ plain form
866346 347726 347712 347705 347712 347683 347655 347712 347683 347697 347676 347697 347669 347733 347705 347726 347726 347740 347726 347790 347619 347655 347683 347683 347755 347762 347783 347640 347762 347705
871045 347705 347676 347705 347733 347712 347733 347676 347705 347755 347733 347769 347712 347683 347740 347733 347755 347783 347762 347755 347733 347705 347740 347697 347683 347705 347676 347712 347733 347740 347697
875876 347697 347683 347733 347683 347712 347683 347705 347755 347783 347726 347740 347726 347733 347726 347669 347705 347705 347697 347812 347762 347733 347762 347762 347733 347726 347769 347755 347769 347783 347826 347855
880875 347855 347855 347841 347898 347969 348162 348212 348241 348413 348642 348770 348913 349135 349300 349543 349765 350043 350301 350544 350787 350995 351324
884340 351324 351581 351774 352025 352297 352518 352776 352976 353155 353291 353520 353670 353827 353920 354099 354128 354285 354342 354428 354464 354628
887689 354628 354635 354614 354721 354721 354807 354750 354843 354757 354786 354693 354714 354743 354578 354657 354550 354464 354485 354485 354356 354321 354256 354128 354120 354063 354013 353856
892004 353856 353806 353806 353720 353605 353520 353412 353355 353255 353198 353148 353005 352912 352833 352719 352769 352568 352468 352461 352347 352268 352261 352239 352089 351939
896036 351939 351968 351889 351717 351681 351610 351517 351510 351410 351345 351295 351238 351166 351124 351016 350909 350859 350880 350802 350730 350716 350573 350616 350508 350558 350451
$$ packed form
866346C47726j4pPk9k8N7k9J4k1K1k8O4k8K1%J4j4O4j71L6K8%P2PK1j43J22n7
871045C47705k9K9K8k1K1n7K9N0k2L6n7k9N7pK2K8k1pk2k8L5m3j4K2k9L6K1Pm3
875876C47697j4N0n0K9k9K2N0K8n7J4j4Ppn7L6%qJ15n0k9K9%k9pM3j4J4J4M3K9
880875C47855%j4N7P1J93N0K9J72K29J28J43K22J65K43K22K78K58K43K43K08L29
884340C51324K57J93K51K72K21K58K00J79J36K29J50J57R3J79K9J57N7Q6L6J64
887689C54628Pk1J07%Q6n7R3q6K9r3K1K9j65P9j07q6K1%j29l5o5j28qn7n0j57
892004C53856n0%q6j15q5j08n7j00n7n0j43r3p9j14N0k01j00pj14p9pk2j50j50
896036C51939K9p9j72l6p1r3pj00o5n0n7p2m2j08j07n0K1p8p2j4j43M3j08N0j07
$$ plain form
900184 350451 350394 350430 350344 350229 350229 350187 350101 350079 350101 349929 349886 349936 349850 349829 349772 349815 349679 349757 349564 349614 349543 349529 349443 349450 349385 349400
904500 349400 349335 349271 349221 349214 349085 349135 349071 349056 349021 348985 348963 348942 348971 348942 348899 348906 348828 348856 348885 348842 348820 348756 348763 348735 348727 348756 348763 348756 348742 348706
909498 348706 348699 348706 348713 348706 348685 348656 348592 348656 348677 348706 348706 348685 348685 348699 348742 348735 348706 348706 348699 348706 348735 348642 348685 348699 348677 348656 348685 348670 348627 348627 348599 348563 348570
915013 348570 348506 348499 348499 348477 348456 348470 348341 348448 348391 348355 348327 348334 348334 348298 348298 348298 348277 348305 348248 348298 348191 348248 348255 348191 348212 348227 348191 348134 348112
919844 348112 348184 348141 348170 348134 348105 348077 348098 348098 348098 348084 348105 347998 348048 348098 347962 348084 347969 348055 347969 347969 347969 347933 348055 347955 347998 347955
924159 347955 347941 347991 347955 347912 347941 347955 347883 347905 347905 347926 347848 347926 347812 347848 347826 347869 347876 347783 347769 347869 347783 347826 347812 347762 347783 347740 347726
928691 347726 347790 347733 347783 347783 347783 347755 347712 347790 347769 347676 347755 347769 347697 347697 347683 347762 347676 347683 347676 347683 347683 347655 347697 347705 347755 347712 347705 347697 347726 347683 347647 347669
933989 347669 347669 347676 347647 347669 347697 347712 347733 347705 347733 347762 347726 347783 347733 347705 347740 347826 347755 347769 347712 347755 347798 347783 347790 347790 347819 347733 347826 347798 347769
$$ packed form
900184C50451n7L6q6j15%m2q6k2K2j72m3N0q6k1n7M3j36P8j93N0p1j4q6Po5J5
904500C49400o5o4n0pj29N0o4j5l5l6k2k1K9k9m3Pp8K8K9m3k2o4Pk8qK9Ppj4l6
909498C48706pPPpk1k9o4O4K1K9%k1%J4M3pk9%pPK9r3M3J4k2k1K9j5m3%k8l6P
915013C48570o4p%k2k1J4j29J07n7l6k8P%l6%%k1K8n7N0j07N7Po4K1J5l6n7k2
919844C48112P2m3K9l6k9k8K1%%j4K1j07N0N0j36J22j15Q6q6%%l6J22j00M3m3
924159C47955j4N0l6m3K9J4p2K2%K1p8P8j14L6k2M3Pr3j4J00q6M3j4n0K1m3j4
928691C47726O4n7N0%%k8m3P8k1r3P9J4p2%j4P9q6PpP%k8M2QN0m3pqK9m3l6K2
933989C47669%Pk9K2K8J5K1k8K8K9l6N7n0k8L5Q6p1J4n7M3M3j5P%K9q6R3k8k9
$$ plain form
938821 347769 347826 347755 347848 347755 347762 347762 347755 347755 347733 347762 347841 347790 347790 347798 347740 347712 347755 347790 347762 347790 347740 347819 347783 347740 347769 347819 347869 347848 347819 347848
943819 347848 347905 347841 347819 347826 347819 347883 347869 347898 347841 347848 347855 347740 347855 347812 347855 347855 347755 347869 347769 347819 347819 347798 347841 347841 347798 347783 347798 347819
948518 347819 347769 347712 347733 347740 347762 347790 347769 347733 347841 347783 347819 347790 347762 347755 347790 347812 347783 347783 347769 347769 347841 347762 347798 347826 347790 347812 347848 347826 347769
953349 347769 347869 347819 347841 347826 347898 347841 347855 347826 347876 347883 347962 347941 347941 347955 347905 347898 347998 347991 347991 348069 348112 348127 348184 348112 348241 348162 348255 348248 348220
958181 348220 348341 348384 348448 348477 348563 348570 348620 348642 348677 348685 348828 348870 348856 348885 348942 348928 348956 349078 349078 349078 349071 349056 349171 349171 349221 349228 349242 349242 349199
963012 349199 349328 349257 349250 349300 349285 349335 349300 349300 349328 349221 349271 349285 349192 349285 349271 349192 349242 349221 349250 349199 349228 349107 349107 349056 349071 349042 349078
967494 349078 348971 349049 348913 348928 348935 348856 348856 348770 348799 348735 348763 348699 348677 348677 348649 348620 348649 348584 348506 348570 348556 348470 348448 348456 348448 348448 348413 348370 348370 348327
972492 348327 348284 348270 348241 348277 348184 348212 348162 348191 348155 348155 348212 348105 348084 348084 348055 348026 348069 347998 348026 347962 348055 347941 347912 347898 347905 347991 347883
$$ packed form
938821C47769N7p1R3r3P%p%k2K9P9n1%Qn8k8M3L5k8K8n0P9l6m3K9N0N0k1k9K9
943819C47848N7o4k2PpO4j4K9n7PPj15J15m3M3%j00J14j00N0%k1M3%m3j5J5K1
948518C47819n0n7K1PK2K8k1l6J08n8L6k9k8pL5K2k9%j4%P2p9L6K8l6K2L6k2n7
953349C47769J00n0K2j5P2n7J4k9N0PP9k1%J4n0pJ00p%P8M3J5N7p2J29p9R3pk8
958181C48220J21M3O4K9Q6PN0K2L5QJ43M2j4K9N7j4K8J22%%pj5J15%N0PJ4%m3
963012C49199J29p1pN0j5N0l5%K8j07N0J4r3R3j4p9N0k1K9n1K9j21%n1J5k9L6
967494C49078j07P8j36J5Pp9%q6K9o4K8o4k2%k8k9K9o5p8O4j4q6k2Qq%l5m3%m3
972492C48327m3j4k9L6r3K8n0K9l6%N7j07k1%k9k9M3p1K8o4R3j14k9j4PQ6j08
$$ plain form
976974 347883 347926 347905 347876 347848 347933 347869 347819 347841 347855 347841 347826 347790 347812 347790 347769 347812 347726 347755 347733 347783 347762 347755 347733 347755 347769 347798 347783 347755
981639 347755 347769 347819 347769 347819 347790 347762 347733 347726 347755 347798 347755 347769 347733 347769 347798 347783 347755 347798 347769 347733 347769 347783 347676 347755 347740 347762 347705
986171 347705 347790 347769 347712 347726 347740 347726 347697 347640 347655 347676 347647 347733 347705 347676 347676 347740 347676 347655 347655 347740 347705 347733 347740 347726 347647 347733 347726 347726 347726 347669
991169 347669 347655 347676 347712 347669 347676 347647 347669 347676 347590 347683 347683 347697 347740 347612 347619 347669 347669 347647 347647 347597 347626 347597 347597 347626 347590 347569 347612 347562 347540 347583
996168 347583 347504 347533 347540 347476 347504 347526 347426 347469 347554 347419 347397 347454 347454 347476 347483 347497 347497 347390 347483 347447 347447 347440 347426 347511
$$ packed form
976974C47883M3k1k9k8Q5o4n0K2J4j4j5l6K2k2k1M3q6K9k2N0k1pk2K2J4K9j5k8
981639C47755J4N0n0N0k9k8k9pK9M3m3J4l6L6K9j5k8M3k9l6L6J4j07P9j5K2n7
986171C47705Q5k1n7J4J4j4k9n7J5K1k9Q6k8k9%O4o4k1%Q5l5K8Pj4p9Q6p%%n7
991169C47669j4K1L6m3Pk9K2Pq6R3%J4M3j28PN0%k2%n0K9k9%K9l6k1M3n0k2M3
996168C47583p9K9Po4K8K2j00M3Q5j35k2N7%K2PJ4%j07R3l6%pj4Q5
##END=
