##TITLE= Headspace from lime skin
##JCAMP-DX= 5.00 $$From Command Line Converter 1.0
##DATA TYPE= GAS CHROMATOGRAPH
##ORIGIN= Dept of Chem, UWI, Mona, JAMAICA
##OWNER= Dr Robert J. Lancashire
##$URL= http://wwwchem.uwimona.edu.jm:1104/software/jcampdx.html
##SPECTROMETER/DATA SYSTEM= HP 5890 GC
##DATE= 11-26-1995
##TIME= 08:41:51
##XUNITS= ARBITRARY
##YUNITS= ARBITRARY
##XFACTOR= 2.000000e-005
##YFACTOR= 8.379200e-001
##FIRSTX=   0.000000
##LASTX=  20.003
##NPOINTS= 6002
##MAXY= 886837.000000
##MINY= 48917.000000
##FIRSTY= 49559.000000
##DELTAX=   0.003333
##XYDATA= (X++(Y..Y))
0E9145P%JrMJ1Kj1J3j3KkMkPjnJ4j0J0r%JKl%m%kj3J4j3%J4j5J3mMmKoO
6983E9150oJ9j0lqK%mJ2mj5J5NjqmjmJ5omjNj4MnNj1J7j9RRonnNkLJ%%kkPj3
14483E9120QKrLM%NmomJJNlLRoqj2OMnJ0j3J2j9OnjlJ0mn%L%lQJknnJ1njOjn
22500E9104J6nj0J1Lj4OrjJ0Rj0lR%LnmNoJJ1j2Kj0JKLJ2j7LNlj2OkOk0PjJ6
29316E9107n%j0PrNrJ3J0j0kjNrMO%o%RMqOKJ0j8j0%OQlNLroJ6rnMOkmnQ%Or
37149E9101j4RLL%jnj0J1noOoJ6jj5mJ4n%nO%nMOjj0J0mRrLKojO%J5oj5R%Lj
44649E9101%%LpjJKkjJjQlQj2jLLjmJ7rrRl%KknNJ3njnLkKj5K2nkPplLj2OJ0
52666E9111jo%%%lrJ2k%lLKkK1j6LqPkLJm%Prjj4K1LmJrLqJ9pj2PpKqMM%Kj4
$$ plain form
0 59145 59152 59152 59153 59144 59148 59159 59161 59150 59163 59150 59152 59150 59154 59152 59159 59158 59153 59167 59157 59167 59158 59158 59159 59161 59158 59158 59154 59154 59152 59139 59153 59140 59140 59154 59139 59152 59148 59152 59148 59150 59144 59150
6983 59150 59144 59163 59153 59150 59142 59144 59144 59140 59152 59148 59133 59148 59153 59152 59144 59140 59139 59135 59150 59144 59140 59139 59144 59130 59134 59129 59134 59123 59140 59121 59130 59139 59133 59128 59123 59128 59126 59129 59130 59130 59130 59128 59126 59133 59120
14483 59120 59128 59130 59121 59124 59128 59128 59133 59129 59123 59119 59120 59121 59126 59123 59126 59135 59129 59121 59109 59115 59119 59114 59124 59111 59123 59104 59110 59105 59104 59101 59111 59107 59102 59102 59105 59105 59102 59110 59111 59109 59104 59099 59110 59105 59104 59110 59109 59104
22500 59104 59120 59115 59105 59116 59119 59105 59111 59102 59101 59111 59120 59110 59107 59116 59116 59119 59114 59110 59115 59109 59110 59121 59109 59111 59101 59102 59104 59107 59119 59102 59105 59110 59107 59095 59101 59099 59105 59085 59092 59091 59107
29316 59107 59102 59102 59092 59099 59090 59095 59086 59099 59109 59099 59097 59096 59101 59092 59096 59102 59102 59096 59096 59105 59109 59101 59107 59109 59119 59101 59091 59091 59097 59105 59102 59107 59110 59101 59095 59111 59102 59097 59101 59107 59105 59101 59096 59104 59104 59110 59101
37149 59101 59087 59096 59099 59102 59102 59101 59096 59086 59097 59092 59086 59092 59086 59102 59101 59086 59082 59096 59091 59091 59086 59092 59092 59087 59091 59097 59096 59086 59096 59092 59101 59092 59095 59097 59091 59090 59096 59096 59111 59105 59090 59099 59099 59102 59101
44649 59101 59101 59101 59104 59097 59096 59097 59099 59097 59096 59097 59096 59104 59101 59109 59097 59096 59099 59102 59101 59097 59114 59105 59096 59105 59102 59102 59104 59102 59097 59102 59115 59110 59109 59104 59107 59105 59107 59092 59114 59109 59107 59114 59107 59104 59107 59095 59101 59111
52666 59111 59110 59104 59104 59104 59104 59101 59092 59104 59102 59102 59099 59102 59104 59102 59123 59107 59110 59102 59109 59107 59110 59111 59107 59107 59114 59105 59104 59090 59111 59114 59110 59111 59102 59105 59097 59116 59109 59097 59104 59097 59099 59091 59095 59099 59099 59101 59087
60500E9087QlMo%JJ1pPoJj0MQ%rKnkJ1jj2MnmoJ4rRqkRlLPj0NLqJ4nOPj3J4R
68166E9114L8O0Q6J26K01K76L66M63N72P06Q08R58J117J265J393J545J660J788
71183G2542J905K034K024K250K054K249K094K251K097J833K030J773J606J511
73516A00253J413J212J022Q24P13O26N39L50K22P0n0k86l15k06l43m64n07n97
76516A04476o61o99p36p36p86p83q30q64r01q85q74q59q43q08r35q98q26q80
79483H9672p76p65p45q34p59p34p03o49o52o85o75n82n95o00n48n29n07m95m94
82666G7345n80m42m88m57m19m45m36m13m27l87l86l85l70l72l28l37l48l24l09
85850F9692k96l11k81k72k79k51k55k37k33k41k12k02j98j90k00j69j80j63j53
$$ plain form
60500 59087 59095 59092 59096 59090 59090 59091 59102 59095 59102 59096 59097 59087 59091 59099 59099 59090 59092 59087 59085 59096 59095 59083 59087 59082 59078 59072 59086 59077 59086 59078 59076 59085 59082 59085 59092 59082 59087 59090 59082 59096 59091 59097 59104 59091 59105 59114
68166 59114 59152 59212 59298 59424 59625 59901 60267 60730 61302 62008 62816 63774 64891 66156 67549 69094 70754 72542
71183 72542 74447 76481 78505 80755 82809 85058 87152 89403 91500 93333 95363 97136 98742 100253
73516 100253 101666 102878 103900 104724 105437 106063 106602 106952 107174 107244 107194 106908 106593 106387 106044 105580 105073 104476
76516 104476 103815 103116 102380 101644 100858 100075 99245 98381 97480 96595 95721 94862 94019 93211 92276 91378 90552 89672
79483 89672 88896 88131 87386 86552 85793 85059 84356 83707 83055 82370 81695 81113 80518 79918 79370 78841 78334 77839 77345
82666 77345 76765 76323 75835 75378 74959 74514 74078 73665 73238 72851 72465 72080 71710 71338 71010 70673 70325 70001 69692
85850 69692 69396 69085 68804 68532 68253 68002 67747 67510 67277 67036 66824 66622 66424 66234 66034 65865 65685 65522 65369
89016F5369j53j37j58j47j24j38j21j14r7j12j13j03j09r2r5o4r9j01p9q3q0
92500F3050o4q7o7p5o5p3o1o8p0o5o2q0n1o0p0n6n5n0n1n7n6n7m3n6n8l8m7m3
97150F1365o0m2m9m8m0m9m2m5l4k7m7m3k8m1l1l8j7l7l9k3j9k4l9j4k7k1k8j9
101816F0394j5l4%k4l2j4j4rk5j3j5j8nk9rj2j3j0j5k0%k1k4Lj7k0Jj6jk7Lj3
107150E9936j3oj0%qkj0J1LQN2J05J12P3R1N3N2M3M9M0L0L7K6J2J9J0NJ0NOoJ
112499F0734jnqj1%k8k1k1n7n5q5q0q2j04r1n2l9l3j2j2l6l3p2l7l8k0kl0j3l0
117500E9626l0mj5l4%j6k1j3j4knj2j2qmjj5Nj3oj3j2Nj4j0j3mjrklk1j1Pl1Q
123516E9282ok9Loj9Ql7Mj9qoj9Oj9j1j3Lmlk0mj6opoqlkj6Ok1j7Rk%j4j3qLj9
$$ plain form
89016 65369 65216 65079 64921 64774 64650 64512 64391 64277 64180 64068 63955 63852 63743 63651 63556 63492 63393 63292 63213 63130 63050
92500 63050 62986 62899 62832 62757 62692 62619 62558 62490 62420 62355 62293 62213 62162 62102 62032 61976 61921 61871 61820 61763 61707 61650 61607 61551 61493 61455 61408 61365
97150 61365 61305 61263 61214 61166 61126 61077 61035 60990 60956 60929 60882 60839 60811 60770 60739 60701 60684 60647 60608 60585 60566 60542 60503 60489 60462 60441 60413 60394
101816 60394 60379 60345 60345 60321 60289 60275 60261 60252 60227 60214 60199 60181 60176 60147 60138 60126 60113 60103 60088 60068 60068 60047 60023 60026 60009 59989 59990 59974 59973 59946 59949 59936
107150 59936 59923 59917 59907 59907 59899 59897 59887 59898 59901 59909 59961 60066 60178 60251 60342 60395 60447 60490 60539 60579 60609 60646 60672 60684 60703 60713 60718 60728 60733 60739 60733 60734
112499 60734 60733 60728 60720 60709 60709 60681 60660 60639 60582 60527 60442 60362 60280 60176 60085 60033 59994 59961 59949 59937 59901 59868 59796 59759 59721 59701 59699 59669 59656 59626
117500 59626 59596 59592 59577 59543 59543 59527 59506 59493 59479 59477 59472 59460 59448 59440 59436 59435 59420 59425 59412 59406 59393 59381 59386 59372 59362 59349 59345 59344 59335 59333 59330 59309 59298 59305 59274 59282
123516 59282 59276 59247 59250 59244 59225 59233 59196 59200 59181 59173 59167 59148 59154 59135 59124 59111 59114 59110 59107 59087 59083 59067 59061 59054 59048 59040 59037 59035 59019 59025 59004 58987 58996 58994 58994 58980 58967 58959 58962 58943
130166E8943Jj4Qq%j7prQqno%JKJ2omM%qjnJoR%%qQj0J4J2oJ6Q%RPK7nOMJ4OJ2
137833E8999O%oJ2rJ3r%RrMLrNpokKmnj2J1oJ%omMj3j9J6%j7J1oJnK0LPJ7M0K6
144999E9056K6L4N7M6N7O4Q5O6Q8P4R2P8R0J04Q3Q4R9R7R1Q0Q3Q0P2P3N6R4M4
149483F1053N3K9L3M7K4L4J5J4RLpJ7j4ll0rk3k4l3k2k8l8k8k0m1l6k1m1j6m3
154483F0854j0m5k8j5k3jl2j0oj9Pk6Kj5j4mpJlj5oj5J%j8k5j0j5j9j0k7j6j9
160000F0412k4j8l2j2l1j6k9l1l5l2k1l9k8l4k1l4l1j8l4l7l2l5j9j8l6j6l2l1
164650E9636k5k9Jm3k5j8k0k4j3l0j9j9k9Jj9j1ql2j2j9mj4k1mk4Jj9j0mj0mp
169999E9123j6j1oj2pk4J2k2mlnj0Mk7Kqj1J2j1nlnj6Oj4Qj3J7j3mMlKnLQNJk
$$ plain form
130166 58943 58944 58930 58938 58930 58930 58913 58906 58897 58905 58897 58892 58886 58886 58887 58889 58901 58895 58891 58895 58895 58887 58886 58881 58882 58876 58885 58885 58885 58877 58885 58875 58889 58901 58895 58911 58919 58919 58928 58935 58962 58957 58963 58967 58981 58987 58999
137833 58999 59005 59005 58999 59011 59002 59015 59006 59006 59015 59006 59010 59013 59004 59009 59002 58996 58994 58996 58992 58987 58975 58986 58980 58981 58981 58975 58971 58975 58962 58943 58959 58959 58942 58953 58947 58948 58943 58963 58966 58973 58990 59030 59056
144999 59056 59082 59116 59173 59219 59276 59340 59425 59491 59579 59653 59745 59823 59913 60017 60100 60184 60283 60380 60471 60551 60634 60714 60786 60859 60915 61009 61053
149483 61053 61106 61135 61168 61215 61239 61273 61288 61302 61311 61314 61307 61324 61310 61307 61277 61268 61245 61221 61188 61166 61138 61100 61072 61052 61011 60975 60954 60913 60897 60854
154483 60854 60844 60799 60771 60756 60733 60732 60700 60690 60684 60665 60672 60646 60648 60633 60619 60615 60608 60609 60606 60591 60585 60570 60571 60571 60553 60528 60518 60503 60484 60474 60447 60431 60412
160000 60412 60388 60370 60338 60326 60295 60279 60250 60219 60184 60152 60131 60092 60064 60030 60009 59975 59944 59926 59892 59855 59823 59788 59769 59751 59715 59699 59667 59636
164650 59636 59611 59582 59583 59540 59515 59497 59477 59453 59440 59410 59391 59372 59343 59344 59325 59314 59306 59274 59262 59243 59239 59225 59204 59200 59176 59177 59158 59148 59144 59134 59130 59123
169999 59123 59107 59096 59090 59078 59071 59047 59059 59037 59033 59030 59025 59015 59019 58992 58994 58986 58975 58987 58976 58971 58968 58963 58947 58953 58939 58947 58934 58951 58938 58934 58938 58935 58937 58932 58935 58943 58948 58949 58947
176516E8947%K1pJ4J6J1lJ9K2PJ2K3J9LJ1J3J7J9J3J0J3J6J2J0PJ0%J3LOJRj1
181983E9276JnJ0nj8MjKpk2Qj4Mj8oPkj8%jnj7%Lpj0Pkk0RjqmMm%j1Rj9Pj1%n
189149E9110N%Oj1j3%oOoJ1j7pkJJMnmj4J2nJnqnrNj2lnkj0J0j4rOrj5Roj2km
196350E8967jnnj2oMplKn%J3ppJ0J%MnJ0j3RkJJJ8j8%Rj1K0nNRK0nJ4KK1J0L5
203166E9068LK6K4L3N6M5P0P6Q6R7R8J26J39J76J66J95K24K41K63K74K99L17L20
206983F2422L22L33L46L62L66L32L37L30L14L01L05K64K42K37K22J88J61J64J06
210166F7654P6P5O1M8K0K9J3k8qJ3j9RK5L8Q7J31J72K58L41M35N30O49P90Q60
214150G2259J032J137J333J354J538J673J680J729J983J773K055J943J795K022
$$ plain form
176516 58947 58947 58968 58961 58975 58991 59002 58999 59018 59040 59047 59059 59082 59101 59104 59115 59128 59145 59164 59177 59187 59200 59216 59228 59238 59245 59255 59255 59268 59271 59277 59278 59287 59276
181983 59276 59277 59272 59282 59277 59259 59263 59262 59264 59257 59235 59243 59229 59233 59215 59209 59216 59214 59196 59196 59195 59190 59173 59173 59176 59169 59159 59166 59164 59144 59153 59152 59144 59140 59144 59140 59140 59129 59138 59119 59126 59115 59115 59110
189149 59110 59115 59115 59121 59110 59097 59097 59091 59097 59091 59102 59085 59078 59076 59077 59078 59082 59077 59073 59059 59071 59066 59067 59062 59054 59049 59040 59045 59033 59030 59025 59023 59013 59023 59009 59000 59006 58997 58982 58991 58985 58973 58971 58967
196350 58967 58966 58961 58956 58944 58938 58942 58935 58932 58934 58929 58929 58942 58935 58928 58938 58939 58939 58943 58938 58948 58935 58944 58942 58943 58944 58962 58944 58944 58953 58942 58962 58957 58962 58971 58991 58986 59000 59002 59023 59033 59068
203166 59068 59071 59097 59121 59154 59210 59255 59325 59401 59487 59584 59682 59808 59947 60123 60289 60484 60708 60949 61212 61486 61785 62102 62422
206983 62422 62744 63077 63423 63785 64151 64483 64820 65150 65464 65765 66070 66334 66576 66813 67035 67223 67384 67548 67654
210166 67654 67730 67805 67866 67914 67934 67963 67976 67948 67940 67953 67934 67943 67968 68006 68093 68224 68396 68654 68995 69430 69960 70609 71399 72259
214150 72259 73291 74428 75761 77115 78653 80326 82006 83735 85718 87491 89546 91489 93284 95306
216516I5306J854J775J824J709J595J532J348J205J133J013Q87Q08P55N94M28
219016A13766L63L24N6o3l1k35k58l66n18n91o34n53p46q62q87q77j017j038r63
222149A04870r99j056j152j103j115j042j135j119j126j061j080j260j027j058
224483H9537j027r40j100r92j018q74r55r53q55q31q04q19p46p78p31p35o47o78
227499G4054o43o40n93n54n58n00m89m96m68m57m01m13l79l66l24l29l15k81k44
230666F5604k49k24k05j80j50j32j12r6p4m7j6j0MJL8O7P2O5P3Q3R3J00J16Q9
234649F4910Q7R7P9Q3P6O8N0N2M1L3J7qJ4Lk8m6j4l6m0n9m3n6p7p6p1r7q9j11
239316F4759r9r3j28j14j17j03j07j21j05j24j22j12j29j10j11j06j04j15j29
$$ plain form
216516 95306 97160 98935 100759 102468 104063 105595 106943 108148 109281 110294 111181 111989 112744 113338 113766
219016 113766 114129 114453 114509 114446 114415 114180 113922 113556 113038 112447 111813 111260 110514 109652 108765 107888 106871 105833 104870
222149 104870 103871 102815 101663 100560 99445 98403 97268 96149 95023 93962 92882 91622 90595 89537
224483 89537 88510 87570 86470 85478 84460 83586 82631 81678 80823 79992 79188 78369 77623 76845 76114 75379 74732 74054
227499 74054 73411 72771 72178 71624 71066 70566 70077 69581 69113 68656 68255 67842 67463 67097 66773 66444 66129 65848 65604
230666 65604 65355 65131 64926 64746 64596 64464 64352 64256 64182 64135 64119 64109 64113 64114 64152 64219 64291 64356 64429 64512 64605 64705 64821 64910
234649 64910 64997 65094 65173 65256 65332 65400 65450 65502 65543 65576 65593 65585 65599 65602 65574 65528 65514 65478 65438 65379 65336 65280 65203 65127 65056 64959 64870 64759
239316 64759 64660 64567 64439 64325 64208 64105 63998 63877 63772 63648 63526 63414 63285 63175 63064 62958 62854 62739 62610
242499F2610j02j10j05j09j09j02r3j07j04q7q9r5q4q9p0r6o8q0o9o5r2m1n8o2
246516F0524n8n4n0n5o0n3l7m1m8m5n0l8k2l5m6k8k1l7j6l3l7j5j9k1l5j2j8k9
251183E9511j1k3j2l6k3nj9k4j4qk9%j9ppj2j0j3j4j6pkj7Nk1j4%nqj6nJ0rj5
256816E9105Mpon%j1KmKprnj4Pj3j4mqj9k3j7j1k9OmLJ0J4K3L4O8P9J08J24J55
262666E9534J98K43K92L56M12M80N74O00P14P88Q58R60J003J093J165J205J237
265499G1712J250J310J354J303J305J447J389J377J424J621J486J732J873J874
267833I2457K126K413K591K977L299L779M266M664N184N690O136O641P100P646
270166A56969Q036Q486Q813R227R217R832J0112J0573J0404J0914J0699J0777
$$ plain form
242499 62610 62508 62398 62293 62184 62075 61973 61880 61773 61669 61582 61493 61398 61314 61225 61155 61059 60991 60911 60842 60777 60685 60644 60586 60524
246516 60524 60466 60412 60362 60307 60247 60194 60157 60116 60068 60023 59973 59935 59913 59878 59832 59804 59783 59746 59730 59697 59660 59645 59626 59605 59570 59558 59540 59511
251183 59511 59500 59477 59465 59429 59406 59401 59382 59358 59344 59336 59307 59307 59288 59281 59274 59262 59252 59239 59225 59209 59202 59200 59183 59188 59167 59153 59153 59148 59140 59124 59119 59129 59120 59105
256816 59105 59109 59102 59096 59091 59091 59080 59082 59078 59080 59073 59064 59059 59045 59052 59039 59025 59021 59013 58994 58971 58954 58943 58914 58920 58916 58919 58929 58943 58966 59000 59068 59147 59255 59379 59534
262666 59534 59732 59975 60267 60623 61035 61515 62089 62689 63403 64191 65049 66009 67012 68105 69270 70475 71712
265499 71712 72962 74272 75626 76929 78234 79681 81070 82447 83871 85492 86978 88710 90583 92457
267833 92457 94583 96996 99587 102564 105863 109642 113908 118572 123756 129446 135582 142223 149323 156969
270166 156969 165005 173491 182304 191531 200748 210580 220692 231265 241669 252583 263282 274059
272149B74059J0556J0851J1238J0735J1223J0424J0541J0412J0150R972R281R229
274149C98671R230R039R173Q397Q618P641P156P059O519O018O658N425M177L507
276516D97288L465L544K336J857L60l77q69r15k518l393l949m620n990o810q089
279016D71320p913q189r338r723j0087j0452j1626j1067j1611j2161j1383j1298
281016C46472j1698j1085j0532j1012j0865j0275r673r593r390r113q974p945
282999B26317p784p935p118o810o691o319n935n796n525m998m798m691m493m240
285333A43184m077l696l587l534l372l089l057k886k617k502k344k293k253k151
287666A01726j842j876j814j615j424j579j332j279j102j074r71q41p75o65o18
$$ plain form
272149 274059 284615 295466 306704 317439 328662 339086 349627 360039 370189 380161 389442 398671
274149 398671 407901 416940 426113 434510 443128 450769 457925 464984 471503 477521 484179 489604 493781 497288
276516 497288 500753 504297 506633 508490 508850 508473 507604 506689 504171 500778 496829 492209 486219 479409 471320
279016 471320 463407 455218 445880 436157 426070 415618 403992 392925 381314 369153 357770 346472
281016 346472 334774 323689 313157 302145 291280 281005 271332 261739 252349 243236 234262 226317
282999 226317 218533 210598 203480 196670 189979 183660 177725 171929 166404 161406 156608 151917 147424 143184
285333 143184 139107 135411 131824 128290 124918 121829 118772 115886 113269 110767 108423 106130 103877 101726
287666 101726 99884 98008 96194 94579 93155 91576 90244 88965 87863 86789 85818 84977 84202 83537 82919
290166H2919n46l59k79j53j9QJ14J92K82M06M38M99N43N97N63O46P25O59P48P64
293516H8747P22O11N87O85O25M85M75M53L31L34L14K34K00J28J4Pn2j67j46j64
296816I4423k32l20l76m35n19n65m86n83n92o39o75o27o43o92p97o48p24o76o71
300000H3523p33p61o73o26o82o30o75o27n98o46n72n98n53n58n55n52n12n11m47
303166G2014m62m77m57m40m31l79l83l63l40l73l34l33k91k70k89k82k59k39k53
306349F5359k34k09k23j97j68j93j91j73j43j50j24j56j44j24j24j02j32r5j08
309483F2369r7j05r2r0r3q6q0p7q0o2o6n7o0n6m7k6m5m0k4m1k4j7rMk4lJ1MK2
314316F1009ORK1J2J0k0K%J0j2k3j5mlQrK2nM9J8L5M4L6M5L2L4M2K9L4L9RJ5N
$$ plain form
290166 82919 82373 82014 81735 81582 81563 81571 81685 81877 82159 82565 83003 83502 84045 84642 85205 85851 86576 87235 87983 88747
293516 88747 89469 90080 90667 91352 91977 92462 92937 93390 93721 94055 94369 94603 94803 94931 94945 94952 94900 94733 94587 94423
296816 94423 94191 93871 93495 93060 92541 91976 91490 90907 90315 89676 89001 88374 87731 87039 86242 85594 84870 84194 83523
300000 83523 82790 82029 81356 80730 80048 79418 78743 78116 77518 76872 76300 75702 75149 74591 74036 73484 72972 72461 72014
303166 72014 71552 71075 70618 70178 69747 69368 68985 68622 68282 67909 67575 67242 66951 66681 66392 66110 65851 65612 65359
306349 65359 65125 64916 64693 64496 64328 64135 63944 63771 63628 63478 63354 63198 63054 62930 62806 62704 62572 62477 62369
309483 62369 62272 62167 62075 61985 61892 61806 61726 61649 61569 61507 61441 61384 61324 61268 61221 61195 61150 61110 61086 61045 61021 61004 60995 60999 60975 60972 60983 60987 61009
314316 61009 61015 61024 61045 61057 61067 61047 61049 61049 61059 61047 61024 61009 61005 61002 61010 61001 61023 61018 61067 61085 61120 61164 61200 61245 61277 61311 61353 61382 61416 61455 61464 61479 61484
319816F1484%NJ8LJ1k9j5k8rol1l8k1j9m6l1m3m3k8l4l6m6m3n0m4l7l4n8l8n2
324816F0662m2k6n1l1m5l6m0m8l1m8j8l9l1m8k6m1k5l3l8k9l2l1k2l8k6k3k5k7
329483E9712k1l3k3k0j7l1k2rj6l9qk7k0j0k3jk0k4qk8j2j0rj5k1j2j8Oj4j4j7
334649E9176j3mjoqk%lOJ9L1J5L7K5M9N8N6R2R3J02J05J23J42J58J55J65J81J98
339316F0949J86J87K02K01K24K12K25K14K13J95J98K06J87J99J83J70J51J27J43
342499F4572J26J24J31J08P8P7O7N7P4O1K4L4rJ8QmJ8nqj5k8m3m4n6l0n5n2r3
347149F5135n1p6p4p0q6p7r5p8p4j05p7j04j17j07r6j16q0j02r0j11j13r2j03
351016F3041j15j03q6j15q6j00p4q3p4n4o1n5n1l0l1Kk3K6J9M6N3O2P5P8Q6R9
$$ plain form
319816 61484 61484 61489 61507 61510 61521 61492 61477 61449 61440 61434 61403 61365 61344 61325 61279 61248 61205 61162 61134 61100 61064 61018 60975 60925 60881 60844 60810 60752 60714 60662
324816 60662 60620 60594 60543 60512 60467 60431 60391 60343 60312 60264 60246 60207 60176 60128 60102 60061 60036 60003 59965 59936 59904 59873 59851 59813 59787 59764 59739 59712
329483 59712 59691 59658 59635 59615 59598 59567 59545 59536 59520 59481 59473 59446 59426 59416 59393 59392 59372 59348 59340 59312 59300 59290 59281 59266 59245 59233 59215 59221 59207 59193 59176
334649 59176 59163 59159 59158 59152 59144 59142 59142 59139 59145 59164 59195 59210 59247 59272 59321 59379 59435 59527 59620 59722 59827 59950 60092 60250 60405 60570 60751 60949
339316 60949 61135 61322 61524 61725 61949 62161 62386 62600 62813 63008 63206 63412 63599 63798 63981 64151 64302 64429 64572
342499 64572 64698 64822 64953 65061 65139 65216 65283 65340 65414 65475 65499 65533 65524 65542 65550 65546 65564 65559 65551 65536 65508 65465 65421 65365 65335 65280 65228 65135
347149 65135 65084 65008 64934 64864 64778 64701 64606 64528 64454 64349 64272 64168 64051 63944 63848 63732 63652 63550 63460 63349 63236 63144 63041
351016 63041 62926 62823 62737 62622 62536 62436 62362 62279 62205 62151 62090 62035 61984 61954 61923 61925 61902 61928 61947 61993 62046 62108 62183 62261 62347 62446
355333F2446J11J18J22J30J19J27J21J32J43J17J13J21J17J19J26J34J31J13J09
358516F4769J36J39J44J63K23K30K67L21L87M87N86P32Q72J043J213J409J640
361349G4761J912K118K556K607L002L426L538M072M274M534M798N137N464N656
363683A27855N985O012O323O335O829O808P059P151P459P691P868P740P978P972
366016B27065Q044P988Q313Q452Q522Q555Q097Q801Q566Q510Q198Q061Q401Q684
368349C44257R176Q590Q377Q885R151R391Q690Q301R426Q927Q763Q685Q505R191
370666D68315R297R756Q864Q425Q727R434R747J0073J0059Q426Q578Q898Q464
372833E87063Q450Q294P587R241R110P723Q958R621Q653Q680Q581R243P757Q332
$$ plain form
355333 62446 62557 62675 62797 62927 63046 63173 63294 63426 63569 63686 63799 63920 64037 64156 64282 64416 64547 64660 64769
358516 64769 64905 65044 65188 65351 65574 65804 66071 66392 66779 67266 67852 68584 69456 70499 71712 73121 74761
361349 74761 76673 78791 81347 83954 86956 90382 93920 97992 102266 106800 111598 116735 122199 127855
363683 127855 133840 139852 146175 152510 159339 166147 173206 180357 187816 195507 203375 211115 219093 227065
366016 227065 235109 243097 251410 259862 268384 276939 285036 293837 302403 310913 319111 327172 335573 344257
368349 344257 353433 362023 370400 379285 388436 397827 406517 414818 424244 433171 441934 450619 459124 468315
370666 468315 477612 487368 496232 504657 513384 522818 532565 542638 552697 561123 569701 578599 587063
372833 587063 595513 603807 611394 620635 629745 637468 646426 656047 664700 673380 681961 691204 698961 707293
375166G07293R478Q866J0264R751Q943Q791Q631P984Q466R208Q403Q057P382R297
377499H30814R630Q281R865Q801Q982R731Q359R891O126N932J0036R076Q877P846
379816I52247P549Q347P746P918Q154P392R207P443Q675P641Q917P450O067L626
382149A058379j347j5899o3546j62136k59992k33746j24524m8786j7988p758m677
384016A17980l527l056k756k544k361k278k056k075j817j542j528j500j378j228
386349H8334j179j172j111r10r09r84q17p79p30p04o90n69n54o39m79m77m49m45
389316G4737m46m07l57l32l28k73k46k41k00j61j41j33p5q6o5m5l4j0l3J8J5o
392999G1151l4%l1k6p6p4q8j30j31j43j55j80k06k20k08k29k29k13k50k25k49
$$ plain form
375166 707293 716771 725637 735901 745652 754595 763386 772017 780001 788467 797675 806078 814135 821517 830814
377499 830814 840444 848725 858590 867391 876373 886104 894463 904354 910480 916412 926448 935524 944401 952247
379816 952247 959796 968143 975889 983807 991961 999353 1008560 1016003 1024678 1032319 1041236 1048686 1054753 1058379
382149 1058379 1057032 1041133 977587 815451 555459 321713 197189 148403 130415 122657 117980
384016 117980 114453 111397 108641 106097 103736 101458 99402 97327 95510 93968 92440 90940 89562 88334
386349 88334 87155 85983 84872 83962 83053 82069 81252 80473 79743 79039 78349 77780 77226 76587 76108 75631 75182 74737
389316 74737 74291 73884 73527 73195 72867 72594 72348 72107 71907 71746 71605 71472 71397 71311 71246 71201 71167 71157 71124 71142 71157 71151
392999 71151 71117 71117 71086 71060 70984 70910 70822 70692 70561 70418 70263 70083 69877 69657 69449 69220 68991 68778 68528 68303 68054
396516F8054k44k23k35k20k06j85j93j89j89j95j85j39j42j35j38j24j16j12j35
399649F4749j16j17r0r8q4r0p9r4q3p9q3p6n1q8o1n1o0n6n8m8m7m4m3l6n4l9m7
404150F2877k9n1m3k7m5l1n6m2j5m7k4l0l8m6n4n1m9p2p3p0q5q6j10r5j44j38
408516F1326j35j61j55j61j62j72j72j54j57j47j43j29r1j04p7n6n8l3k0mJ3K0
412150E9068L3N1P4P5J06J23J06J60J73J81J95K44K39K57K84L13L20L34L51L87
415500F3074L73M20M01M25M30M14M09M13L99M05L76L73L47L20K99K55K53J85J92
418683F9763J27Q9P5K0J0no0j00j19j55j88k15k29k47j87k90k54k76k97k68k82
422150F6912k71k87k72k89k91k67k58k55k68k48k48k34k41k19j95k13j74j74j85
$$ plain form
396516 68054 67810 67587 67352 67132 66926 66741 66548 66359 66170 65975 65790 65651 65509 65374 65236 65112 64996 64884 64749
399649 64749 64633 64516 64426 64328 64244 64154 64075 63981 63898 63819 63736 63660 63609 63521 63460 63409 63349 63293 63235 63187 63140 63096 63053 63017 62963 62924 62877
404150 62877 62848 62797 62754 62727 62682 62651 62595 62553 62538 62491 62467 62437 62399 62353 62299 62248 62199 62127 62054 61984 61899 61813 61703 61608 61464 61326
408516 61326 61191 61030 60875 60714 60552 60380 60208 60054 59897 59750 59607 59478 59387 59283 59206 59150 59092 59059 59039 59035 59048 59068
412150 59068 59101 59152 59226 59301 59407 59530 59636 59796 59969 60150 60345 60589 60828 61085 61369 61682 62002 62336 62687 63074
415500 63074 63447 63867 64268 64693 65123 65537 65946 66359 66758 67163 67539 67912 68259 68579 68878 69133 69386 69571 69763
418683 69763 69890 69979 70054 70074 70084 70079 70019 69919 69800 69645 69457 69242 69013 68766 68579 68289 68035 67759 67462 67194 66912
422150 66912 66641 66354 66082 65793 65502 65235 64977 64722 64454 64206 63958 63724 63483 63264 63069 62856 62682 62508 62323
425333F2323j76j59j57j49j53j19j37j33j22j08j00j04q7r6r6q5p8r5o0o9n0q1
429016E9909o2n3m3o3l8m8m4l6m4l4l4l8k7k1l4l3k6j0l9j0k7j7l1j0j1j0j9j4
433683E9033k4j2oj6NJj4MJ0J1oL5J6N4N1O5Q9J11J29J70J98K29K98L50L91M69
438000F1641N53O10P13Q13R20J014J108J240J357J456J647J741J898K011K195
440500H0917K145K453K388K735K607K999K844L079L087L224L175L402L519L589
442833A22163L539L601L466L677L874L832L985L791L691L768L671M183L803L899
445166A74943L928L727L713L697L343L532L544L704L654L540K750K655K864K780
447499B22374K775K589K260J539J413J036R79J30N6n91j294j925k459l081l792
$$ plain form
425333 62323 62147 61988 61831 61682 61529 61410 61273 61140 61018 60910 60810 60706 60619 60523 60427 60342 60264 60169 60109 60040 59990 59909
429016 59909 59847 59794 59751 59688 59650 59602 59558 59522 59478 59444 59410 59372 59345 59324 59290 59257 59231 59221 59182 59172 59145 59128 59097 59087 59076 59066 59047 59033
433683 59033 59009 58997 58991 58975 58980 58981 58967 58971 58981 58992 58986 59021 59037 59091 59142 59207 59296 59407 59536 59706 59904 60133 60431 60781 61172 61641
438000 61641 62194 62804 63517 64330 65250 66264 67372 68612 69969 71425 73072 74813 76711 78722 80917
440500 80917 83062 85515 87903 90638 93245 96244 99088 102167 105254 108478 111653 115055 118574 122163
442833 122163 125702 129303 132769 136446 140320 144152 148137 151928 155619 159387 163058 167241 171044 174943
445166 174943 178871 182598 186311 190008 193351 196883 200427 204131 207785 211325 214075 216730 219594 222374
447499 222374 225149 227738 229998 231537 232950 233986 234965 235095 235151 234560 233266 231341 228882 225801 222009
449999B22009m340n112n985o824p264p553p478p367p424p069o799o551o165n716
452316A30362n217m880m427m077l656l322l108k719k707k295k165k041j763j804
454650H6181j607j366j427j242j228j105j017j033r36q16p98p50p11o67o22n87
457316G0269n54n06n33m56m56m44m02l82l42l43l06l10k99k91k74k39k24k19k01
460500F3488j84k02j66j69j45j57j41j31j47j30j18r5j25r6j03p8r4p8p5q3o5
464016F0906o9p2p1m7o1l8o2n2m1m6n2k5l7n2l9l5j9l3l7k9l3l0l2k6k7k0j4j8
468683E9789k8k7j3j9j3l1j0j3j3j7j9j3k0j4j4j5j3onj8j4j0j9nj3pJj5rmk3
473850E9350kK1k1l4nlLlNk4oKMj5oK%j0Nj4Jonj0Oj5JLj2j6Jj4J2j2j1qKJj3
$$ plain form
449999 222009 217669 212557 206572 199748 192484 184931 177453 170086 162662 155593 148794 142243 136078 130362
452316 130362 125145 120265 115838 111761 108105 104783 101675 98956 96249 93954 91789 89748 87985 86181
454650 86181 84574 83208 81781 80539 79311 78206 77189 76156 75220 74404 73606 72856 72145 71478 70856 70269
457316 70269 69715 69209 68676 68220 67764 67320 66918 66536 66194 65851 65545 65235 64936 64645 64371 64132 63908 63689 63488
460500 63488 63304 63102 62936 62767 62622 62465 62324 62193 62046 61916 61798 61703 61578 61482 61379 61301 61207 61129 61054 60971 60906
464016 60906 60837 60765 60694 60647 60586 60548 60486 60434 60393 60347 60295 60270 60233 60181 60142 60107 60088 60055 60018 59989 59956 59926 59894 59868 59841 59821 59807 59789
468683 59789 59761 59734 59721 59702 59689 59658 59648 59635 59622 59605 59586 59573 59553 59539 59525 59510 59497 59491 59486 59468 59454 59444 59425 59420 59407 59400 59401 59386 59377 59373 59350
473850 59350 59348 59369 59348 59314 59309 59306 59309 59306 59311 59287 59281 59283 59287 59272 59266 59268 59268 59258 59263 59249 59250 59244 59239 59229 59235 59220 59221 59224 59212 59196 59197 59183 59195 59183 59172 59164 59166 59167 59154
480333E9154Mk0rj5m%Jj9j0j1Jj4j5mk4mk5k9Kk4j1k4k0rl9kj6k5j7k0k3j5mj0
486016E8700j9j1j0kj0omj5%J0k1J1j3kRqj0jLj5J3rJ%omLJ2onOJ4J7qO%J9J2
492316E8651J2KK4J2QMJ0KJ6J0JNK0nNJ3oQKOJPn%K%nopQNJnNoJ4j7Ppnjj5Op
499650E8770kPrjkj4L%jqj0M%qNnj5oNpLjqol%oNoJ0j7pNMj2LmjOj0Nj3J2j0p
507150E8648oKqQqNpnpJ1Lj4J1mj1NoJMmolRj0nJ7qljljrQkRMkOqMOj1jM%ql%
515166E8601MjO%krJ9j3LKjLkMmJ0K%J2MoOJ9kJ0KJ4MNK3J0KK2RL0QRL6RJ4J4
521983E8876K9J4L2L5NJ9RL3K0J5J7J1K5J7J6J5KJ6J5nJ8K9nJ3J0PJ3L0J2K4L1
527150E9398K8K0N6K0P9M7O2Q8P1R4J11J01J33J45J48J64J88J86J99K21K42K41
$$ plain form
480333 59154 59158 59138 59129 59114 59110 59110 59111 59092 59082 59071 59072 59058 59043 59039 59015 59011 58986 58957 58959 58935 58924 58900 58880 58871 58832 58830 58814 58789 58772 58752 58729 58714 58710 58700
486016 58700 58681 58670 58660 58658 58648 58642 58638 58623 58623 58633 58612 58623 58610 58608 58617 58609 58599 58598 58601 58586 58599 58590 58591 58591 58585 58581 58584 58596 58590 58585 58591 58605 58622 58614 58620 58620 58639 58651
492316 58651 58663 58665 58689 58701 58709 58713 58723 58725 58741 58751 58752 58757 58777 58772 58777 58790 58784 58792 58794 58800 58801 58808 58803 58803 58805 58805 58800 58794 58787 58795 58800 58801 58796 58801 58795 58809 58792 58799 58792 58787 58786 58771 58777 58770
499650 58770 58768 58775 58766 58765 58763 58749 58752 58752 58751 58743 58733 58737 58737 58729 58734 58729 58714 58708 58713 58706 58709 58708 58700 58694 58691 58691 58685 58690 58684 58694 58677 58670 58675 58679 58667 58670 58666 58665 58671 58661 58666 58653 58665 58655 58648
507150 58648 58642 58644 58636 58644 58636 58641 58634 58629 58622 58633 58636 58622 58633 58629 58618 58623 58617 58618 58622 58618 58612 58609 58618 58608 58603 58620 58612 58609 58608 58605 58604 58595 58603 58601 58610 58614 58612 58618 58610 58614 58620 58609 58608 58612 58612 58604 58601 58601
515166 58601 58605 58604 58610 58610 58608 58599 58618 58605 58608 58610 58609 58612 58610 58614 58610 58620 58622 58622 58634 58638 58632 58638 58657 58655 58665 58667 58681 58685 58690 58713 58723 58725 58747 58756 58786 58794 58803 58839 58848 58862 58876
521983 58876 58905 58919 58951 58986 58991 59010 59019 59052 59072 59087 59104 59115 59140 59157 59173 59188 59190 59206 59221 59216 59234 59263 59258 59271 59281 59288 59301 59331 59343 59367 59398
527150 59398 59426 59446 59502 59522 59601 59648 59710 59798 59869 59963 60074 60175 60308 60453 60601 60765 60953 61139 61338 61559 61801 62042
530850F2042K62K66K79K71L13L05L18L30L09L20L06L17L43L05L31L01K70K83K93
534016F7764K80K50K22K20J93J57J22J38J06P6R0J1mk6m5m0m1r7j32j29j36j44
537666F8835j69j68j90k02k42k05k21k35k16k65k45k71k54k43k34k47k25k36k42
540850F4525k15k11k14k02j93k06j90j99j87j56j77j66j58j59j41j33j22j36j21
544016F1239j19j09j05j06r2r8q6r5q2o8q4p3o8o9o8n4n1p3l1m8n5m7m3l2l9l8
548350E9406m8j4m9l6j4l8l5rk5k7k8j1l3k1pj5k0j9mj4j9k8%j0j4j2q%k4Lj8
553516E8809Orj6k2J4k4Pj8Kj2j2%njJKj8Mkj0knj0NqN%olj1%%j4M%Mrj7J0nn
560333E8629j2PLj5OoKj0NJ4k0KM%oOnOpnNNj7J3%j3jOPpj%rNKLnNQj1%lRlRj4
$$ plain form
530850 62042 62304 62570 62849 63120 63433 63738 64056 64386 64695 65015 65321 65638 65981 66286 66617 66918 67188 67471 67764
534016 67764 68044 68294 68516 68736 68929 69086 69208 69346 69452 69528 69618 69629 69625 69599 69554 69514 69473 69376 69244 69115 68979 68835
537666 68835 68666 68498 68308 68106 67864 67659 67438 67203 66987 66722 66477 66206 65952 65709 65475 65228 65003 64767 64525
540850 64525 64310 64099 63885 63683 63490 63284 63094 62895 62708 62552 62375 62209 62051 61892 61751 61618 61496 61360 61239
544016 61239 61120 61011 60906 60800 60708 60610 60524 60429 60347 60279 60195 60122 60054 59985 59917 59863 59812 59739 59708 59660 59605 59558 59515 59483 59444 59406
548350 59406 59358 59344 59295 59259 59245 59207 59172 59163 59138 59111 59083 59072 59039 59018 59011 58996 58976 58957 58953 58939 58920 58892 58892 58882 58868 58856 58848 58848 58824 58827 58809
553516 58809 58815 58806 58790 58768 58782 58758 58765 58747 58749 58737 58725 58725 58720 58719 58720 58722 58704 58708 58706 58696 58694 58689 58679 58684 58676 58681 58681 58675 58672 58661 58661 58661 58647 58651 58651 58655 58646 58629 58639 58634 58629
560333 58629 58617 58624 58627 58612 58618 58612 58614 58604 58609 58623 58603 58605 58609 58609 58603 58609 58604 58610 58603 58598 58603 58608 58591 58604 58604 58591 58590 58596 58603 58596 58595 58595 58586 58591 58593 58596 58591 58596 58604 58593 58593 58590 58599 58596 58605 58591
568000E8591J2kkMj9J1LlkJ1j8J3qklJ3jnlNJ0j6KNn%P%%pKKkj8K0j4%J0Kj6P
574816E8584PNj1NmMoJ4qQJROkJ1j1J0J1J5PJ7J3OJ9K8OJ4K9L1K1M7K8M9K9O0
580666E9052M7O2P2M9O8P2P6O9R7P6Q6P2R1R1P9J00Q8P6O8P9R2O5Q1M9N3O7L3
585166F1010M4M1K6J4K2J7PJ9nj2j4j1j1l1k0l9j7l6m8m3k6n5m6l7n4m2m4m3n8
590000F0508m7l7n0n7n2n1n4m1l1o0m1m0n0o6k3m9l8l0l7l4m1l4m5k8l6k4k4k5
594650E9363k8k8k6l2k3j4l0j5k9j7k2l2j8ok7j6j8%k3nj2%j3j1j3j4oOj1nj2
599816E8863Lj8JRmnLJ6j1OK4jrK3NjMQRRJ0MRNnKJ3mJ7%lRmLmjj2J2j0lmnj2
606983E8951Ljj1nO%j4nnjj7rNoj0%j0rqk4Lokk2kj4pnk3j3%nj4j0pNj7njoj4
$$ plain form
568000 58591 58603 58601 58599 58603 58584 58595 58598 58595 58593 58604 58586 58599 58591 58589 58586 58599 58598 58593 58590 58595 58605 58589 58591 58596 58591 58591 58598 58598 58598 58591 58593 58595 58593 58575 58595 58581 58581 58591 58593 58577 58584
574816 58584 58591 58596 58585 58590 58586 58590 58584 58598 58590 58598 58599 58608 58614 58612 58623 58612 58622 58633 58648 58655 58672 58685 58691 58710 58738 58744 58758 58787 58818 58839 58886 58914 58963 58992 59052
580666 59052 59099 59161 59233 59282 59350 59422 59498 59567 59664 59740 59826 59898 59989 60080 60159 60259 60347 60423 60491 60570 60662 60727 60808 60857 60910 60977 61010
585166 61010 61054 61095 61121 61135 61157 61174 61181 61200 61195 61183 61169 61158 61147 61116 61096 61057 61040 61004 60956 60913 60887 60832 60786 60749 60695 60653 60609 60566 60508
590000 60508 60461 60424 60374 60317 60265 60214 60160 60119 60088 60028 59987 59947 59897 59831 59808 59759 59721 59691 59654 59620 59579 59545 59500 59472 59436 59412 59388 59363
594650 59363 59335 59307 59281 59249 59226 59212 59182 59167 59138 59121 59099 59067 59049 59043 59016 59000 58982 58982 58959 58954 58942 58942 58929 58918 58905 58891 58885 58891 58880 58875 58863
599816 58863 58866 58848 58849 58858 58854 58849 58852 58868 58857 58863 58887 58886 58877 58900 58905 58904 58908 58916 58925 58934 58944 58948 58957 58962 58957 58959 58972 58968 58985 58985 58982 58991 58987 58990 58986 58985 58973 58985 58975 58972 58968 58963 58951
606983 58951 58954 58953 58942 58937 58943 58943 58929 58924 58919 58918 58901 58892 58897 58891 58881 58881 58871 58862 58854 58830 58833 58827 58825 58803 58801 58787 58780 58775 58752 58739 58739 58734 58720 58710 58703 58708 58691 58686 58685 58679 58665
613850E8665Pj5j1Kj4%j0QqLj2LllLlLjJ%Kk%nNjnLqrQkj0M%n%nomJ1jnRj2L%
621649E8580J1j1lK1Nj2j1%MnJNMlk%Oj5MJrORknmMmNRmnK3j4RLMkNj2NJ6pJ2
629016E8622j7R%%J3j0pJ9orMJ5mkmjJ1jj5J1njn%nOMj2J3j3kJj0lQjNJnlnJ3
636016E8609j3L%Oj2LnnL%%JQj2oOolQqkO%%J4j6%J2oNj1KojJ%k%OPooNrPrkQ
644016E8574%%%J2k0QO%jkkj%LmJoNKj0OQj3J5omnJ9j7J1nlRj0MOoJ9k2Kj3J4
651016E8574%%JrPQj6J4j1PkpKLpOmM%kL%nMnLrJNnj3RoJ4lpj0OJ8r%Pnj4J8J
658683E8566j0LnJ4m%mOnpKj%J1j4lPjNk3J3Knj0NjjK1j7krRKrJOrJ1pjjNKon
666183E8531J3%j1J3JpnmjkJ2j2QnRrMRlq%MMmMjrJ3mOMqnJ3MkkKlPLplJMJMj2
$$ plain form
613850 58665 58672 58657 58646 58648 58634 58634 58624 58632 58624 58627 58615 58618 58615 58612 58615 58612 58615 58614 58615 58615 58617 58615 58615 58610 58615 58614 58609 58612 58604 58595 58603 58601 58591 58595 58595 58590 58590 58585 58579 58575 58586 58585 58580 58589 58577 58580 58580
621649 58580 58591 58580 58577 58598 58603 58591 58580 58580 58584 58579 58580 58585 58589 58586 58584 58584 58590 58575 58579 58580 58571 58577 58586 58584 58579 58575 58579 58575 58580 58589 58585 58580 58603 58589 58598 58601 58605 58603 58608 58596 58601 58617 58610 58622
629016 58622 58605 58614 58614 58614 58627 58617 58610 58629 58623 58614 58618 58633 58629 58627 58623 58622 58633 58632 58617 58628 58623 58622 58617 58617 58612 58618 58622 58610 58623 58610 58608 58609 58599 58596 58604 58603 58608 58609 58604 58601 58596 58609
636016 58609 58596 58599 58599 58605 58593 58596 58591 58586 58589 58589 58589 58590 58598 58586 58580 58586 58580 58577 58585 58577 58575 58581 58581 58581 58595 58579 58579 58591 58585 58590 58579 58581 58575 58574 58575 58575 58573 58573 58579 58586 58580 58574 58579 58570 58577 58568 58566 58574
644016 58574 58574 58574 58574 58586 58566 58574 58580 58580 58579 58577 58575 58574 58574 58577 58573 58574 58568 58573 58575 58565 58571 58579 58566 58581 58575 58571 58566 58585 58568 58579 58574 58571 58580 58570 58574 58580 58574 58593 58571 58573 58560 58574
651016 58574 58574 58574 58575 58566 58573 58581 58565 58579 58568 58575 58573 58566 58568 58571 58564 58570 58566 58570 58570 58568 58571 58571 58566 58570 58565 58568 58559 58560 58565 58560 58547 58556 58550 58564 58561 58554 58544 58550 58568 58559 58559 58566 58561 58547 58565 58566
658683 58566 58556 58559 58554 58568 58564 58564 58560 58566 58561 58554 58556 58555 58555 58566 58552 58549 58556 58555 58560 58537 58550 58552 58547 58537 58542 58541 58540 58561 58544 58542 58533 58542 58544 58535 58536 58542 58533 58544 58537 58536 58535 58540 58542 58536 58531
666183 58531 58544 58544 58533 58546 58547 58540 58535 58531 58530 58528 58540 58528 58536 58531 58540 58531 58535 58544 58541 58533 58533 58537 58541 58537 58541 58540 58531 58544 58540 58546 58550 58542 58537 58550 58554 58552 58550 58552 58549 58556 58559 58552 58549 58550 58554 58555 58559 58547
674150E8547jMNJkmJ4j2j1QJ%j0J4k4OOo%nllkoK4k0%J4j9lNj4J7Onj0lLokNj7
681183E8492J4loJ5j4OnNpJ0KklLrONKNk2NNPKrPj9J7LolnOpJ2pJn%JPkjoPnp
689016E8492J2krRqkJ4p%oNj1J2j5J0pJRplPNoJ1j0Qj8RlPmjJJQj7LKj2OOkOk
696350E8492J0rJ1j0J2Nj2J9n%J5nJ3JjJ6QjJ1J4RK1kKJ4MJ6NJ8J5J7J7RJ5K7
702150E8771JK3J4K5J4K2J5J4J7K1J9K4J2QOJ8J6K7J9J6J2lK4LRJ7%KNKJ4nj3
707666E9169KJOpqnonklqj8rMk6nrj8jj9j0j3j0k0qj0k3j4j4Kk1j2j9j7Ml5Pj5
714016E8805rj2j3k2Lnoj9j2om%rj5nN%j3j1qj2KQj5mq%Nj0j1Nnjnrr%J4qjj2
720849E8568NrKkqjRj0j2pRNrJNoO%j1kj0Q%Omj6nlQJ1j2j2nJ0LrRoJ%J4j8Oj0
$$ plain form
674150 58547 58546 58550 58555 58556 58554 58550 58564 58552 58541 58549 58550 58550 58540 58554 58530 58536 58542 58536 58536 58531 58528 58525 58523 58517 58541 58521 58521 58535 58516 58513 58518 58504 58521 58527 58522 58512 58509 58512 58506 58504 58509 58492
681183 58492 58506 58503 58497 58512 58498 58504 58499 58504 58497 58507 58509 58507 58504 58507 58498 58504 58509 58511 58516 58494 58499 58504 58511 58513 58504 58511 58492 58509 58512 58506 58503 58498 58504 58497 58509 58502 58503 58498 58498 58499 58506 58504 58503 58497 58504 58499 58492
689016 58492 58504 58502 58493 58502 58494 58492 58506 58499 58499 58493 58498 58487 58499 58484 58494 58487 58488 58497 58490 58487 58494 58499 58493 58504 58494 58502 58484 58493 58490 58497 58493 58492 58493 58494 58502 58485 58488 58490 58478 58484 58490 58488 58494 58492
696350 58492 58502 58493 58504 58494 58506 58511 58499 58518 58513 58513 58528 58523 58536 58537 58536 58552 58560 58559 58570 58584 58593 58614 58612 58614 58628 58632 58648 58653 58671 58686 58703 58720 58729 58744 58771
702150 58771 58772 58795 58809 58834 58848 58870 58885 58899 58916 58937 58956 58980 58992 59000 59006 59024 59040 59067 59086 59102 59114 59111 59135 59138 59147 59164 59164 59166 59171 59173 59187 59182 59169
707666 59169 59171 59172 59178 59171 59163 59158 59152 59147 59145 59142 59134 59116 59107 59111 59085 59080 59071 59053 59052 59033 59023 59010 59000 58980 58972 58962 58939 58925 58911 58913 58892 58880 58861 58844 58848 58813 58820 58805
714016 58805 58796 58784 58771 58749 58752 58747 58741 58722 58710 58704 58700 58700 58691 58676 58671 58676 58676 58663 58652 58644 58632 58634 58642 58627 58623 58615 58615 58620 58610 58599 58604 58599 58598 58593 58584 58575 58575 58589 58581 58580 58568
720849 58568 58573 58564 58566 58564 58556 58555 58564 58554 58542 58535 58544 58549 58540 58541 58546 58540 58546 58546 58535 58533 58523 58531 58531 58537 58533 58517 58512 58509 58517 58528 58516 58504 58499 58509 58512 58503 58512 58506 58507 58507 58521 58503 58509 58499
728166E8499PJ2r%omkRj3NJojOmkmMJrQnOJoRJj4JKNPj5mjnM%nN%k3K3n%j0J1
736016E8474jKj0Qj7J8qRLqLNlkKPLjJ3mnJ8j2J2j8J5j%NqNPJ4%Lo%J8nK%MNm
743350E8542MRnJ1MJ0mj0J6l%Oj2P%mMj1K1jmNJrJ4j2J4j2%LNj9J1kmnm%j2J1
749999E8565mpmM%j2%%j1KoJ0j4J7%j2nkRnLorLj0NJ%jNmrMlQj0Nj0mqRmMj2J2
757500E8494kJ5j7kOmQnj3jNJNj2PpRLnpO%Lq%nJkpM%Nj2OrJ4nqKKJMklLKnJl
765666E8463rJ5qJ2j4nJ1%j1K0j8jJ3rKPrnljJ0LmMpPKj5NjKNKJ1j4%J0j5J0n
772316E8460RNjlMj5Mj2J9joJ0OmkpK2q%J2nj2J9j0J0LPjLNqJ5nkNJ%NL%kJ8n
779483E8536JNklpK0lj0J2JmrJ2qRj0KrMLlNpkQj%KKrO%n%j3%KKnJJ0oJ%jnrk
$$ plain form
728166 58499 58506 58518 58509 58509 58503 58499 58497 58506 58493 58498 58499 58493 58492 58498 58494 58492 58488 58492 58493 58484 58492 58487 58493 58494 58488 58497 58498 58484 58485 58487 58492 58499 58484 58480 58479 58474 58478 58478 58473 58478 58478 58455 58478 58473 58473 58463 58474
736016 58474 58473 58475 58465 58473 58456 58474 58466 58475 58478 58470 58473 58478 58475 58473 58475 58482 58485 58484 58497 58493 58488 58506 58494 58506 58488 58503 58502 58502 58507 58499 58504 58511 58525 58525 58528 58522 58522 58540 58535 58537 58537 58541 58546 58542
743350 58542 58546 58555 58550 58561 58565 58575 58571 58561 58577 58574 58574 58580 58568 58575 58575 58571 58575 58564 58585 58584 58580 58585 58586 58577 58591 58579 58593 58581 58581 58584 58589 58570 58581 58579 58575 58570 58566 58566 58554 58565
749999 58565 58561 58554 58550 58554 58554 58542 58542 58542 58531 58533 58527 58537 58523 58540 58540 58528 58523 58521 58530 58525 58528 58522 58513 58516 58506 58511 58512 58512 58511 58516 58512 58503 58507 58504 58512 58502 58507 58497 58493 58485 58494 58490 58494 58482 58494
757500 58494 58492 58507 58490 58488 58494 58490 58498 58493 58480 58479 58484 58485 58490 58478 58485 58478 58487 58490 58485 58478 58484 58484 58487 58479 58479 58474 58475 58473 58466 58470 58470 58475 58463 58469 58460 58474 58469 58461 58463 58465 58466 58470 58468 58465 58468 58470 58465 58466 58463
765666 58463 58454 58469 58461 58473 58459 58454 58465 58465 58454 58474 58456 58455 58468 58459 58461 58468 58459 58454 58451 58450 58460 58463 58459 58463 58456 58463 58465 58450 58455 58454 58456 58461 58463 58474 58460 58460 58470 58455 58465 58460
772316 58460 58469 58474 58473 58470 58474 58459 58463 58451 58470 58469 58463 58473 58479 58475 58473 58466 58488 58480 58480 58492 58487 58475 58494 58484 58494 58497 58504 58503 58506 58511 58503 58518 58513 58511 58516 58517 58517 58522 58525 58525 58523 58541 58536
779483 58536 58537 58542 58540 58537 58530 58550 58547 58537 58549 58550 58546 58537 58549 58541 58550 58540 58542 58533 58537 58540 58537 58542 58535 58533 58541 58540 58540 58542 58544 58535 58541 58541 58536 58536 58523 58523 58525 58527 58522 58523 58533 58527 58528 58528 58527 58522 58513 58511
787499E8511KkNnJ0roPLNnOj1J%J0rRrQ%rJ1j2pJ3OpJnoJ%J6MrnRjJrNLljj3R
795333E8513MqM%kpRmMkJj3J7moNJnmRqJ2pj1RlQlMj0oOoj3J3%%Kj1lnQrJ1kj0
803000E8478lLJ0q%%k1J4pj%J4j4J0jj8NPj3Ql%nJ3j3MljjRqmLrJ5mj1K0j5q%
809816E8442lpLMmmlMrJ6mKPj3MpPMk2J3kK2k7KJ0Rn%%NpJ2k1KmNJoJ1noMKj4
817149E8418NLKkMnl%MrRj3PqNJ3j9J1nO%KLnJ6j9Kj0OJ2j7RoKM%j0qJ8Llnj5
824316E8402K1KrJ0MnnLlp%nLrJ0qKJ1mjoPMnnJ1j0J0nL%J0k4J6oJ0kj2K4j5N
831183E8422kOlLm%%R%nqnNJ4kmONj1%J3j6LmMNolLLKklNOJNpOmMQkMMj8J7%R
839316E8463Kr%J3j3J7ljJMj1J5OnjKMoRlJ%KkLNn%Mj0J7kj0J2oNnNm%pj2J7%
$$ plain form
787499 58511 58513 58511 58516 58511 58521 58512 58506 58513 58516 58521 58516 58522 58511 58512 58512 58522 58513 58522 58513 58521 58521 58512 58523 58511 58504 58517 58523 58516 58517 58512 58506 58507 58507 58523 58527 58518 58513 58522 58521 58522 58513 58518 58521 58518 58517 58504 58513
795333 58513 58517 58509 58513 58513 58511 58504 58513 58509 58513 58511 58512 58499 58516 58512 58506 58511 58512 58507 58503 58512 58504 58516 58509 58498 58507 58504 58512 58509 58513 58503 58497 58503 58497 58484 58497 58497 58497 58499 58488 58485 58480 58488 58479 58490 58488 58478
803000 58478 58475 58478 58488 58480 58480 58480 58459 58473 58466 58465 58465 58479 58465 58475 58474 58456 58461 58468 58455 58463 58460 58460 58455 58468 58455 58459 58456 58455 58454 58463 58455 58451 58454 58445 58460 58456 58445 58465 58450 58442 58442
809816 58442 58439 58432 58435 58439 58435 58431 58428 58432 58423 58439 58435 58437 58444 58431 58435 58428 58435 58439 58417 58430 58428 58450 58423 58425 58435 58444 58439 58439 58439 58444 58437 58449 58428 58430 58426 58431 58432 58426 58437 58432 58426 58430 58432 58418
817149 58418 58423 58426 58428 58426 58430 58425 58422 58422 58426 58417 58426 58413 58420 58412 58417 58430 58411 58422 58417 58423 58423 58425 58428 58423 58439 58420 58422 58412 58418 58430 58413 58422 58416 58418 58422 58422 58412 58404 58422 58425 58422 58417 58402
824316 58402 58423 58425 58416 58426 58430 58425 58420 58423 58420 58413 58413 58408 58411 58402 58412 58404 58406 58417 58413 58412 58406 58413 58417 58412 58407 58418 58408 58418 58413 58416 58416 58426 58402 58418 58412 58422 58420 58408 58432 58417 58422
831183 58422 58420 58426 58423 58426 58422 58422 58422 58431 58431 58426 58418 58413 58418 58432 58430 58426 58432 58437 58426 58426 58439 58423 58426 58422 58426 58431 58425 58422 58425 58428 58430 58428 58425 58430 58436 58437 58442 58435 58441 58437 58441 58449 58447 58451 58455 58437 58454 58454 58463
839316 58463 58465 58456 58456 58469 58456 58473 58470 58469 58470 58474 58463 58478 58484 58479 58478 58480 58484 58478 58487 58484 58485 58485 58487 58485 58488 58493 58488 58488 58492 58482 58499 58497 58487 58499 58493 58498 58493 58498 58494 58494 58487 58475 58492 58492
846649E8492J%onKMlKJqjJ1%lp%kj0J2kqkNJMqnLrJj1K4j9Nj8JNqJ0nkKrMJ1j4
854316E8436QrlrLRj8QLlOoj2MmkJjNj4MOj%pMQlj2%LnjQKkmK%Qj6J2plkJ5mn
862316E8402oLNPnPj1jLKmNMl%pJ1Oj0RLq%JLqLJQqmJ0KmrJ5mPj4J5mLlkN%LR
870333E8437oJJ0j7J1mpJ1JPkj2OJ5j0nqPJ5j8oJ1pJ5rJ%pPnjJ3j6Rj5J0k%k%
876983E8428lJNnj8J5Lk0PNj0pJoQkK%Lj%KkmNlj2P%Pp%Qj1LLj%NnrO%kQlNKj
885166E8407nj4J1N%%j1J3KLJqRkOj0J0j5R%J2j2%OoOQJ1nJpLPJ4j8J3J1j0OL
891816E8454lmRMJNlJ6rmjMRlNkPj6OpJ2knKRkLo%rJ5omJ2j3J0j1JJNpj2J2np
899316E8461MLqJ%oJ0JnPpNj0%J8k4OjOpRmqM%Oj0J7j9J2oONj1jPPj4JJ5k9J4
$$ plain form
846649 58492 58493 58493 58487 58482 58484 58488 58485 58487 58488 58480 58479 58490 58490 58487 58480 58480 58478 58468 58480 58478 58470 58468 58473 58474 58478 58470 58465 58468 58459 58460 58449 58473 58454 58459 58441 58442 58447 58439 58449 58444 58442 58444 58435 58439 58450 58436
854316 58436 58444 58435 58432 58423 58426 58435 58417 58425 58428 58425 58431 58425 58413 58417 58413 58411 58412 58411 58416 58402 58406 58412 58411 58411 58404 58408 58416 58413 58401 58401 58404 58399 58398 58406 58408 58406 58402 58404 58404 58412 58396 58408 58401 58398 58396 58411 58407 58402
862316 58402 58396 58399 58404 58411 58406 58413 58402 58401 58404 58406 58402 58407 58411 58408 58408 58401 58412 58418 58408 58417 58420 58412 58412 58413 58416 58408 58411 58412 58420 58412 58408 58418 58420 58416 58407 58422 58418 58425 58411 58426 58422 58425 58422 58420 58425 58425 58428 58437
870333 58437 58431 58432 58442 58425 58436 58432 58425 58436 58437 58444 58442 58430 58436 58451 58441 58436 58428 58435 58450 58432 58426 58437 58430 58445 58436 58437 58437 58430 58437 58432 58431 58444 58428 58437 58422 58432 58430 58430 58428 58428
876983 58428 58425 58426 58431 58426 58408 58423 58426 58406 58413 58418 58408 58401 58402 58396 58404 58402 58404 58404 58407 58406 58406 58408 58406 58402 58407 58404 58392 58399 58399 58406 58399 58399 58407 58396 58399 58402 58401 58401 58406 58401 58392 58398 58398 58396 58404 58401 58406 58408 58407
885166 58407 58402 58388 58399 58404 58404 58404 58393 58406 58408 58411 58412 58404 58413 58411 58417 58407 58417 58402 58411 58411 58423 58411 58411 58417 58411 58417 58425 58436 58431 58432 58425 58428 58435 58449 58431 58444 58455 58445 58451 58454
891816 58454 58451 58447 58456 58460 58461 58466 58463 58479 58470 58466 58465 58469 58478 58475 58480 58478 58485 58469 58475 58468 58480 58478 58473 58475 58484 58482 58485 58479 58479 58470 58485 58479 58475 58487 58474 58484 58473 58474 58475 58480 58473 58461 58473 58468 58461
899316 58461 58465 58468 58460 58461 58461 58455 58465 58466 58461 58468 58461 58466 58456 58456 58474 58450 58456 58455 58461 58454 58463 58459 58451 58455 58455 58461 58451 58468 58449 58461 58455 58461 58466 58455 58454 58461 58468 58454 58455 58470 58441 58455
906350E8455J1pn%P%%j4J3mRo%nJ6j1K%j7K4j4NOj5J3rOnJ9nmQj4J0M%n%lnQl
913349E8465Jj1K0k0jJJ8j8JRkpJ7Oj4%j0jlLKjj%%mJj4QNJrjJ0pJ1qlJ0rKj0
920333E8437QomPj4LMr%J0njRj6RoloOj5QJ%jrRlkJ1j0%OpmJkP%ojj2J3jj2%k
928000E8392Rj8J3qMj3J3%PppPmJNJ3j8Rj1JJJ0j0MmPNk%%L%%j3J5nQRMqJ1lJ1
935166E8431oJ1%jJ5nRJmJ9Rj3J4NK6qj3%J4NLNj0J6kPNoQj0J6LkjJnjQpNj2J1
942149E8541L%j4kLNonrJ1oKjJj2Oj0NMrrMj2QJjj0lLj3J2knjj4RJj9J4j4J2p
949150E8461o%jljoNmOj0ORoMKoJ0J0j%L0rJ7K3J2K2K1J6L2K8L3L1K8M6M4O1L5
955333E8939O0N7N9N1O8P1O8O1O3P5O2Q1N4Q0Q7O1O7N5P4O2M3O4N0L4N9N2L9M2
$$ plain form
906350 58455 58466 58459 58454 58454 58461 58461 58461 58447 58460 58456 58465 58459 58459 58454 58470 58459 58461 58461 58444 58468 58454 58459 58465 58450 58463 58454 58460 58455 58474 58469 58465 58473 58459 58469 58473 58473 58468 58468 58465 58460 58468 58465
913349 58465 58466 58455 58475 58455 58454 58455 58473 58455 58456 58465 58463 58456 58473 58479 58465 58465 58455 58454 58451 58454 58456 58455 58454 58454 58454 58450 58451 58437 58445 58450 58451 58442 58441 58451 58444 58455 58447 58444 58454 58445 58447 58437
920333 58437 58445 58439 58435 58442 58428 58431 58435 58426 58426 58436 58431 58430 58439 58423 58432 58426 58423 58417 58423 58408 58416 58417 58417 58416 58407 58416 58413 58411 58422 58412 58412 58418 58411 58407 58408 58406 58413 58413 58407 58406 58394 58407 58406 58394 58394 58392
928000 58392 58401 58383 58396 58388 58392 58379 58392 58392 58399 58392 58385 58392 58388 58389 58394 58407 58389 58398 58387 58388 58389 58399 58389 58393 58389 58396 58401 58399 58399 58399 58402 58402 58402 58389 58404 58399 58407 58416 58420 58412 58423 58420 58431
935166 58431 58425 58436 58436 58435 58450 58445 58454 58455 58451 58470 58479 58466 58480 58485 58511 58503 58490 58490 58504 58509 58512 58517 58507 58523 58521 58528 58533 58527 58535 58525 58541 58544 58542 58541 58542 58537 58536 58544 58537 58542 58530 58541
942149 58541 58544 58544 58530 58528 58531 58536 58530 58525 58516 58527 58521 58523 58522 58523 58511 58517 58507 58512 58516 58507 58498 58502 58490 58498 58499 58498 58488 58485 58488 58475 58487 58485 58480 58479 58465 58474 58475 58456 58470 58456 58468 58461
949150 58461 58455 58455 58454 58451 58450 58444 58449 58445 58451 58441 58447 58456 58450 58454 58456 58450 58460 58470 58469 58469 58499 58490 58507 58530 58542 58564 58585 58601 58633 58661 58694 58725 58753 58799 58843 58904 58939
955333 58939 58999 59056 59115 59166 59234 59305 59373 59434 59497 59572 59634 59715 59769 59849 59936 59997 60064 60119 60193 60255 60298 60362 60412 60446 60505 60557 60596 60638
959999F0638L4M1L8J1M9K4PJ7J3J5J8Ok1J1pNl2Jj7%l7ok2k9%l0l3j2k6l9l3k7
965333F0557l5l2l2k2l3l7l9l4m3k3n2k4j6n0l1k8m1k9n0k4l1l1l1k6l1k4l5l4
969999E9639k4l2l4j8l9l0j3l2l8k1k2k2k4j4k4k4k2rk8k9j6j5k3rk1k2j5j4k3
974816E8982j5qk7j3j4nj9jl8Mj7kk1%j6qnk8j2Pk9%j1rj0Jnk1j4J4rnj0%j6P
980850E8627j3Jnrj1mM%rj3q%qnRmj2J0j7oJ5j7J0j2jJ%j2Kp%%Lj7OQj4%j0K2
987499E8504j6NJ%%pq%QpMJKnpLKpJj8%J4k0RmjmN%j%JNj5RJmLrqJ4RomMmMKj5
995666E8441kLLqQj3J0pJOjnRk2QNNnjj2%RpLK%k
$$ plain form
959999 60638 60672 60713 60751 60762 60811 60835 60842 60859 60872 60887 60905 60911 60890 60901 60894 60899 60867 60868 60851 60851 60814 60808 60786 60757 60757 60727 60694 60682 60656 60617 60584 60557
965333 60557 60522 60490 60458 60436 60403 60366 60327 60293 60250 60227 60175 60151 60135 60085 60054 60026 59985 59956 59906 59882 59851 59820 59789 59763 59732 59708 59673 59639
969999 59639 59615 59583 59549 59531 59492 59462 59449 59417 59379 59358 59336 59314 59290 59276 59252 59228 59206 59197 59169 59140 59124 59109 59086 59077 59056 59034 59019 59005 58982
974816 58982 58967 58959 58932 58919 58905 58900 58881 58880 58842 58846 58829 58827 58806 58806 58790 58782 58777 58749 58737 58744 58715 58715 58704 58695 58685 58686 58681 58660 58646 58660 58651 58646 58636 58636 58620 58627
980850 58627 58614 58615 58610 58601 58590 58586 58590 58590 58581 58568 58560 58560 58552 58547 58556 58552 58540 58550 58533 58527 58542 58525 58535 58523 58522 58523 58523 58511 58513 58506 58506 58506 58509 58492 58498 58506 58492 58492 58482 58504
987499 58504 58488 58493 58494 58494 58494 58487 58479 58479 58487 58480 58484 58485 58487 58482 58475 58478 58480 58473 58474 58456 58456 58470 58450 58459 58455 58454 58450 58455 58455 58454 58454 58455 58460 58445 58454 58455 58451 58454 58445 58437 58451 58460 58454 58450 58454 58450 58454 58456 58441
995666 58441 58439 58442 58445 58437 58445 58432 58442 58435 58436 58442 58441 58436 58445 58423 58431 58436 58441 58436 58435 58423 58423 58432 58425 58428 58430 58430 58428
##END=
