##TITLE= Headspace from passionfruit
##JCAMP-DX= 5.00 $$From Command Line Converter 1.0
##DATA TYPE= GAS CHROMATOGRAPH
##ORIGIN= Dept of Chem, UWI, Mona, JAMAICA
##OWNER= Dr Robert J. Lancashire
##$URL= http://wwwchem.uwimona.edu.jm:1104/software/jcampdx.html
##SPECTROMETER/DATA SYSTEM= HP 5890 GC
##DATE= 11-26-1995
##TIME= 08:51:28
##XUNITS= TIME
##YUNITS= ARBITRARY
##XFACTOR= 2.000700e-005
##YFACTOR= 4.777800e-002
##FIRSTX=   0.000000
##LASTX=  20.01
##NPOINTS= 6004
##MAXY= 95890.000000
##MINY= 48112.000000
##FIRSTY= 48604.000000
##DELTAX=   0.003333
##XYDATA= (X++(Y..Y))
0A017288J25j67J46J05k09K93j89J47j67o3o3M2o3K1O3%k1K09q4j88J67
$$ 1017288 1017413 1017246 1017392 1017497 1017288 1017581 1017392 1017539 1017372 1017309 1017246 1017288 1017225 1017246 1017309 1017309 1017288 1017497 1017413 1017225 1017392
3515A017392o2m2K1J88k93J05J67K1m2q3J04l14q4N45k51K09%k93J25O3k1J05
$$ 1017392 1017330 1017288 1017309 1017497 1017204 1017309 1017476 1017497 1017455 1017372 1017476 1017162 1017078 1017623 1017372 1017581 1017581 1017288 1017413 1017476 1017455 1017560
7147A017560k51J67j04K0J68o3Q4k51J25o3K1j25Q4m2%K30j68q3%q4J47Q3j46
$$ 1017560 1017309 1017476 1017372 1017392 1017560 1017497 1017581 1017330 1017455 1017392 1017413 1017288 1017372 1017330 1017330 1017560 1017392 1017309 1017309 1017225 1017372 1017455 1017309
11012A017309o3K09j25k1O3q4m2O3J67j88j26j88K51O3j47o3Q4%J26o3j05J68
$$ 1017309 1017246 1017455 1017330 1017309 1017372 1017288 1017246 1017309 1017476 1017288 1017162 1016974 1017225 1017288 1017141 1017078 1017162 1017162 1017288 1017225 1017120 1017288
14644A017288l14j05m2K31J67k72J25J47j88J04o3k0L14j68K1q4J05J26l14K30
$$ 1017288 1016974 1016869 1016827 1017058 1017225 1016953 1017078 1017225 1017037 1017141 1017078 1017058 1017372 1017204 1017225 1017141 1017246 1017372 1017058 1017288
17993A017288q4j67%K09O3q4%k1M2j05Q4%l14K30%K1%M2k09J46K1Q4j68J68q4
$$ 1017288 1017204 1017037 1017037 1017246 1017309 1017225 1017225 1017204 1017246 1017141 1017225 1017225 1016911 1017141 1017141 1017162 1017162 1017204 1016995 1017141 1017162 1017246 1017078 1017246 1017162
22142A017162K10o3O3%q4Q4j26k09Q3J05j05%L35M2k93%J05o3%m2J05Q3o2q4
$$ 1017162 1017372 1017309 1017372 1017372 1017288 1017372 1017246 1017037 1017120 1017225 1017120 1017120 1017455 1017497 1017204 1017204 1017309 1017246 1017246 1017204 1017309 1017392 1017330 1017246
26174A017246Q4q4j26M2m2J05o3M2J26M2o3O3K72k52j46k1J67o2k1q4o3M2M2
$$ 1017246 1017330 1017246 1017120 1017162 1017120 1017225 1017162 1017204 1017330 1017372 1017309 1017372 1017644 1017392 1017246 1017225 1017392 1017330 1017309 1017225 1017162 1017204 1017246
29989A017246j05Q4j05J26%k1j67J67O3o3O3k10O3Q4J47j26J26j47J47j68J26
$$ 1017246 1017141 1017225 1017120 1017246 1017246 1017225 1017058 1017225 1017288 1017225 1017288 1017078 1017141 1017225 1017372 1017246 1017372 1017225 1017372 1017204 1017330
33504A017330m2j26%J68j05Q4k51J67Q4j05m2Q4j88K72k1j68o3K10m2J26k31
$$ 1017330 1017288 1017162 1017162 1017330 1017225 1017309 1017058 1017225 1017309 1017204 1017162 1017246 1017058 1017330 1017309 1017141 1017078 1017288 1017246 1017372 1017141
36970A017141%j04q4J25O3j46K51M2j47J05J26k31J05Q4m2K1q4Q4q4o3K93j67
$$ 1017141 1017141 1017037 1016953 1017078 1017141 1016995 1017246 1017288 1017141 1017246 1017372 1017141 1017246 1017330 1017288 1017309 1017225 1017309 1017225 1017162 1017455 1017288
40652A017288m2m2q4L77k93K72k30Q4M2m2j05O3J04k0m2O2L14j25j05O3Q4K1
$$ 1017288 1017246 1017204 1017120 1017497 1017204 1017476 1017246 1017330 1017372 1017330 1017225 1017288 1017392 1017372 1017330 1017392 1017706 1017581 1017476 1017539 1017623 1017644
44301A017644Q3l14K52j26K1J88k1%%j46L35q4m2o3%J68K1j05Q4J46k09k1O3
$$ 1017644 1017727 1017413 1017665 1017539 1017560 1017748 1017727 1017727 1017727 1017581 1017916 1017832 1017790 1017727 1017727 1017895 1017916 1017811 1017895 1018041 1017832 1017811 1017874
48149A017874M2j26J05J04K10j68%%Q4M2l35K09j46J46j25K30K1m19N44M2j67
$$ 1017874 1017916 1017790 1017895 1017999 1018209 1018041 1018041 1018041 1018125 1018167 1017832 1018041 1017895 1018041 1017916 1018146 1018167 1017748 1018292 1018334 1018167
51631A018167q4%O3o3O3O3m2j05J47q4q4J26q4k1J68j05m2J26j26m2J05J67l55
$$ 1018167 1018083 1018083 1018146 1018083 1018146 1018209 1018167 1018062 1018209 1018125 1018041 1018167 1018083 1018062 1018230 1018125 1018083 1018209 1018083 1018041 1018146 1018313 1017958
55480A017958M1q3M2J04k1j46Q3o2J25k09%J26j26Q4m2M2j89%O3o3O3%K1j88
$$ 1017958 1017999 1017916 1017958 1018062 1018041 1017895 1017978 1017916 1018041 1017832 1017832 1017958 1017832 1017916 1017874 1017916 1017727 1017727 1017790 1017727 1017790 1017790 1017811 1017623
59462A017623J67j46o3L77l77Q4Q3j04O2K1q3O2%J26j05%J89j26q4K1J68j05
$$ 1017623 1017790 1017644 1017581 1017958 1017581 1017665 1017748 1017644 1017706 1017727 1017644 1017706 1017706 1017832 1017727 1017727 1017916 1017790 1017706 1017727 1017895 1017790
63144A017790j67K51k30K1j68J26J25k09J88j46m2m2J47j89J89j05J05K51l14
$$ 1017790 1017623 1017874 1017644 1017665 1017497 1017623 1017748 1017539 1017727 1017581 1017539 1017497 1017644 1017455 1017644 1017539 1017644 1017895 1017581
66326A017581K51q4k51K09m1K30O3q4%K1M39J47j05N23K73Q37N44J423J298K386
$$ 1017581 1017832 1017748 1017497 1017706 1017665 1017895 1017958 1017874 1017874 1017895 1018334 1018481 1018376 1018899 1019172 1020009 1020553 1021976 1023274 1025660
69625A025660L035M437O153Q624J1448J4651J8084K1872K7021L0579L5623L8637
$$ 1025660 1028695 1033132 1039285 1047909 1059357 1074008 1092092 1113964 1140985 1171564 1207187 1245824
71624A245824M2802M6067M7009N1154M9981M9939N2660M6465M9228M3723M2321
$$ 1245824 1288626 1334693 1381702 1432856 1482837 1532776 1585436 1631901 1681129 1724852 1767173
73490A767173L9872L4995L3488K8277K4990K1788J8628J5154J1741Q205K679
$$ 1767173 1807045 1842040 1875528 1903805 1928795 1950583 1969211 1984365 1996106 2004311 2006990
75306B006990k365j67J339l077o132p786r523j0131j2411j2558j4086j5112j6346
$$ 2006990 2004625 2004458 2005797 2002720 1996588 1988802 1979279 1969148 1956737 1944179 1930093 1914981 1898635
77472A898635j6849j7121j7455j7686j9089j8628j8125j7937j7791j8523j8209
$$ 1898635 1881786 1864665 1847210 1829524 1810435 1791807 1773682 1755745 1737954 1719431 1701222
79288A701222j7247j7058j5634j4903j6200j5655j3626j4358j2851j2035j1093
$$ 1701222 1683975 1666917 1651283 1636380 1620180 1604525 1590899 1576541 1563690 1551655 1540562
81154A540562j0904j2810j0632j0235j0758r168r774r293r921r690q938q811
$$ 1540562 1529658 1516848 1506216 1495981 1485223 1476055 1466281 1456988 1447067 1437377 1428439 1419628
83137A419628r293r670q539q268q686q163q100r104q393p933q309q037p054p806
$$ 1419628 1410335 1400665 1392126 1383858 1375172 1367009 1358909 1349805 1341412 1333479 1325170 1317133 1310079 1302273
85470A302273p493o886p221o740o279o237n965n442n253n714m438m604m500l956
$$ 1302273 1294780 1287894 1280673 1273933 1267654 1261417 1255452 1250010 1244757 1239043 1234605 1230001 1225501 1221545
87802A221545m102l831l160l705l369l265l349l098l160k952l139k888l454k846
$$ 1221545 1217443 1213612 1210452 1206747 1203378 1200113 1196764 1193666 1190506 1187554 1184415 1181527 1178073 1175227
90135A175227k889k867k784l098k972k930k888k930k889k972k721k888k826k574
$$ 1175227 1172338 1169471 1166687 1163589 1160617 1157687 1154799 1151869 1148980 1146008 1143287 1140399 1137573 1134999
92467A134999k763k637k428k721k470k511k575k365k344k344k135k198k365k177
$$ 1134999 1132236 1129599 1127171 1124450 1121980 1119469 1116894 1114529 1112185 1109841 1107706 1105508 1103143 1100966
94783A100966k113k093j884k114k030j675j904j675j779j988j193j737j780j465
$$ 1100966 1098853 1096760 1094876 1092762 1090732 1089057 1087153 1085478 1083699 1081711 1080518 1078781 1077001 1075536
97116A075536j423j695j277j339j382j360r42j256j151j172r42r63j172r21r42
$$ 1075536 1074113 1072418 1071141 1069802 1068420 1067060 1066118 1064862 1063711 1062539 1061597 1060634 1059462 1058541 1057599
99615A057599q16j005p74q37p33q79r21n86n86n02p33r21o70o06p33n23o70m61
$$ 1057599 1056783 1055778 1055004 1054167 1053434 1052555 1051634 1051048 1050462 1049960 1049227 1048306 1047636 1047030 1046297 1045774 1045104 1044643
102630A044643o69n03n86m39m40m60n86m40m18l56m82n65o69l35k72j05m81o91
$$ 1044643 1043974 1043471 1042885 1042446 1042006 1041546 1040960 1040520 1040102 1039746 1039264 1038699 1038030 1037695 1037423 1037318 1036837 1036146
105629A036146k30m19k72m81l35k72k10m39k51j47l35m39j89l14k51j67n03%j46
$$ 1036146 1035916 1035497 1035225 1034744 1034409 1034137 1033927 1033488 1033237 1033090 1032755 1032316 1032127 1031813 1031562 1031395 1030892 1030892 1030746
108811A030746l35k93j26k93J05l56j67j47j04m2l56k1l77Q4m40j67o3m2j25q4
$$ 1030746 1030411 1030118 1029992 1029699 1029804 1029448 1029281 1029134 1029030 1028988 1028632 1028611 1028234 1028318 1027878 1027711 1027648 1027606 1027481 1027397
112110A027397J26q4j68l13K30j05j46j05j68o27p75q16j005j193j109r84p53
$$ 1027397 1027523 1027439 1027271 1026958 1027188 1027083 1026937 1026832 1026664 1026037 1025262 1024446 1023441 1022248 1021139 1020155 1019402
114959A019402k30k52k72k51J05j26j151j444n65k1j68J05L56Q4L76N03M18Q79
$$ 1019402 1019172 1018920 1018648 1018397 1018502 1018376 1017225 1015781 1015216 1015195 1015027 1015132 1015488 1015572 1015948 1016451 1016869 1017748
117958A017748Q17R00J025J402J298J172J926J653J779J863J758J905J821J695
$$ 1017748 1018565 1019465 1020490 1021892 1023190 1024362 1026288 1027941 1029720 1031583 1033341 1035246 1037067 1038762
120291A038762J926J695J633J527J528J256J068J067J109R42N86P33N02N02J47
$$ 1038762 1040688 1042383 1044016 1045543 1047071 1048327 1049395 1050462 1051571 1052513 1053099 1053832 1054334 1054836 1054983
122790A054983K09k1J47%l35m19k30n86k51n86q16p96o49p53q37o49r42n86j067
$$ 1054983 1055192 1055171 1055318 1055318 1054983 1054564 1054334 1053748 1053497 1052911 1052095 1051299 1050650 1049897 1049060 1048411 1047469 1046883 1045816
125972A045816p75r21r00q58r84p11r63j005p53r42p54p74o49r21q37p53n03q37
$$ 1045816 1045041 1044120 1043220 1042362 1041378 1040667 1039704 1038699 1037946 1037004 1036250 1035476 1034827 1033906 1033069 1032316 1031813 1030976
128971A030976p53o70p75m81p33o48o49n03o69n24n86m18k93o70l77l97o07l77
$$ 1030976 1030223 1029553 1028778 1028297 1027564 1026916 1026267 1025764 1025095 1024571 1023985 1023567 1023274 1022604 1022227 1021830 1021223 1020846
131937A020846m19l76m82k72k30m40l97k52k72k30k30k93k09l35k93q4j26n23
$$ 1020846 1020427 1020051 1019569 1019297 1019067 1018627 1018230 1017978 1017706 1017476 1017246 1016953 1016744 1016409 1016116 1016032 1015906 1015383
134952A015383K1q4m2k93j25j68l34J25q4m18J46k30j05O3k09m2k30K1k1j05o3
$$ 1015383 1015404 1015320 1015278 1014985 1014860 1014692 1014358 1014483 1014399 1013981 1014127 1013897 1013792 1013855 1013646 1013604 1013374 1013395 1013374 1013269 1013206
138468A013206%j04K1j89k51J68k10j04o3m2J05J46o3n02L35k30K09K1l35Q4J67
$$ 1013206 1013206 1013102 1013123 1012934 1012683 1012851 1012641 1012537 1012474 1012432 1012537 1012683 1012620 1012118 1012453 1012223 1012432 1012453 1012118 1012202 1012369
141933A012369k51O3M2j89O3m2q3Q3j04j05K1K30k09q4J68%j26J88j88L77j68
$$ 1012369 1012118 1012181 1012223 1012034 1012097 1012055 1011972 1012055 1011951 1011846 1011867 1012097 1011888 1011804 1011972 1011972 1011846 1012034 1011846 1012223 1012055
145449A012055j25M18k09m2M2Q4Q3q3K51J67O3o3J26K1%J04k0Q3k1M2j67J46J05
$$ 1012055 1011930 1012348 1012139 1012097 1012139 1012223 1012306 1012223 1012474 1012641 1012704 1012641 1012767 1012788 1012788 1012892 1012872 1012955 1012934 1012976 1012809 1012955 1013060
149264A013060m2q4K93%q3M1j25J67j25K1K30l98L14j25j05J67j88M2m2k51J67
$$ 1013060 1013018 1012934 1013227 1013227 1013144 1013185 1013060 1013227 1013102 1013123 1013353 1012955 1013269 1013144 1013039 1013206 1013018 1013060 1013018 1012767 1012934
152779A012934%K1j04k93k1K30j47Q4j05Q4k93k1K51k30%k1k51L35%O3j68K1J89
$$ 1012934 1012934 1012955 1012851 1012558 1012537 1012767 1012620 1012704 1012599 1012683 1012390 1012369 1012620 1012390 1012390 1012369 1012118 1012453 1012453 1012516 1012348 1012369 1012558
156595A012558%O2q3L97q3k31Q4L14%%j46O2K72j67K1J25Q4J26%J25o2K1J46K1
$$ 1012558 1012558 1012620 1012537 1012934 1012851 1012620 1012704 1013018 1013018 1013018 1012872 1012934 1013206 1013039 1013060 1013185 1013269 1013395 1013395 1013520 1013458 1013479 1013625 1013646
160610A013646J46o2O2%%j67J05m2J25O3J68K1q4J25m1%%M1q3M2j26J26k10q3
$$ 1013646 1013792 1013730 1013792 1013792 1013792 1013625 1013730 1013688 1013813 1013876 1014044 1014065 1013981 1014106 1014065 1014065 1014065 1014106 1014023 1014065 1013939 1014065 1013855 1013772
164592A013772J67k51M2m2o3j46m2J88j05j46l14K30j67q4j47k0j47J26K1%q4
$$ 1013772 1013939 1013688 1013730 1013688 1013625 1013479 1013437 1013625 1013520 1013374 1013060 1013290 1013123 1013039 1012892 1012872 1012725 1012851 1012872 1012872 1012788
168107A012788k30J25l14J47k31O3m2j25o3j46Q3M2k30%q4q4k0j26J46%j46j05
$$ 1012788 1012558 1012683 1012369 1012516 1012285 1012348 1012306 1012181 1012118 1011972 1012055 1012097 1011867 1011867 1011783 1011699 1011679 1011553 1011699 1011699 1011553 1011448
171756A011448O3Q4o3j47q3m2L35k30J04Q4j26J26q4j04J04j67Q3K10q4k30J04
$$ 1011448 1011511 1011595 1011532 1011385 1011302 1011260 1011595 1011365 1011469 1011553 1011427 1011553 1011469 1011365 1011469 1011302 1011385 1011595 1011511 1011281 1011385
175271A011385Q4k09j47J05O3%J67j67Q4%k1q4K1k1o3K30K1K1k09j26J47j05K1
$$ 1011385 1011469 1011260 1011113 1011218 1011281 1011281 1011448 1011281 1011365 1011365 1011344 1011260 1011281 1011260 1011197 1011427 1011448 1011469 1011260 1011134 1011281 1011176 1011197
179087A011197K30k51M2k1J05j05J05J67j04k1L55j46k09K09j68%K31k1m2m2K1
$$ 1011197 1011427 1011176 1011218 1011197 1011302 1011197 1011302 1011469 1011365 1011344 1011699 1011553 1011344 1011553 1011385 1011385 1011616 1011595 1011553 1011511 1011532
182602A011532K1j26K1k1o2O2%Q4K1j47O3Q4j47Q4k72K1%K09k09J26k31j04K09
$$ 1011532 1011553 1011427 1011448 1011427 1011365 1011427 1011427 1011511 1011532 1011385 1011448 1011532 1011385 1011469 1011197 1011218 1011218 1011427 1011218 1011344 1011113 1011009 1011218
186451A011218k1Q4l98M2K51j46o3j05j04J88k1q4%o2j47K30K1%%q4J47k1l14
$$ 1011218 1011197 1011281 1010883 1010925 1011176 1011030 1010967 1010862 1010758 1010946 1010925 1010841 1010841 1010779 1010632 1010862 1010883 1010883 1010883 1010799 1010946 1010925 1010611
190266A010611J47%%%K51l14Q4j89K09j25M2J25J05q4j67k1K72O3j47K51K1Q4
$$ 1010611 1010758 1010758 1010758 1010758 1011009 1010695 1010779 1010590 1010799 1010674 1010716 1010841 1010946 1010862 1010695 1010674 1010946 1011009 1010862 1011113 1011134 1011218
193948A011218m2k09Q4J46L14m60K30Q4%q4J88m2J89O3%M1k1J68O3J67%M2K30
$$ 1011218 1011176 1010967 1011051 1011197 1011511 1011051 1011281 1011365 1011365 1011281 1011469 1011427 1011616 1011679 1011679 1011720 1011699 1011867 1011930 1012097 1012097 1012139 1012369
197764A012369Q4Q4Q3o2J25K1K30M2J47O2Q4M2K09K10j05J67O3Q4J67q3K72k1
$$ 1012369 1012453 1012537 1012620 1012558 1012683 1012704 1012934 1012976 1013123 1013185 1013269 1013311 1013520 1013730 1013625 1013792 1013855 1013939 1014106 1014023 1014295 1014274
201446A014274L56k1m2J46j46K51M2J05J46j67K09k1%Q4k31J68O3Q3o2K93l14
$$ 1014274 1014630 1014609 1014567 1014713 1014567 1014818 1014860 1014965 1015111 1014944 1015153 1015132 1015132 1015216 1014985 1015153 1015216 1015299 1015237 1015530 1015216
204928A015216O2M2Q4q4J68%q4%J26j68%K1J47j26k1j05k51m2K52j26m2%M2J26
$$ 1015216 1015278 1015320 1015404 1015320 1015488 1015488 1015404 1015404 1015530 1015362 1015362 1015383 1015530 1015404 1015383 1015278 1015027 1014985 1015237 1015111 1015069 1015069 1015111 1015237
208943A015237l56J88m2J05k30l77J05J67q4q3j05J05O2k93O3q3q4K1j26q4m1
$$ 1015237 1014881 1015069 1015027 1015132 1014902 1014525 1014630 1014797 1014713 1014630 1014525 1014630 1014692 1014399 1014462 1014379 1014295 1014316 1014190 1014106 1014065
212425A014065O2k1k09k1q4K1Q4j88O3q4j47J68K1l35K93j47q3o3k1K1M2%Q3m1
$$ 1014065 1014127 1014106 1013897 1013876 1013792 1013813 1013897 1013709 1013772 1013688 1013541 1013709 1013730 1013395 1013688 1013541 1013458 1013395 1013374 1013395 1013437 1013437 1013520 1013479
216440A013479j68M2K51l35o3k1Q4Q4J88l97K09J05j47j05k1m1J25q4m1%q4J46
$$ 1013479 1013311 1013353 1013604 1013269 1013206 1013185 1013269 1013353 1013541 1013144 1013353 1013458 1013311 1013206 1013185 1013144 1013269 1013185 1013144 1013144 1013060 1013206
220089A013206l14m1q4M2j89Q4K1M2j47j04J25m2k09O3j88K51j47%o3M2k51J05
$$ 1013206 1012892 1012851 1012767 1012809 1012620 1012704 1012725 1012767 1012620 1012516 1012641 1012599 1012390 1012453 1012265 1012516 1012369 1012369 1012306 1012348 1012097 1012202
223771A012202j89o2%K51j47j67M2o3q4%Q4q4K30l14%K1m1J67k30J04j04Q3%q3
$$ 1012202 1012013 1011951 1011951 1012202 1012055 1011888 1011930 1011867 1011783 1011783 1011867 1011783 1012013 1011699 1011699 1011720 1011679 1011846 1011616 1011720 1011616 1011699 1011699 1011616
227753A011616%K1k1j05j46J67j88J25J68m40J05%J46j46M2%m2M2j26%M2J25m1
$$ 1011616 1011616 1011637 1011616 1011511 1011365 1011532 1011344 1011469 1011637 1011197 1011302 1011302 1011448 1011302 1011344 1011344 1011302 1011344 1011218 1011218 1011260 1011385 1011344
231568A011344j26M2J67M2k51O3Q4k1K1O2j25k1O3q4J25J68k72Q4k1J25M2%j46
$$ 1011344 1011218 1011260 1011427 1011469 1011218 1011281 1011365 1011344 1011365 1011427 1011302 1011281 1011344 1011260 1011385 1011553 1011281 1011365 1011344 1011469 1011511 1011511 1011365
235417A011365o3K09j26j25M2Q3Q4M2m2J68M2k10O3J05O2q3j05L35k93O3o3m2
$$ 1011365 1011302 1011511 1011385 1011260 1011302 1011385 1011469 1011511 1011469 1011637 1011679 1011469 1011532 1011637 1011699 1011616 1011511 1011846 1011553 1011616 1011553 1011511
239066A011511K72k30J26J04q4J05j67m2K51q4o3O3J26k72J04Q4%Q4m2k09J25
$$ 1011511 1011783 1011553 1011679 1011783 1011699 1011804 1011637 1011595 1011846 1011762 1011699 1011762 1011888 1011616 1011720 1011804 1011804 1011888 1011846 1011637 1011762
242581A011762K1q4Q4k30%%J46o2q4%M2M2M2K0j67Q4j68O3M2q4M2q4M2j25J67
$$ 1011762 1011783 1011699 1011783 1011553 1011553 1011553 1011699 1011637 1011553 1011553 1011595 1011637 1011679 1011699 1011532 1011616 1011448 1011511 1011553 1011469 1011511 1011427 1011469 1011344 1011511
246730A011511j26m1K09j26m2j25Q4J04%%%k51L14k09J25q3o3Q4Q3j04j68q4K73
$$ 1011511 1011385 1011344 1011553 1011427 1011385 1011260 1011344 1011448 1011448 1011448 1011448 1011197 1011511 1011302 1011427 1011344 1011281 1011365 1011448 1011344 1011176 1011092 1011365
250578A011365%k1j47J05O3O2j46O3j47J88j25K1j47J26M2J25o2j47J26k10M2
$$ 1011365 1011365 1011344 1011197 1011302 1011365 1011427 1011281 1011344 1011197 1011385 1011260 1011281 1011134 1011260 1011302 1011427 1011365 1011218 1011344 1011134 1011176
254061A011176J68Q3m81M39k93K10m2M2j89Q4k1j46k1J88o3j04J46j67K51k30
$$ 1011176 1011344 1011427 1010946 1011385 1011092 1011302 1011260 1011302 1011113 1011197 1011176 1011030 1011009 1011197 1011134 1011030 1011176 1011009 1011260 1011030
257409A011030j68J47J04j04J88k30J25q3%K1j68O3J05o3O3o3l35K30K1j88J46
$$ 1011030 1010862 1011009 1011113 1011009 1011197 1010967 1011092 1011009 1011009 1011030 1010862 1010925 1011030 1010967 1011030 1010967 1010632 1010862 1010883 1010695 1010841
260925A010841k09q4Q4q4J26J05l98J67q3J67M2K1o3j05%J47k30Q3K1Q4j05j46
$$ 1010841 1010632 1010548 1010632 1010548 1010674 1010779 1010381 1010548 1010465 1010632 1010674 1010695 1010632 1010527 1010527 1010674 1010444 1010527 1010548 1010632 1010527 1010381
264557A010381K93%Q4k10M2Q4J05k73J26J47l14L76l14Q4J88l76K93j89J89m2
$$ 1010381 1010674 1010674 1010758 1010548 1010590 1010674 1010779 1010506 1010632 1010779 1010465 1010841 1010527 1010611 1010799 1010423 1010716 1010527 1010716 1010674
267906A010674Q4o3k1Q4Q3q3q4J25K31j89Q4%M2O3L14l35j68%o2J88j05K30Q4
$$ 1010674 1010758 1010695 1010674 1010758 1010841 1010758 1010674 1010799 1011030 1010841 1010925 1010925 1010967 1011030 1011344 1011009 1010841 1010841 1010779 1010967 1010862 1011092 1011176
271721A011176J26q4J26J25m2q3J25%Q4J67m1j68J68k52J26J46j46J46j67J88
$$ 1011176 1011302 1011218 1011344 1011469 1011427 1011344 1011469 1011469 1011553 1011720 1011679 1011511 1011679 1011427 1011553 1011699 1011553 1011699 1011532 1011720
275070A011720O3q4j46K51j67q4j05J47M2%l35k1J67j04m2Q3j67k1K1m2Q4q4%
$$ 1011720 1011783 1011699 1011553 1011804 1011637 1011553 1011448 1011595 1011637 1011637 1011302 1011281 1011448 1011344 1011302 1011385 1011218 1011197 1011218 1011176 1011260 1011176 1011176
278919A011176j46O2j46J67K1j88J67l14J26K1O3k30j05K51o3k51L35j88j47K72
$$ 1011176 1011030 1011092 1010946 1011113 1011134 1010946 1011113 1010799 1010925 1010946 1011009 1010779 1010674 1010925 1010862 1010611 1010946 1010758 1010611 1010883
282217A010883k93Q4k93J46%%K1j25K51l14J46l14K52o3k1%%%Q4k1Q3l14J68k1
$$ 1010883 1010590 1010674 1010381 1010527 1010527 1010527 1010548 1010423 1010674 1010360 1010506 1010192 1010444 1010381 1010360 1010360 1010360 1010360 1010444 1010423 1010506 1010192 1010360 1010339
286249A010339J26J25k09j89L56m2m1M1J68J05j68Q4J46J26J46k1J05K51Q4L56
$$ 1010339 1010465 1010590 1010381 1010192 1010548 1010506 1010465 1010506 1010674 1010779 1010611 1010695 1010841 1010967 1011113 1011092 1011197 1011448 1011532 1011888
289548A011888K09M2L98K30K1N65J88L98L35J88N03M18M19k1P11%L77M61L14J67
$$ 1011888 1012097 1012139 1012537 1012767 1012788 1013353 1013541 1013939 1014274 1014462 1014965 1015383 1015802 1015781 1016492 1016492 1016869 1017330 1017644 1017811
292897A017811J88M19M2O07j89J05J68J67K30J26j89L14%m1O2j67j68q3o3q4j67
$$ 1017811 1017999 1018418 1018460 1019067 1018878 1018983 1019151 1019318 1019548 1019674 1019485 1019799 1019799 1019758 1019820 1019653 1019485 1019402 1019339 1019255 1019088
296412A019088K51j88j05j26n23k1j46K1l77k09j26k51l14%l14%l56j05k30k72
$$ 1019088 1019339 1019151 1019046 1018920 1018397 1018376 1018230 1018251 1017874 1017665 1017539 1017288 1016974 1016974 1016660 1016660 1016304 1016199 1015969 1015697
299711A015697j67M2k94j25l56%q4k51j67j47O3l14%j05j46j67k1j89k09Q4k10
$$ 1015697 1015530 1015572 1015278 1015153 1014797 1014797 1014713 1014462 1014295 1014148 1014211 1013897 1013897 1013792 1013646 1013479 1013458 1013269 1013060 1013144 1012934
303243A012934K1K1J47K1m2K72K30J05L35L14O90N03P32P54R21R62J256J089J486
$$ 1012934 1012955 1012976 1013123 1013144 1013102 1013374 1013604 1013709 1014044 1014358 1015048 1015551 1016283 1017037 1017958 1018920 1020176 1021265 1022751
306409A022751J507J527J696J967J842J967J717J863K155J968J883J884J737J675
$$ 1022751 1024258 1025785 1027481 1029448 1031290 1033257 1034974 1036837 1038992 1040960 1042843 1044727 1046464 1048139
308741A048139J946J298J340J297J298J046R63J026N23L98N23L98M18j46k93J67
$$ 1048139 1050085 1051383 1052723 1054020 1055318 1056364 1057327 1058353 1058876 1059274 1059797 1060195 1060613 1060467 1060174 1060341
311407A060341j46j89n65n86l35j025o70p96r20p54p53j173q37q79o28j255q80
$$ 1060341 1060195 1060006 1059441 1058855 1058520 1057495 1056825 1056029 1055109 1054355 1053602 1052429 1051592 1050713 1050085 1048830 1047950
314206A047950j004j047q58q58j130p54j214o69j089p11r63j068q58p11j026p74
$$ 1047950 1046946 1045899 1045041 1044183 1043053 1042299 1041085 1040416 1039327 1038616 1037653 1036585 1035727 1035016 1033990 1033216
316872A033216q38r00o69r42n44p12o49q58n65l56o07n65l98p95l77k51o91l55
$$ 1033216 1032378 1031478 1030809 1029867 1029323 1028611 1027962 1027104 1026539 1026183 1025576 1025011 1024613 1023818 1023441 1023190 1022499 1022144
319888A022144l98n02k52l14n02q4l34n24j88k30l98m2m81O3l35j47j67l35k30
$$ 1022144 1021746 1021244 1020992 1020678 1020176 1020092 1019758 1019234 1019046 1018816 1018418 1018376 1017895 1017958 1017623 1017476 1017309 1016974 1016744
323053A016744j05Q4j05l35j25j89%j04q4j68k30o3K10k52J89q4j67%K1k10j25
$$ 1016744 1016639 1016723 1016618 1016283 1016158 1015969 1015969 1015865 1015781 1015613 1015383 1015320 1015530 1015278 1015467 1015383 1015216 1015216 1015237 1015027 1014902
326535A014902K51k09%K1k1m2j26%o3o2M1o2O2K1O3m2q3k1j47O3j05J26j05j46
$$ 1014902 1015153 1014944 1014944 1014965 1014944 1014902 1014776 1014776 1014713 1014651 1014692 1014630 1014692 1014713 1014776 1014734 1014651 1014630 1014483 1014546 1014441 1014567 1014462 1014316
330550A014316%J25j25O3K0k51O3K1m2Q4j26O3J05j89%K1k1j67o3q4O3k1J26q4
$$ 1014316 1014316 1014441 1014316 1014379 1014399 1014148 1014211 1014232 1014190 1014274 1014148 1014211 1014316 1014127 1014127 1014148 1014127 1013960 1013897 1013813 1013876 1013855 1013981 1013897
334532A013897J47k72%m2K93j68j25q4J67j25j26J47j47Q4Q4m2q4K1k1o3o2O2
$$ 1013897 1014044 1013772 1013772 1013730 1014023 1013855 1013730 1013646 1013813 1013688 1013562 1013709 1013562 1013646 1013730 1013688 1013604 1013625 1013604 1013541 1013479 1013541
338231A013541k1k93L14j88M2J25k93J68k72q4K51j67J04j04Q3j88q4j25J67q4
$$ 1013541 1013520 1013227 1013541 1013353 1013395 1013520 1013227 1013395 1013123 1013039 1013290 1013123 1013227 1013123 1013206 1013018 1012934 1012809 1012976 1012892
341530A012892q3M2j26K09k51j67j47L14m60J46j04M1M2M2k51m2%%m2M2j67j26
$$ 1012892 1012809 1012851 1012725 1012934 1012683 1012516 1012369 1012683 1012223 1012369 1012265 1012306 1012348 1012390 1012139 1012097 1012097 1012097 1012055 1012097 1011930 1011804
345212A011804j25Q3%j67M2O2m39J05K0m1J04l14Q4L77m19%j67J25j67M2j68o2
$$ 1011804 1011679 1011762 1011762 1011595 1011637 1011699 1011260 1011365 1011385 1011344 1011448 1011134 1011218 1011595 1011176 1011176 1011009 1011134 1010967 1011009 1010841 1010779
348894A010779Q3j67J67k1q3j68K09q3j68k1J47k30%o3K30k51J46m1j68J47Q3
$$ 1010779 1010862 1010695 1010862 1010841 1010758 1010590 1010799 1010716 1010548 1010527 1010674 1010444 1010444 1010381 1010611 1010360 1010506 1010465 1010297 1010444 1010527
352376A010527j46m2K1k1J88o2Q3q3j89J68j68%%k1K72l14K31%K30k09K30J67
$$ 1010527 1010381 1010339 1010360 1010339 1010527 1010465 1010548 1010465 1010276 1010444 1010276 1010276 1010276 1010255 1010527 1010213 1010444 1010444 1010674 1010465 1010695 1010862
356058A010862j88%K1O3K1j05J67Q4%j67K1K0Q4m2j25j05k1%K09m1K1%%O2j67
$$ 1010862 1010674 1010674 1010695 1010758 1010779 1010674 1010841 1010925 1010925 1010758 1010779 1010799 1010883 1010841 1010716 1010611 1010590 1010590 1010799 1010758 1010779 1010779 1010779 1010841 1010674
360207A010674M2Q3J68M2K1o3k1%O3K1K30j26k1O3J89K0J26J88k0%M1L77%J05
$$ 1010674 1010716 1010799 1010967 1011009 1011030 1010967 1010946 1010946 1011009 1011030 1011260 1011134 1011113 1011176 1011365 1011385 1011511 1011699 1011679 1011679 1011720 1012097 1012097 1012202
364189A012202K30J26K09Q4J04K51K1O70j25Q3J26Q4L97%K51K1J68K09M2%L77
$$ 1012202 1012432 1012558 1012767 1012851 1012955 1013206 1013227 1013897 1013772 1013855 1013981 1014065 1014462 1014462 1014713 1014734 1014902 1015111 1015153 1015153 1015530
367704A015530j47o3M19k09J04K31J67%J05q4L35q4J47J04o3J47K30J05J46q3
$$ 1015530 1015383 1015320 1015739 1015530 1015634 1015865 1016032 1016032 1016137 1016053 1016388 1016304 1016451 1016555 1016492 1016639 1016869 1016974 1017120 1017037
371053A017037L35J25J68J67J46j04K51K1O3J88Q4j89J89J46k09j67K51q4m2m2
$$ 1017037 1017372 1017497 1017665 1017832 1017978 1017874 1018125 1018146 1018209 1018397 1018481 1018292 1018481 1018627 1018418 1018251 1018502 1018418 1018376 1018334
374352A018334%j25o3%k30O2j67o3m2l14O3j67o3j88k93L14k31k51%k51q4j25
$$ 1018334 1018334 1018209 1018146 1018146 1017916 1017978 1017811 1017748 1017706 1017392 1017455 1017288 1017225 1017037 1016744 1017058 1016827 1016576 1016576 1016325 1016241 1016116
378034A016116k31K31k93j05o3k51j88o3q4k09j47k30j04o3m2m2k1q4k72K1k51
$$ 1016116 1015885 1016116 1015823 1015718 1015655 1015404 1015216 1015153 1015069 1014860 1014713 1014483 1014379 1014316 1014274 1014232 1014211 1014127 1013855 1013876 1013625
381516A013625K51j88J25j25l98k1%M2k72o3J68j68J26j47j04o3J04k51K31j68
$$ 1013625 1013876 1013688 1013813 1013688 1013290 1013269 1013269 1013311 1013039 1012976 1013144 1012976 1013102 1012955 1012851 1012788 1012892 1012641 1012872 1012704
384865A012704o3k09J88Q4k51K1K09q4j67J05o3M2q4k30K51Q4o3k1k30K30%k30
$$ 1012704 1012641 1012432 1012620 1012704 1012453 1012474 1012683 1012599 1012432 1012537 1012474 1012516 1012432 1012202 1012453 1012537 1012474 1012453 1012223 1012453 1012453 1012223
388547A012223m2o3Q4%J88j88J88k51q4O3k1K1q4q3Q3o2q4j05k1K1J89j26k30
$$ 1012223 1012181 1012118 1012202 1012202 1012390 1012202 1012390 1012139 1012055 1012118 1012097 1012118 1012034 1011951 1012034 1011972 1011888 1011783 1011762 1011783 1011972 1011846 1011616
392362A011616o3k1O3%M2k10m2m1j26J26l35K09M2k51M2j89K1k1o3m1j26m2j67
$$ 1011616 1011553 1011532 1011595 1011595 1011637 1011427 1011385 1011344 1011218 1011344 1011009 1011218 1011260 1011009 1011051 1010862 1010883 1010862 1010799 1010758 1010632 1010590 1010423
396211A010423K1J04q3J46l56J89Q3l14Q4m2K1J47k51K0J05q4J68j89Q4k51O3
$$ 1010423 1010444 1010548 1010465 1010611 1010255 1010444 1010527 1010213 1010297 1010255 1010276 1010423 1010172 1010192 1010297 1010213 1010381 1010192 1010276 1010025 1010088
399676A010088K1%q4k1K51k51M2M2Q4m2M2K0q3k1%J67J05j47J47j47m1m2O2o2
$$ 1010088 1010109 1010109 1010025 1010004 1010255 1010004 1010046 1010088 1010172 1010130 1010172 1010192 1010109 1010088 1010088 1010255 1010360 1010213 1010360 1010213 1010172 1010130 1010192 1010130
403708A010130J46j46J46O3j67J25m2j25K93j47K30k51Q4k30K72j26K1k1o3J05
$$ 1010130 1010276 1010130 1010276 1010339 1010172 1010297 1010255 1010130 1010423 1010276 1010506 1010255 1010339 1010109 1010381 1010255 1010276 1010255 1010192 1010297
407007A010297M2o3K1%Q4j68Q4Q4j05j67K30o3K72m2K1%J47Q4Q3j25K51K51K51
$$ 1010297 1010339 1010276 1010297 1010297 1010381 1010213 1010297 1010381 1010276 1010109 1010339 1010276 1010548 1010506 1010527 1010527 1010674 1010758 1010841 1010716 1010967 1011218 1011469
410872A011469j04O2L56J47%M39K30K52J25M19Q4K30L97K73M39%L35L77%M18K51
$$ 1011469 1011365 1011427 1011783 1011930 1011930 1012369 1012599 1012851 1012976 1013395 1013479 1013709 1014106 1014379 1014818 1014818 1015153 1015530 1015530 1015948 1016199
414338A016199M19J67K10L97L35Q4K30o3L56O3k1L77%j88J67k1j46K0M2o2k52
$$ 1016199 1016618 1016785 1016995 1017392 1017727 1017811 1018041 1017978 1018334 1018397 1018376 1018753 1018753 1018565 1018732 1018711 1018565 1018585 1018627 1018565 1018313
417853A018313%m39J04l13j26m2Q4j05l98q3q4m19q3k10m1j26o3j67m19j46j68
$$ 1018313 1018313 1017874 1017978 1017665 1017539 1017497 1017581 1017476 1017078 1016995 1016911 1016492 1016409 1016199 1016158 1016032 1015969 1015802 1015383 1015237 1015069
421369A015069%l56j46k09j68q4l97q4j46q4q4q4j25l14j05j67M2q4m2l35%k51
$$ 1015069 1015069 1014713 1014567 1014358 1014190 1014106 1013709 1013625 1013479 1013395 1013311 1013227 1013102 1012788 1012683 1012516 1012558 1012474 1012432 1012097 1012097 1011846
425017A011846M2m2%l35J05k31Q4q4j25%K1k72J25j88j47M2J05q4j46J67j25J25
$$ 1011846 1011888 1011846 1011846 1011511 1011616 1011385 1011469 1011385 1011260 1011260 1011281 1011009 1011134 1010946 1010799 1010841 1010946 1010862 1010716 1010883 1010758 1010883
428699A010883m18L34k72K1j67J46o2M1j46O3J04j88M2k09%Q3o3O3j46q4K72j25
$$ 1010883 1010465 1010799 1010527 1010548 1010381 1010527 1010465 1010506 1010360 1010423 1010527 1010339 1010381 1010172 1010172 1010255 1010192 1010255 1010109 1010025 1010297 1010172
432348A010172%j47J47Q3k30Q4o3k1%O3K72k51Q3j04%M2L14j68k51L14j67K0K1
$$ 1010172 1010172 1010025 1010172 1010255 1010025 1010109 1010046 1010025 1010025 1010088 1010360 1010109 1010192 1010088 1010088 1010130 1010444 1010276 1010025 1010339 1010172 1010192 1010213
436197A010213M2K1k1K10j89K30m1O2J05K51M2J05j47M2K51%J68J88j05J89j89
$$ 1010213 1010255 1010276 1010255 1010465 1010276 1010506 1010465 1010527 1010632 1010883 1010925 1011030 1010883 1010925 1011176 1011176 1011344 1011532 1011427 1011616 1011427
439662A011427K93q3J25o3K1M2K1K1L14j05J05o3Q4q4%M2K1Q4o3k09J25l56L56
$$ 1011427 1011720 1011637 1011762 1011699 1011720 1011762 1011783 1011804 1012118 1012013 1012118 1012055 1012139 1012055 1012055 1012097 1012118 1012202 1012139 1011930 1012055 1011699 1012055
443528A012055q3j26K1j47J26k30K51j05k30o3j67O3J46j26O3j88M2m2m2O3l56
$$ 1012055 1011972 1011846 1011867 1011720 1011846 1011616 1011867 1011762 1011532 1011469 1011302 1011365 1011511 1011385 1011448 1011260 1011302 1011260 1011218 1011281 1010925
446993A010925%o3%k1q3j68Q4K1j68K1k1O3j46%q4o3%j67Q3k1j04J25j04j68K1
$$ 1010925 1010925 1010862 1010862 1010841 1010758 1010590 1010674 1010695 1010527 1010548 1010527 1010590 1010444 1010444 1010360 1010297 1010297 1010130 1010213 1010192 1010088 1010213 1010109 1009941 1009962
451192A009962J26Q4q4m2j05Q4j05o2k1J04k1%q3M39l56j67J88%q3j47K30j04
$$ 1009962 1010088 1010172 1010088 1010046 1009941 1010025 1009920 1009858 1009837 1009941 1009920 1009920 1009837 1010276 1009920 1009753 1009941 1009941 1009858 1009711 1009941 1009837
454840A009837K1q4%K1m2Q4k10j04J04O3%%q4j88L35j67Q3q3%M1m1K0j67k1J26
$$ 1009837 1009858 1009774 1009774 1009795 1009753 1009837 1009627 1009523 1009627 1009690 1009690 1009690 1009606 1009418 1009753 1009586 1009669 1009586 1009586 1009627 1009586 1009606 1009439 1009418 1009544
458989A009544M2m2m2J67j25j05K30%k93%J68%J46k51J67k0%o3%K1Q3j25J04j67
$$ 1009544 1009586 1009544 1009502 1009669 1009544 1009439 1009669 1009669 1009376 1009376 1009544 1009544 1009690 1009439 1009606 1009586 1009586 1009523 1009523 1009544 1009627 1009502 1009606 1009439
463004A009439J67J05j05J05J26o3q4K51k30M2K1Q4o3L77n03J05O3J67q4J05q4
$$ 1009439 1009606 1009711 1009606 1009711 1009837 1009774 1009690 1009941 1009711 1009753 1009774 1009858 1009795 1010172 1009669 1009774 1009837 1010004 1009920 1010025 1009941
466486A009941Q4K30k30J67K1j88%K72k51k1J47J04k1J05j88J88j05Q4K1j88J25
$$ 1009941 1010025 1010255 1010025 1010192 1010213 1010025 1010025 1010297 1010046 1010025 1010172 1010276 1010255 1010360 1010172 1010360 1010255 1010339 1010360 1010172 1010297
470002A010297O3J46o2q4q4J89M1m1M1j46J88j25M2q4J46j88%Q4o3J67K1m2m1
$$ 1010297 1010360 1010506 1010444 1010360 1010276 1010465 1010506 1010465 1010506 1010360 1010548 1010423 1010465 1010381 1010527 1010339 1010339 1010423 1010360 1010527 1010548 1010506 1010465
473850A010465j05K30m2k1k1m1O2O3q4J26M2m2j05J89q4k1J88%%k0o3%O3J88j88
$$ 1010465 1010360 1010590 1010548 1010527 1010506 1010465 1010527 1010590 1010506 1010632 1010674 1010632 1010527 1010716 1010632 1010611 1010799 1010799 1010799 1010779 1010716 1010716 1010779 1010967 1010779
477999A010779%J88Q4k52J47O3l14K51k1J26q4q4K09M2m2q3o3J88q3O2J05Q4j89
$$ 1010779 1010779 1010967 1011051 1010799 1010946 1011009 1010695 1010946 1010925 1011051 1010967 1010883 1011092 1011134 1011092 1011009 1010946 1011134 1011051 1011113 1011218 1011302 1011113
481814A011113J05Q4M2k10j88L35j89J68j26L77j67q4m2J26j26M2M2j26L35k51
$$ 1011113 1011218 1011302 1011344 1011134 1010946 1011281 1011092 1011260 1011134 1011511 1011344 1011260 1011218 1011344 1011218 1011260 1011302 1011176 1011511 1011260
485163A011260K1K51q4q3Q3J68j68%J68o3k1O3J04q3J67k51%%J67J47M2j05O3
$$ 1011260 1011281 1011532 1011448 1011365 1011448 1011616 1011448 1011448 1011616 1011553 1011532 1011595 1011699 1011616 1011783 1011532 1011532 1011532 1011699 1011846 1011888 1011783 1011846
488978A011846%j47Q4J05%j68K10q4J88%K1k1k30K30O3k30Q4Q3Q4q4Q4%o3J26
$$ 1011846 1011846 1011699 1011783 1011888 1011888 1011720 1011930 1011846 1012034 1012034 1012055 1012034 1011804 1012034 1012097 1011867 1011951 1012034 1012118 1012034 1012118 1012118 1012055 1012181
492994A012181Q4%j26K93M2%q4O3j47j88L14j47J47M2%q4Q4Q4k1O2q3K09j88q4
$$ 1012181 1012265 1012265 1012139 1012432 1012474 1012474 1012390 1012453 1012306 1012118 1012432 1012285 1012432 1012474 1012474 1012390 1012474 1012558 1012537 1012599 1012516 1012725 1012537 1012453
496976A012453J46j46J88j25J25k1Q4o3M2J26M2m2j89J47o3O3J05K0j25J25q3
$$ 1012453 1012599 1012453 1012641 1012516 1012641 1012620 1012704 1012641 1012683 1012809 1012851 1012809 1012620 1012767 1012704 1012767 1012872 1012892 1012767 1012892 1012809
500491A012809K09k30o3J26K1q4K30Q4j68%J26m2k09K09k30K30j46O2J05K1k51
$$ 1012809 1013018 1012788 1012725 1012851 1012872 1012788 1013018 1013102 1012934 1012934 1013060 1013018 1012809 1013018 1012788 1013018 1012872 1012934 1013039 1013060 1012809
503973A012809J46J68%j47K30O3k30K1Q4j68%M2Q4K1o3M2k30j47L98j89J26j05
$$ 1012809 1012955 1013123 1013123 1012976 1013206 1013269 1013039 1013060 1013144 1012976 1012976 1013018 1013102 1013123 1013060 1013102 1012872 1012725 1013123 1012934 1013060 1012955
507655A012955Q4J05O2q3q4j47K93Q4k09K30o3j25J67m2J68O3j68j67O2m1J25
$$ 1012955 1013039 1013144 1013206 1013123 1013039 1012892 1013185 1013269 1013060 1013290 1013227 1013102 1013269 1013227 1013395 1013458 1013290 1013123 1013185 1013144 1013269
511171A013269o3K1%Q4J26m2j89O3J68j26M2j26j04K51j05Q4o3J05Q4O2k1k51
$$ 1013269 1013206 1013227 1013227 1013311 1013437 1013395 1013206 1013269 1013437 1013311 1013353 1013227 1013123 1013374 1013269 1013353 1013290 1013395 1013479 1013541 1013520 1013269
514819A013269K72j67K1O3j47Q4J46k1m1Q3j25K1K1j68O3J88k72J89J46K30k30
$$ 1013269 1013541 1013374 1013395 1013458 1013311 1013395 1013541 1013520 1013479 1013562 1013437 1013458 1013479 1013311 1013374 1013562 1013290 1013479 1013625 1013855 1013625
518335A013625o3Q4J46j67Q4j05K51L56k72%J05o3J25J05k1K1O3j47Q4O3Q4J04
$$ 1013625 1013562 1013646 1013792 1013625 1013709 1013604 1013855 1014211 1013939 1013939 1014044 1013981 1014106 1014211 1014190 1014211 1014274 1014127 1014211 1014274 1014358 1014462
521967A014462%L14q4q3m2M2K1J46J26j26q4Q4j25m2K09j67Q3K93q3o3k1K1o3
$$ 1014462 1014462 1014776 1014692 1014609 1014567 1014609 1014630 1014776 1014902 1014776 1014692 1014776 1014651 1014609 1014818 1014651 1014734 1015027 1014944 1014881 1014860 1014881 1014818
525832A014818K09k30j88K72K1J67j04q4o3q4L14o3J26Q4l14J46J26m2J67M2Q4
$$ 1014818 1015027 1014797 1014609 1014881 1014902 1015069 1014965 1014881 1014818 1014734 1015048 1014985 1015111 1015195 1014881 1015027 1015153 1015111 1015278 1015320 1015404
529298A015404J26o3L14k51K72J04K31L97k93q3k1J88J47J67K1Q4L14J67J47m2
$$ 1015404 1015530 1015467 1015781 1015530 1015802 1015906 1016137 1016534 1016241 1016158 1016137 1016325 1016472 1016639 1016660 1016744 1017058 1017225 1017372 1017330
532646A017330Q3M2K93m2L35j67J25%K31%J46K1o3K31O2j25k10K93k0k52%L14
$$ 1017330 1017413 1017455 1017748 1017706 1018041 1017874 1017999 1017999 1018230 1018230 1018376 1018397 1018334 1018565 1018627 1018502 1018292 1018585 1018565 1018313 1018313 1018627
536328A018627j46J46%l76%%O2k1m1J67k09k10O3k51Q4%j05q4o2j89%M2k93q4
$$ 1018627 1018481 1018627 1018627 1018251 1018251 1018251 1018313 1018292 1018251 1018418 1018209 1017999 1018062 1017811 1017895 1017895 1017790 1017706 1017644 1017455 1017455 1017497 1017204 1017120
540310A017120K10j05j67k1K1k52k30K09k09%%m18L34l55J46k51%%k09J67j67
$$ 1017120 1017330 1017225 1017058 1017037 1017058 1016806 1016576 1016785 1016576 1016576 1016576 1016158 1016492 1016137 1016283 1016032 1016032 1016032 1015823 1015990 1015823
543826A015823j89J05k1l56q4%o2K1j26j26q3%k72K30k09j89J68l56J88Q4j88
$$ 1015823 1015634 1015739 1015718 1015362 1015278 1015278 1015216 1015237 1015111 1014985 1014902 1014902 1014630 1014860 1014651 1014462 1014630 1014274 1014462 1014546 1014358
547308A014358k10J47j47k72K30q3j47Q4j88m2J46k1q3j26j05Q4j88q4Q4q4%j26
$$ 1014358 1014148 1014295 1014148 1013876 1014106 1014023 1013876 1013960 1013772 1013730 1013876 1013855 1013772 1013646 1013541 1013625 1013437 1013353 1013437 1013353 1013353 1013227
550990A013227%q3j26J67l34K09j05j67J88k93j25J67k09Q3j46K1q4j25J88l98
$$ 1013227 1013227 1013144 1013018 1013185 1012851 1013060 1012955 1012788 1012976 1012683 1012558 1012725 1012516 1012599 1012453 1012474 1012390 1012265 1012453 1012055
554289A012055J26m2J67j25%k93Q4m2m2O3o3q4q4Q4Q4k09K0O3q3o3%j47k1J05
$$ 1012055 1012181 1012139 1012306 1012181 1012181 1011888 1011972 1011930 1011888 1011951 1011888 1011804 1011720 1011804 1011888 1011679 1011699 1011762 1011679 1011616 1011616 1011469 1011448 1011553
558321A011553m2J05k31k0j68O3K09j25q4J67k09J26o3j47Q4M2q4k93%L77l14
$$ 1011553 1011511 1011616 1011385 1011365 1011197 1011260 1011469 1011344 1011260 1011427 1011218 1011344 1011281 1011134 1011218 1011260 1011176 1010883 1010883 1011260 1010946
561786A010946K1%M2k93M2M1J68m2l14J05M2M1j04j68J05k1O3Q4j26j26J26%j05
$$ 1010946 1010967 1010967 1011009 1010716 1010758 1010799 1010967 1010925 1010611 1010716 1010758 1010799 1010695 1010527 1010632 1010611 1010674 1010758 1010632 1010506 1010632 1010632 1010527
565652A010527J05k51O3k1M2q4O3j47J26k31K1J68k09J25%Q4k1q4J05q4m2m2k1
$$ 1010527 1010632 1010381 1010444 1010423 1010465 1010381 1010444 1010297 1010423 1010192 1010213 1010381 1010172 1010297 1010297 1010381 1010360 1010276 1010381 1010297 1010255 1010213 1010192
569450A010192q3K1J25k09Q4k1%J04j88O3M2j26j46O2J68k51m2J25j46J88%j25
$$ 1010192 1010109 1010130 1010255 1010046 1010130 1010109 1010109 1010213 1010025 1010088 1010130 1010004 1009858 1009920 1010088 1009837 1009795 1009920 1009774 1009962 1009962 1009837
573149A009837o3K1k51L76l14J68J05j26q4%J26k1O3o3q4k1%m2L14l97J67O3%
$$ 1009837 1009774 1009795 1009544 1009920 1009606 1009774 1009879 1009753 1009669 1009669 1009795 1009774 1009837 1009774 1009690 1009669 1009669 1009627 1009941 1009544 1009711 1009774 1009774
576948A009774k30J46q4j88M2K09%k09K09%Q4q4%J05q4k1J05j05K1J05J25%J26
$$ 1009774 1009544 1009690 1009606 1009418 1009460 1009669 1009669 1009460 1009669 1009669 1009753 1009669 1009669 1009774 1009690 1009669 1009774 1009669 1009690 1009795 1009920 1009920 1010046
580813A010046m2j25L76j67j47L56k1K1%J47k1J04K1J68m2J05O2K1K1O3K1M2Q3
$$ 1010046 1010004 1009879 1010255 1010088 1009941 1010297 1010276 1010297 1010297 1010444 1010423 1010527 1010548 1010716 1010674 1010779 1010841 1010862 1010883 1010946 1010967 1011009 1011092
584612A011092o2L14m2k1L98m61J67J68j68K31j89J89K1j26J05J04q3k1O3l35
$$ 1011092 1011030 1011344 1011302 1011281 1011679 1011218 1011385 1011553 1011385 1011616 1011427 1011616 1011637 1011511 1011616 1011720 1011637 1011616 1011679 1011344
587960A011344J67o3J68j89M2j88%k72K09k72q4k1m2Q4j67Q3q3m2q4q4j46K72
$$ 1011344 1011511 1011448 1011616 1011427 1011469 1011281 1011281 1011009 1011218 1010946 1010862 1010841 1010799 1010883 1010716 1010799 1010716 1010674 1010590 1010506 1010360 1010632
591609A010632j67j05k1M2k93q4m2Q4O3j68j04m2J46j67J05k10o3k0Q3q3q4M2
$$ 1010632 1010465 1010360 1010339 1010381 1010088 1010004 1009962 1010046 1010109 1009941 1009837 1009795 1009941 1009774 1009879 1009669 1009606 1009586 1009669 1009586 1009502 1009544
595291A009544j26o3o3J47o3M2j67j68K09M2j46q4K1J47j05j47q3K1k10K93j04
$$ 1009544 1009418 1009355 1009292 1009439 1009376 1009418 1009251 1009083 1009292 1009334 1009188 1009104 1009125 1009272 1009167 1009020 1008937 1008958 1008748 1009041 1008937
598807A008937Q3q3j47L14j88j26K09j46K30k93J68%j68J68q4J25l76J67O3O3
$$ 1008937 1009020 1008937 1008790 1009104 1008916 1008790 1008999 1008853 1009083 1008790 1008958 1008958 1008790 1008958 1008874 1008999 1008623 1008790 1008853 1008916
602105A008916Q3j25Q4Q3j25j68J26q4k1J47Q3j46j05K72k30J68k1O2m1k10K93
$$ 1008916 1008999 1008874 1008958 1009041 1008916 1008748 1008874 1008790 1008769 1008916 1008999 1008853 1008748 1009020 1008790 1008958 1008937 1008999 1008958 1008748 1009041
605638A009041k51M2M2J25%j25Q4%J46k1o3J89q4q4J68k1q4K1J26k93K51k1J04
$$ 1009041 1008790 1008832 1008874 1008999 1008999 1008874 1008958 1008958 1009104 1009083 1009020 1009209 1009125 1009041 1009209 1009188 1009104 1009125 1009251 1008958 1009209 1009188 1009292
609436A009292O3o3M2J89k72%J67l14J88%M2%%J89j05o3J47q4Q4K1q4J05k10%
$$ 1009292 1009355 1009292 1009334 1009523 1009251 1009251 1009418 1009104 1009292 1009292 1009334 1009334 1009334 1009523 1009418 1009355 1009502 1009418 1009502 1009523 1009439 1009544 1009334 1009334
613468A009334J26%%J46K1k72O3m2Q4j05%Q4O3j26j04J46K1j05k51J26m2j47J47
$$ 1009334 1009460 1009460 1009460 1009606 1009627 1009355 1009418 1009376 1009460 1009355 1009355 1009439 1009502 1009376 1009272 1009418 1009439 1009334 1009083 1009209 1009167 1009020 1009167
617283A009167M2%j68M2q4K1J05k72k1L35q4o3k1J05j05%o2J04j25m2O3K51k30
$$ 1009167 1009209 1009209 1009041 1009083 1008999 1009020 1009125 1008853 1008832 1009167 1009083 1009020 1008999 1009104 1008999 1008999 1008937 1009041 1008916 1008874 1008937 1009188 1008958
621132A008958O2j88j46O2K1O3q4J68K1k72K1Q3O3j26J26k51J25m1M1%M2j46j47
$$ 1008958 1009020 1008832 1008686 1008748 1008769 1008832 1008748 1008916 1008937 1008665 1008686 1008769 1008832 1008706 1008832 1008581 1008706 1008665 1008706 1008706 1008748 1008602 1008455
624947A008455Q4M2Q4j68Q4j47J68o3q4J26J67m2M2J68k30j05J25J68j26M2m2
$$ 1008455 1008539 1008581 1008665 1008497 1008581 1008434 1008602 1008539 1008455 1008581 1008748 1008706 1008748 1008916 1008686 1008581 1008706 1008874 1008748 1008790 1008748
628463A008748M2q4M2Q4j46O2J68m2M2%k10J26J05j05k09O3O2q3Q3j67M2q4O3
$$ 1008748 1008790 1008706 1008748 1008832 1008686 1008748 1008916 1008874 1008916 1008916 1008706 1008832 1008937 1008832 1008623 1008686 1008748 1008665 1008748 1008581 1008623 1008539 1008602
632278A008602%j68L98l14K1J47o3J25o2J46m60K93j68K1J05j05Q4k1%M2M2o3
$$ 1008602 1008602 1008434 1008832 1008518 1008539 1008686 1008623 1008748 1008686 1008832 1008372 1008665 1008497 1008518 1008623 1008518 1008602 1008581 1008581 1008623 1008665 1008602
635960A008602Q4j05J88j04J04j67Q4j68k1J26%M2K1j89L56l98K31k1m2Q3M2o2
$$ 1008602 1008686 1008581 1008769 1008665 1008769 1008602 1008686 1008518 1008497 1008623 1008623 1008665 1008686 1008497 1008853 1008455 1008686 1008665 1008623 1008706 1008748 1008686
639592A008686%j47K93q4o2k1Q3K1j88q4o3K52k1M1j25K1%J46K10k72k1Q3K1K1
$$ 1008686 1008686 1008539 1008832 1008748 1008686 1008665 1008748 1008769 1008581 1008497 1008434 1008686 1008665 1008706 1008581 1008602 1008602 1008748 1008958 1008686 1008665 1008748 1008769 1008790
643624A008790j25K93m2o3J05j05J05l56J46J68k10K10m2Q4k1k1o3Q4q4K1j88
$$ 1008790 1008665 1008958 1008916 1008853 1008958 1008853 1008958 1008602 1008748 1008916 1008706 1008916 1008874 1008958 1008937 1008916 1008853 1008937 1008853 1008874 1008686
647090A008686J46Q4q4q4J26M2m2J25j67J26J67j26%k09O3%K30%m2k1k30L98j47
$$ 1008686 1008832 1008916 1008832 1008748 1008874 1008916 1008874 1008999 1008832 1008958 1009125 1008999 1008999 1008790 1008853 1008853 1009083 1009083 1009041 1009020 1008790 1009188 1009041
650955A009041m2o2j47O3k1K1K30k93J26Q3m1j26K51j46J04j67O3o3%J46%j67
$$ 1009041 1008999 1008937 1008790 1008853 1008832 1008853 1009083 1008790 1008916 1008999 1008958 1008832 1009083 1008937 1009041 1008874 1008937 1008874 1008874 1009020 1009020 1008853
654587A008853O3k10Q4Q4k51q4K93K1q4j88m2Q4k51K09K1o3J26k93J25m2q3q4
$$ 1008853 1008916 1008706 1008790 1008874 1008623 1008539 1008832 1008853 1008769 1008581 1008539 1008623 1008372 1008581 1008602 1008539 1008665 1008372 1008497 1008455 1008372 1008288
658286A008288K51q4j25K1K1O2J47j47O3%q4J68q4k09J67j67J25K1Q4O3m2k72
$$ 1008288 1008539 1008455 1008330 1008351 1008372 1008434 1008581 1008434 1008497 1008497 1008413 1008581 1008497 1008288 1008455 1008288 1008413 1008434 1008518 1008581 1008539 1008267
661918A008267J46K52j47q4q3Q3j04K09k72J88j04J67q4k30K51J47k51L97k93
$$ 1008267 1008413 1008665 1008518 1008434 1008351 1008434 1008330 1008539 1008267 1008455 1008351 1008518 1008434 1008204 1008455 1008602 1008351 1008748 1008455
665100A008455k09K09k1K1j67Q4J25%o3k1j25M2K09j05%q3K1Q3m2m1J25M2k1Q4
$$ 1008455 1008246 1008455 1008434 1008455 1008288 1008372 1008497 1008497 1008434 1008413 1008288 1008330 1008539 1008434 1008434 1008351 1008372 1008455 1008413 1008372 1008497 1008539 1008518 1008602
669082A008602j47k1k1o2%Q3O3J68k10j25J88q4K31k52J26O3o3j05J89m2%K1j47
$$ 1008602 1008455 1008434 1008413 1008351 1008351 1008434 1008497 1008665 1008455 1008330 1008518 1008434 1008665 1008413 1008539 1008602 1008539 1008434 1008623 1008581 1008581 1008602 1008455
672931A008455J26q4%q4J68j68q3J67k30J88%%O3j05j67o3J68o3k1J88k51K51
$$ 1008455 1008581 1008497 1008497 1008413 1008581 1008413 1008330 1008497 1008267 1008455 1008455 1008455 1008518 1008413 1008246 1008183 1008351 1008288 1008267 1008455 1008204 1008455
676579A008455k51k1J47J04o2j68K09M2k1l14K52j26J67%M2j67J25m1K30k30Q3
$$ 1008455 1008204 1008183 1008330 1008434 1008372 1008204 1008413 1008455 1008434 1008120 1008372 1008246 1008413 1008413 1008455 1008288 1008413 1008372 1008602 1008372 1008455
680095A008455m2j25j05J89j26K09k1o2m2Q3Q4j25k1k1Q3k09O3k1J26M1q3M2k1
$$ 1008455 1008413 1008288 1008183 1008372 1008246 1008455 1008434 1008372 1008330 1008413 1008497 1008372 1008351 1008330 1008413 1008204 1008267 1008246 1008372 1008413 1008330 1008372 1008351
683910A008351K1k1J88m2q4m1O2k1q3%j26K09j25J46J05k1j05%J05j88Q3j67M2
$$ 1008351 1008372 1008351 1008539 1008497 1008413 1008372 1008434 1008413 1008330 1008330 1008204 1008413 1008288 1008434 1008539 1008518 1008413 1008413 1008518 1008330 1008413 1008246 1008288
687759A008288k1Q4O2%q3k10L35j04j47O3J67%k30K09q3o3k1K1%K1k1O3Q3l34
$$ 1008288 1008267 1008351 1008413 1008413 1008330 1008120 1008455 1008351 1008204 1008267 1008434 1008434 1008204 1008413 1008330 1008267 1008246 1008267 1008267 1008288 1008267 1008330 1008413 1008079
691741A008079K51q4M2%J67j04O2m1M1l14L98j25j05j05L56k1k09M2%M2%m2j26
$$ 1008079 1008330 1008246 1008288 1008288 1008455 1008351 1008413 1008372 1008413 1008099 1008497 1008372 1008267 1008162 1008518 1008497 1008288 1008330 1008330 1008372 1008372 1008330 1008204
695606A008204J68k10o3K31K1K1j26q4o3K73j26Q4J88j05o2o3O3q4J67k30m2%
$$ 1008204 1008372 1008162 1008099 1008330 1008351 1008372 1008246 1008162 1008099 1008372 1008246 1008330 1008518 1008413 1008351 1008288 1008351 1008267 1008434 1008204 1008162 1008162
699238A008162J89J04k51Q4O3Q3%O3k51K93j67j89J89J67j05K1q3Q3m2K1j04J25
$$ 1008162 1008351 1008455 1008204 1008288 1008351 1008434 1008434 1008497 1008246 1008539 1008372 1008183 1008372 1008539 1008434 1008455 1008372 1008455 1008413 1008434 1008330 1008455
702920A008455q3k1Q3Q4l35J68K1O2K1k09K72O3j47Q4k30J46o2M1Q4J05Q4j47
$$ 1008455 1008372 1008351 1008434 1008518 1008183 1008351 1008372 1008434 1008455 1008246 1008518 1008581 1008434 1008518 1008288 1008434 1008372 1008413 1008497 1008602 1008686 1008539
706569A008539j05J47o3K1J47j68J88k0q4K1%J25m2k0J04K30q3K1q4K09M2j05
$$ 1008539 1008434 1008581 1008518 1008539 1008686 1008518 1008706 1008686 1008602 1008623 1008623 1008748 1008706 1008686 1008790 1009020 1008937 1008958 1008874 1009083 1009125 1009020
710251A009020L35O3Q4%M2J25J68J04K1Q4Q4K30%q4Q4M81m2%M2%M19q4M2k1K1
$$ 1009020 1009355 1009418 1009502 1009502 1009544 1009669 1009837 1009941 1009962 1010046 1010130 1010360 1010360 1010276 1010360 1010841 1010799 1010799 1010841 1010841 1011260 1011176 1011218 1011197 1011218
714399A011218K51Q4q4k1K51%O3L35q4K1Q4k1K1j88K72K1K30l35K72m2M2Q4k1
$$ 1011218 1011469 1011553 1011469 1011448 1011699 1011699 1011762 1012097 1012013 1012034 1012118 1012097 1012118 1011930 1012202 1012223 1012453 1012118 1012390 1012348 1012390 1012474 1012453
718265A012453Q4j05Q4%K1J46q4%J68k51K51q4K1k1%J68j26%M2j26k1Q4j67J88
$$ 1012453 1012537 1012432 1012516 1012516 1012537 1012683 1012599 1012599 1012767 1012516 1012767 1012683 1012704 1012683 1012683 1012851 1012725 1012725 1012767 1012641 1012620 1012704 1012537 1012725
722247A012725j67O2O3j25k1j47%J68j89J47o3k1j47J68l14K51k1j88%m2M2K1
$$ 1012725 1012558 1012620 1012683 1012558 1012537 1012390 1012390 1012558 1012369 1012516 1012453 1012432 1012285 1012453 1012139 1012390 1012369 1012181 1012181 1012139 1012181 1012202
725929A012202K1m19K51k72j46L14k31m1J25k09Q4m2k1o3k1J05m40J47M1O3k1
$$ 1012202 1012223 1011804 1012055 1011783 1011637 1011951 1011720 1011679 1011804 1011595 1011679 1011637 1011616 1011553 1011532 1011637 1011197 1011344 1011385 1011448 1011427
729394A011427o2q4j05K51k93J26j47o2K51j68k51J26j47%K1%j04j05%K1%k30
$$ 1011427 1011365 1011281 1011176 1011427 1011134 1011260 1011113 1011051 1011302 1011134 1010883 1011009 1010862 1010862 1010883 1010883 1010779 1010674 1010674 1010695 1010695 1010465
733093A010465O2J68j89%K1k30M2K72j67%k72J67j47J89k1k1%j67Q3q3q4K09k1
$$ 1010465 1010527 1010695 1010506 1010506 1010527 1010297 1010339 1010611 1010444 1010444 1010172 1010339 1010192 1010381 1010360 1010339 1010339 1010172 1010255 1010172 1010088 1010297 1010276
736892A010276k1l76J46j88m2%m2K1O3j68M2m2q3J04%j46j05J05%m2o3K72j25
$$ 1010276 1010255 1009879 1010025 1009837 1009795 1009795 1009753 1009774 1009837 1009669 1009711 1009669 1009586 1009690 1009690 1009544 1009439 1009544 1009544 1009502 1009439 1009711 1009586
740757A009586j47%O3j47J47j47J89m19L14j67O2M2q4m1M1M2j25%k1j05K09q3
$$ 1009586 1009439 1009439 1009502 1009355 1009502 1009355 1009544 1009125 1009439 1009272 1009334 1009376 1009292 1009251 1009292 1009334 1009209 1009209 1009188 1009083 1009292 1009209
744389A009209j05j46K30o3O3k30m2K51j26M2J68l77K51k51Q4q4%J67j67J46o2
$$ 1009209 1009104 1008958 1009188 1009125 1009188 1008958 1008916 1009167 1009041 1009083 1009251 1008874 1009125 1008874 1008958 1008874 1008874 1009041 1008874 1009020 1008958
747904A008958%l56L14J88l56J89j89m2O3k1j67J25j04J46j46q4%k30J46J05m2
$$ 1008958 1008958 1008602 1008916 1009104 1008748 1008937 1008748 1008706 1008769 1008748 1008581 1008706 1008602 1008748 1008602 1008518 1008518 1008288 1008434 1008539 1008497
751387A008497o3o2J25m2q3k1Q3j46%K51j05j04K1k1%m2%M2J25k1k51Q4K1Q4q4
$$ 1008497 1008434 1008372 1008497 1008455 1008372 1008351 1008434 1008288 1008288 1008539 1008434 1008330 1008351 1008330 1008330 1008288 1008288 1008330 1008455 1008434 1008183 1008267 1008288 1008372 1008288
755585A008288k1o3k1J89j26K1o3O3q4K72j88o3m2%J05J67j88q4Q4J26m2q4Q4
$$ 1008288 1008267 1008204 1008183 1008372 1008246 1008267 1008204 1008267 1008183 1008455 1008267 1008204 1008162 1008162 1008267 1008434 1008246 1008162 1008246 1008372 1008330 1008246 1008330
759384A008330Q3j25j05K1j25m2K51O3j05j67J67%K1q4k1j25q4L35j68K52k73
$$ 1008330 1008413 1008288 1008183 1008204 1008079 1008037 1008288 1008351 1008246 1008079 1008246 1008246 1008267 1008183 1008162 1008037 1007953 1008288 1008120 1008372 1008099
762899A008099J05O3o3M2M2O3k1K1k31L14j67O3%j26J47j05o3k51K51j04K09k1
$$ 1008099 1008204 1008267 1008204 1008246 1008288 1008351 1008330 1008351 1008120 1008434 1008267 1008330 1008330 1008204 1008351 1008246 1008183 1007932 1008183 1008079 1008288 1008267
766548A008267o3j05Q4j67L35j89J05k51K51k1j47J05k93J05%J46m2M2M2M2K51
$$ 1008267 1008204 1008099 1008183 1008016 1008351 1008162 1008267 1008016 1008267 1008246 1008099 1008204 1007911 1008016 1008016 1008162 1008120 1008162 1008204 1008246 1008497
770063A008497k09j68m1%Q3%j25k1K1K93k10k1K1J47k1j26k1O3J05J46q3%M2j26
$$ 1008497 1008288 1008120 1008079 1008079 1008162 1008162 1008037 1008016 1008037 1008330 1008120 1008099 1008120 1008267 1008246 1008120 1008099 1008162 1008267 1008413 1008330 1008330 1008372 1008246
774045A008246Q4Q3j67K09j67m2K09q3Q3O3K1k72K72k93M2K51j05J47q4J26m2
$$ 1008246 1008330 1008413 1008246 1008455 1008288 1008246 1008455 1008372 1008455 1008518 1008539 1008267 1008539 1008246 1008288 1008539 1008434 1008581 1008497 1008623 1008581
777561A008581k51L35m2q4K30%j67Q4Q3o3j04K51%k1M2j26M2Q4O3o3m2J05J88
$$ 1008581 1008330 1008665 1008623 1008539 1008769 1008769 1008602 1008686 1008769 1008706 1008602 1008853 1008853 1008832 1008874 1008748 1008790 1008874 1008937 1008874 1008832 1008937 1009125
781376A009125j26m1M1%J05j88J88K1M2j68K52J88j67Q3%k1o2J67k51J46J26j05
$$ 1009125 1008999 1008958 1008999 1008999 1009104 1008916 1009104 1009125 1009167 1008999 1009251 1009439 1009272 1009355 1009355 1009334 1009272 1009439 1009188 1009334 1009460 1009355
785058A009355Q4%k1%K1Q4o3j68K31k72J04K1J47J04j04%J67j04K09k72%J04O3
$$ 1009355 1009439 1009439 1009418 1009418 1009439 1009523 1009460 1009292 1009523 1009251 1009355 1009376 1009523 1009627 1009523 1009523 1009690 1009586 1009795 1009523 1009523 1009627 1009690
788873A009690j46K09k51q4J05K51j88j26L14j88%K0J47j26j67J67%M2m2m1Q3
$$ 1009690 1009544 1009753 1009502 1009418 1009523 1009774 1009586 1009460 1009774 1009586 1009586 1009606 1009753 1009627 1009460 1009627 1009627 1009669 1009627 1009586 1009669
792389A009669k09K09o3k0o3J04q3q4m2K1J47J04Q4j47k1k0k10K93m2Q4O3q4J47
$$ 1009669 1009460 1009669 1009606 1009586 1009523 1009627 1009544 1009460 1009418 1009439 1009586 1009690 1009774 1009627 1009606 1009586 1009376 1009669 1009627 1009711 1009774 1009690 1009837
796237A009837k10K52k52q3J25o3J47o3k30L77k93M2J04j46J46K1O3o3q4M2j25
$$ 1009837 1009627 1009879 1009627 1009544 1009669 1009606 1009753 1009690 1009460 1009837 1009544 1009586 1009690 1009544 1009690 1009711 1009774 1009711 1009627 1009669 1009544
799720A009544Q3q3J67O3o3k1j67J88k1j04Q3J68k51K0K1j88Q4Q3j88J26j05O3
$$ 1009544 1009627 1009544 1009711 1009774 1009711 1009690 1009523 1009711 1009690 1009586 1009669 1009837 1009586 1009606 1009627 1009439 1009523 1009606 1009418 1009544 1009439 1009502
803402A009502J25q3q4q4m2j25O3K30l14%K1O3O2q3M1j25J25M2k09Q4O3J67l56
$$ 1009502 1009627 1009544 1009460 1009376 1009334 1009209 1009272 1009502 1009188 1009188 1009209 1009272 1009334 1009251 1009292 1009167 1009292 1009334 1009125 1009209 1009272 1009439 1009083
807217A009083K09j67J67q3M2j68K09m1J04j67k1q4K51j46Q4k31K51j25j68K52
$$ 1009083 1009292 1009125 1009292 1009209 1009251 1009083 1009292 1009251 1009355 1009188 1009167 1009083 1009334 1009188 1009272 1009041 1009292 1009167 1008999 1009251
810566A009251o3q4Q4j05M2Q4Q3k93J05j46J67q4%M2M2%j05K1%%m2Q4M2j26J05
$$ 1009251 1009188 1009104 1009188 1009083 1009125 1009209 1009292 1008999 1009104 1008958 1009125 1009041 1009041 1009083 1009125 1009125 1009020 1009041 1009041 1009041 1008999 1009083 1009125 1008999 1009104
814714A009104j05%K1k1K1o2j26j67K93j05Q4j05m2O3%q4J05M2j26%k1j46%k1
$$ 1009104 1008999 1008999 1009020 1008999 1009020 1008958 1008832 1008665 1008958 1008853 1008937 1008832 1008790 1008853 1008853 1008769 1008874 1008916 1008790 1008790 1008769 1008623 1008623 1008602
818730A008602K1J46o3q3k1%O3m2J67k09M2M2M1j04J04m1j26j05j04K93k10m1
$$ 1008602 1008623 1008769 1008706 1008623 1008602 1008602 1008665 1008623 1008790 1008581 1008623 1008665 1008706 1008602 1008706 1008665 1008539 1008434 1008330 1008623 1008413 1008372
822378A008372m2%M2k10J89J04k09%j47J89Q4j05j05%o3J68k72J04J47l14L14
$$ 1008372 1008330 1008330 1008372 1008162 1008351 1008455 1008246 1008246 1008099 1008288 1008372 1008267 1008162 1008162 1008099 1008267 1007995 1008099 1008246 1007932 1008246
825894A008246l14J67%q3j05%J88k0k10M2o3O3Q4j68J68j26Q4k1o3O3K1m2o3J05
$$ 1008246 1007932 1008099 1008099 1008016 1007911 1007911 1008099 1008079 1007869 1007911 1007848 1007911 1007995 1007827 1007995 1007869 1007953 1007932 1007869 1007932 1007953 1007911 1007848 1007953
829876A007953%k1K1m2j67m2J67m2%K1j88K51K1j46J25o3j46J67k1k1j25Q4Q3
$$ 1007953 1007953 1007932 1007953 1007911 1007744 1007702 1007869 1007827 1007827 1007848 1007660 1007911 1007932 1007786 1007911 1007848 1007702 1007869 1007848 1007827 1007702 1007786 1007869
833724A007869%O3o3q3O2q3Q3k72L56o3k72J89j68J26k10L98Q4k72K72k30m2K1
$$ 1007869 1007869 1007932 1007869 1007786 1007848 1007765 1007848 1007576 1007932 1007869 1007597 1007786 1007618 1007744 1007534 1007932 1008016 1007744 1008016 1007786 1007744 1007765
837373A007765J46k51J67K1o2j26K1Q4%Q3%j67Q4q4j89K52q4K1j05K1Q4q4J68
$$ 1007765 1007911 1007660 1007827 1007848 1007786 1007660 1007681 1007765 1007765 1007848 1007848 1007681 1007765 1007681 1007492 1007744 1007660 1007681 1007576 1007597 1007681 1007597 1007765
841222A007765j47Q4k1j47K10k31J47q4k30L35q4K1m2K1q4%J47m2k51J67m2%K1
$$ 1007765 1007618 1007702 1007681 1007534 1007744 1007513 1007660 1007576 1007346 1007681 1007597 1007618 1007576 1007597 1007513 1007513 1007660 1007618 1007367 1007534 1007492 1007492 1007513
845037A007513O3j46j47K30j04K09Q4M2l35Q3m1Q3j88J88m2j25m2K72k72j46J46
$$ 1007513 1007576 1007430 1007283 1007513 1007409 1007618 1007702 1007744 1007409 1007492 1007451 1007534 1007346 1007534 1007492 1007367 1007325 1007597 1007325 1007179 1007325
848553A007325Q4j26Q4m2%K1O3k10K93m1k10%j25K93%M2k1Q3j67Q4K1Q3k51O3
$$ 1007325 1007409 1007283 1007367 1007325 1007325 1007346 1007409 1007199 1007492 1007451 1007241 1007241 1007116 1007409 1007409 1007451 1007430 1007513 1007346 1007430 1007451 1007534 1007283 1007346
852534A007346o3M2q4J05k1k09%K09J05j47j04J46k09J46j46L97l97L35q4O3Q3
$$ 1007346 1007283 1007325 1007241 1007346 1007325 1007116 1007116 1007325 1007430 1007283 1007179 1007325 1007116 1007262 1007116 1007513 1007116 1007451 1007367 1007430 1007513
856050A007513j04J67%j25M1o2K1M1M2k51K09Q4j25J67j67M1M2j04J46o3K1O3
$$ 1007513 1007409 1007576 1007576 1007451 1007492 1007430 1007451 1007492 1007534 1007283 1007492 1007576 1007451 1007618 1007451 1007492 1007534 1007430 1007576 1007513 1007534 1007597
859699A007597%J05j26m2m2M2%m2K10q4m2J68%j47K1q4Q4O3Q4o3O3o3j68L35l56
$$ 1007597 1007597 1007702 1007576 1007534 1007492 1007534 1007534 1007492 1007702 1007618 1007576 1007744 1007744 1007597 1007618 1007534 1007618 1007681 1007765 1007702 1007765 1007702 1007534 1007869 1007513
863847A007513J89O3k1J67k51K1J05%J67j26J05Q4l98K93K1o3j88L14q4K1j05
$$ 1007513 1007702 1007765 1007744 1007911 1007660 1007681 1007786 1007786 1007953 1007827 1007932 1008016 1007618 1007911 1007932 1007869 1007681 1007995 1007911 1007932 1007827
867363A007827J68j47k1j25K30j67K72j26q4Q4M2j67Q3J47j05J26j26J68k10J47
$$ 1007827 1007995 1007848 1007827 1007702 1007932 1007765 1008037 1007911 1007827 1007911 1007953 1007786 1007869 1008016 1007911 1008037 1007911 1008079 1007869 1008016
870711A008016o3q4J68j26J88j88J68j47J88M2q3o3K72j89%K1%J26M2%K09k09
$$ 1008016 1007953 1007869 1008037 1007911 1008099 1007911 1008079 1007932 1008120 1008162 1008079 1008016 1008288 1008099 1008099 1008120 1008120 1008246 1008288 1008288 1008497 1008288
874343A008288m2J67j46j47K10q4J88q3k31O3%J47m2%j05q4K1J68Q4k1M81n65
$$ 1008288 1008246 1008413 1008267 1008120 1008330 1008246 1008434 1008351 1008120 1008183 1008183 1008330 1008288 1008288 1008183 1008099 1008120 1008288 1008372 1008351 1008832 1008267
878042A008267J88m2%%o2K1%j68J68%J46k51J67J68q4J88k72K1O3o3k1j46M2J25
$$ 1008267 1008455 1008413 1008413 1008413 1008351 1008372 1008372 1008204 1008372 1008372 1008518 1008267 1008434 1008602 1008518 1008706 1008434 1008455 1008518 1008455 1008434 1008288 1008330 1008455
882007A008455M2Q4o3O3k30L14q4J05j68K1K51k09m2O3K1k51J67Q4j68J26%Q4
$$ 1008455 1008497 1008581 1008518 1008581 1008351 1008665 1008581 1008686 1008518 1008539 1008790 1008581 1008539 1008602 1008623 1008372 1008539 1008623 1008455 1008581 1008581 1008665
885706A008665j26j26K1%J05k51J67k1J05j67J67j88q4Q4o3L35j68Q4k1j67J67
$$ 1008665 1008539 1008413 1008434 1008434 1008539 1008288 1008455 1008434 1008539 1008372 1008539 1008351 1008267 1008351 1008288 1008623 1008455 1008539 1008518 1008351 1008518
889172A008518k72K93j88J67q4o2J46j67o3J67O3%j05J68K1j05Q4j47J68o3%m2
$$ 1008518 1008246 1008539 1008351 1008518 1008434 1008372 1008518 1008351 1008288 1008455 1008518 1008518 1008413 1008581 1008602 1008497 1008581 1008434 1008602 1008539 1008539 1008497
892854A008497J89k31O3q4Q4O3k30J88M2j26J26%k93K30K1k51M2J04j04%k31K52
$$ 1008497 1008686 1008455 1008518 1008434 1008518 1008581 1008351 1008539 1008581 1008455 1008581 1008581 1008288 1008518 1008539 1008288 1008330 1008434 1008330 1008330 1008099 1008351
896502A008351K1Q3m2k30J89j05k1m2Q4k1j05K10j05j47K10%K09k51m2m2m2m2
$$ 1008351 1008372 1008455 1008413 1008183 1008372 1008267 1008246 1008204 1008288 1008267 1008162 1008372 1008267 1008120 1008330 1008330 1008539 1008288 1008246 1008204 1008162 1008120
900184A008120K10o3j47K10k31J05J68j68q4J47o3m2M2j88O3J04K1k72J47q4J88
$$ 1008120 1008330 1008267 1008120 1008330 1008099 1008204 1008372 1008204 1008120 1008267 1008204 1008162 1008204 1008016 1008079 1008183 1008204 1007932 1008079 1007995 1008183
903700A008183J47j68k09O3J88j25j26k1J88j25j26K93j25Q3j25j26m2M2O3j46
$$ 1008183 1008330 1008162 1007953 1008016 1008204 1008079 1007953 1007932 1008120 1007995 1007869 1008162 1008037 1008120 1007995 1007869 1007827 1007869 1007932 1007786
906999A007786q4M2K51k93J46o2q4q4Q4J25k51q4M2Q4J47Q3l14j25K51k09Q3%
$$ 1007786 1007702 1007744 1007995 1007702 1007848 1007786 1007702 1007618 1007702 1007827 1007576 1007492 1007534 1007618 1007765 1007848 1007534 1007409 1007660 1007451 1007534 1007534
910697A007534%j04J46q4Q4m2%j25M2J46k1j46J67j05K1K1j25J67K1q4J68j68
$$ 1007534 1007534 1007430 1007576 1007492 1007576 1007534 1007534 1007409 1007451 1007597 1007576 1007430 1007597 1007492 1007513 1007534 1007409 1007576 1007597 1007513 1007681 1007513
914329A007513%O3K1o3j88J88Q4k09%K93k72j47K09k51J68M2%J67k09k51J04K1
$$ 1007513 1007513 1007576 1007597 1007534 1007346 1007534 1007618 1007409 1007409 1007702 1007430 1007283 1007492 1007241 1007409 1007451 1007451 1007618 1007409 1007158 1007262 1007283
918028A007283K09l97L14k51K09m2j26q3J67j04J67%j88J04o3%K31q4j05%o2K0
$$ 1007283 1007492 1007095 1007409 1007158 1007367 1007325 1007199 1007116 1007283 1007179 1007346 1007346 1007158 1007262 1007199 1007199 1007430 1007346 1007241 1007241 1007179 1007199
921660A007199J68j05K1%k1K72j25k10K52j68k1L14k51q4J89j47Q4M2j26J68j89
$$ 1007199 1007367 1007262 1007283 1007283 1007262 1007534 1007409 1007199 1007451 1007283 1007262 1007576 1007325 1007241 1007430 1007283 1007367 1007409 1007283 1007451 1007262
925176A007262K1M2J26k1J04j88O3l35J05K0K31k72J04O3J67q3J67j67M2j05J05
$$ 1007262 1007283 1007325 1007451 1007430 1007534 1007346 1007409 1007074 1007179 1007199 1007430 1007158 1007262 1007325 1007492 1007409 1007576 1007409 1007451 1007346 1007451
928691A007451M1J26j88Q3q3K1j05k51%K30o3Q4o3j25J25J26m19J89K30K1j47
$$ 1007451 1007492 1007618 1007430 1007513 1007430 1007451 1007346 1007095 1007095 1007325 1007262 1007346 1007283 1007158 1007283 1007409 1006990 1007179 1007409 1007430 1007283
932173A007283j88K72q4J68j05%k30K09Q4J04j46%O3j05Q4j47K72k72K51j46k51
$$ 1007283 1007095 1007367 1007283 1007451 1007346 1007346 1007116 1007325 1007409 1007513 1007367 1007367 1007430 1007325 1007409 1007262 1007534 1007262 1007513 1007367 1007116
935689A007116L97o2m2M2M1K1k1m1J67j26J68K1j47k1o2j68K51O3j46m2o3K72
$$ 1007116 1007513 1007451 1007409 1007451 1007492 1007513 1007492 1007451 1007618 1007492 1007660 1007681 1007534 1007513 1007451 1007283 1007534 1007597 1007451 1007409 1007346 1007618
939321A007618m2j46K30j68o2j05J26k1O2M2M2k30Q4j68j04M18o3k1M2j25m2O3
$$ 1007618 1007576 1007430 1007660 1007492 1007430 1007325 1007451 1007430 1007492 1007534 1007576 1007346 1007430 1007262 1007158 1007576 1007513 1007492 1007534 1007409 1007367 1007430
943019A007430J46j46J88j67m2j26M2J26%%%q4M2Q3m1J67j05K1Q4%q4J47Q4K1
$$ 1007430 1007576 1007430 1007618 1007451 1007409 1007283 1007325 1007451 1007451 1007451 1007451 1007367 1007409 1007492 1007451 1007618 1007513 1007534 1007618 1007618 1007534 1007681 1007765 1007786
946985A007786k52Q4K09m1O2K1k1%k1M2M2q4%M2q3J46k1k51J05K1K09k51%J04
$$ 1007786 1007534 1007618 1007827 1007786 1007848 1007869 1007848 1007848 1007827 1007869 1007911 1007827 1007827 1007869 1007786 1007932 1007911 1007660 1007765 1007786 1007995 1007744 1007744 1007848
951017A007848j88J67J26q4J47j89M2J47j05J05K1Q3J68j68q3L14k1j68M2k09
$$ 1007848 1007660 1007827 1007953 1007869 1008016 1007827 1007869 1008016 1007911 1008016 1008037 1008120 1008288 1008120 1008037 1008351 1008330 1008162 1008204 1007995
954315A007995L77j26Q4K1O2%J05j05K1k1K1J05J26q4J67k93J47L14j26j88K1
$$ 1007995 1008372 1008246 1008330 1008351 1008413 1008413 1008518 1008413 1008434 1008413 1008434 1008539 1008665 1008581 1008748 1008455 1008602 1008916 1008790 1008602 1008623
957831A008623J46J05J25k30j88K51J67o2J04j88K51j05J05o3j67L35l35L14%
$$ 1008623 1008769 1008874 1008999 1008769 1008581 1008832 1008999 1008937 1009041 1008853 1009104 1008999 1009104 1009041 1008874 1009209 1008874 1009188 1009188
961013A009188Q4Q3q3J67j88o3Q4J04K93j67j26J47k1K1O3k10K30q3K1m2J67o3
$$ 1009188 1009272 1009355 1009272 1009439 1009251 1009188 1009272 1009376 1009669 1009502 1009376 1009523 1009502 1009523 1009586 1009376 1009606 1009523 1009544 1009502 1009669 1009606
964662A009606k0m2J46O3M2q4m2J26j26%K93%q3q4%J46q3K1j05q4J47M2M1M2M2
$$ 1009606 1009586 1009544 1009690 1009753 1009795 1009711 1009669 1009795 1009669 1009669 1009962 1009962 1009879 1009795 1009795 1009941 1009858 1009879 1009774 1009690 1009837 1009879 1009920 1009962 1010004
968810A010004l98k0J67K1k30K51j05K51J05q4j88J67%k1q3q4J88j67O3o3J46
$$ 1010004 1009606 1009586 1009753 1009774 1009544 1009795 1009690 1009941 1010046 1009962 1009774 1009941 1009941 1009920 1009837 1009753 1009941 1009774 1009837 1009774 1009920
972326A009920o2o3J46K1k51j88L56k1j47q4J47k1o3O3Q4K1j47k1o3k1%J47m2
$$ 1009920 1009858 1009795 1009941 1009962 1009711 1009523 1009879 1009858 1009711 1009627 1009774 1009753 1009690 1009753 1009837 1009858 1009711 1009690 1009627 1009606 1009606 1009753 1009711
976175A009711k1j67O3%J67o3%O3q4q3K09m2j26q3J67k09Q4m2q4j68J68k09K09
$$ 1009711 1009690 1009523 1009586 1009586 1009753 1009690 1009690 1009753 1009669 1009586 1009795 1009753 1009627 1009544 1009711 1009502 1009586 1009544 1009460 1009292 1009460 1009251 1009460
979990A009460J67k72K1J26j26M2q4o2k1o3J46k09Q4J25j46K1j05q4L35l56J26
$$ 1009460 1009627 1009355 1009376 1009502 1009376 1009418 1009334 1009272 1009251 1009188 1009334 1009125 1009209 1009334 1009188 1009209 1009104 1009020 1009355 1008999 1009125
983505A009125k1J47j26Q4q4J26o3j68J89O3K0O3Q4%J88m1o3l14K51j26j25q4
$$ 1009125 1009104 1009251 1009125 1009209 1009125 1009251 1009188 1009020 1009209 1009272 1009292 1009355 1009439 1009439 1009627 1009586 1009523 1009209 1009460 1009334 1009209 1009125
987154A009125O3Q4j47m2K1o3m18J67m2%Q4k09J67j25q4J67k30O3q4M2m2j67K93
$$ 1009125 1009188 1009272 1009125 1009083 1009104 1009041 1008623 1008790 1008748 1008748 1008832 1008623 1008790 1008665 1008581 1008748 1008518 1008581 1008497 1008539 1008497 1008330 1008623
991003A008623k93Q3J89%j68J05q4Q4k1J05J46K1k93M40q4j67Q3K1J47j89J05
$$ 1008623 1008330 1008413 1008602 1008602 1008434 1008539 1008455 1008539 1008518 1008623 1008769 1008790 1008497 1008937 1008853 1008686 1008769 1008790 1008937 1008748 1008853
994468A008853j67Q3%K51K1M2k93J26J67J05k30K51j26J26O3j68Q4k1K1J67Q4
$$ 1008853 1008686 1008769 1008769 1009020 1009041 1009083 1008790 1008916 1009083 1009188 1008958 1009209 1009083 1009209 1009272 1009104 1009188 1009167 1009188 1009355 1009439
998000A009439q4O3J26m2q4o3K1Q4Q4%j68K30o2
$$ 1009439 1009355 1009418 1009544 1009502 1009418 1009355 1009376 1009460 1009544 1009544 1009376 1009606 1009544
##END=
