##TITLE= Headspace from ground pimento berries
##JCAMP-DX= 5.00 $$From Command Line Converter 1.0
##DATA TYPE= GAS CHROMATOGRAPH
##ORIGIN= Dept of Chem, UWI, Mona, JAMAICA
##OWNER= Dr Robert J. Lancashire
##$URL= http://wwwchem.uwimona.edu.jm:1104/software/jcampdx.html
##SPECTROMETER/DATA SYSTEM= HP 5890 GC
##DATE= 11-26-1995
##TIME= 09:36:13
##XUNITS= TIME
##YUNITS= ARBITRARY
##XFACTOR= 1.999300e-005
##YFACTOR= 1.629410e-001
##FIRSTX=   0.000000
##LASTX=  19.9966
##NPOINTS= 6000
##MAXY= 212886.000000
##MINY= 49945.000000
##FIRSTY= 52626.000000
##DELTAX=   0.003333
##XYDATA= (X++(Y..Y))
0C22975m3L7L1m9%K4l0j60l07n09q41r94j105j154j043j148j012r95r14
3167C12763q16q10p06o08m97o32l25l93l44l00j91j90j72j2j10n6m3l7K5Q0
6518C06626K4l0Q6Q6P9R2J60J17J04J72J22J35J29K52J90J66J29O7K09J47J66
10003C09228J66J72K33O1J60J16J78J97K39J41J35K15J17J53J29J59J23J78J66
13171C12266J78J47J47K40J23K45J78K52P3J66J72J66Q5J48J47J41J97J90J04
16355C15365J41J97J59J48P3J90J05J59J11Q6J35R8J23J22J35J05J16PJ47R8
19656C17820O8P9J17J47OJ05J16J05R2J8J04J17J2J11Q0J16Q0M9J17L7P3J47
23358C19716R3M9M3J28m9R2P4N5M3R8N6O7K5O1M3M3O1J17J17J22k4L0%J29J91
$$ y = [322975, 322932, 322969, 323000, 322951, 322951, 322975, 322945, 322785, 322478, 321969, 321128, 320134, 319029, 317875, 316832, 315684, 314672, 313677, 312763, 311947, 311137, 310431, 309823, 309326, 308694, 308369, 307976, 307632, 307332, 307141, 306951, 306779, 306767, 306657, 306601, 306558, 306521, 306546, 306626, 306650, 306620, 306706, 306792, 306871, 306963, 307123, 307240, 307344, 307516, 307638, 307773, 307902, 308154, 308344, 308510, 308639, 308706, 308915, 309062, 309228, 309394, 309566, 309799, 309860, 310020, 310136, 310314, 310511, 310750, 310891, 311026, 311241, 311358, 311511, 311640, 311799, 311922, 312100, 312266, 312444, 312591, 312738, 312978, 313101, 313346, 313524, 313776, 313849, 314015, 314187, 314353, 314438, 314586, 314733, 314874, 315071, 315261, 315365, 315506, 315703, 315862, 316010, 316083, 316273, 316378, 316537, 316648, 316734, 316869, 316967, 317090, 317212, 317347, 317452, 317568, 317575, 317722, 317820, 317888, 317967, 318084, 318231, 318237, 318342, 318458, 318563, 318655, 318673, 318777, 318894, 318906, 319017, 319097, 319213, 319293, 319342, 319459, 319496, 319569, 319716, 319809, 319858, 319901, 320029, 319980, 320072, 320146, 320201, 320244, 320342, 320398, 320465, 320490, 320551, 320594, 320637, 320698, 320815, 320932, 321054, 321030, 321060, 321060, 321189, 321380]
27509C21380P18J743M105P874J3625L9757O4158N6708N7879N2001L8216K4997
29493F83161J4042N965r76o806j3311k1830l1116l7989m0634l9156l4460k7654
31527D49236j7454O112K1351K787j7264k1081j5969r777n487P12L744o57n370
33695C90883o413n438l479k455k437k780k940l222l400l510l596l364l087k700
36029C42062k148j755j191j031j074n83N83K504L860L719K934K578K264J590
38363C54312O38l74j571k455k922k890k271j497m79J10o7j97l49l93l93k70l44
41197C38588n15p80j080j209j246j135q72l43k46r8k70l50l68l13k70k33j66
44032C29094j47j23l19j41l07l19k21j97Q60J700O81P24K39l13m97n34o19n10
$$ y = [321380, 322098, 323841, 327946, 335820, 349445, 389202, 453360, 510068, 567947, 619948, 658164, 683161, 697203, 703168, 702192, 695386, 682075, 660245, 629129, 591140, 550506, 511350, 476890, 449236, 431782, 437894, 459245, 462032, 444768, 423687, 407718, 397941, 392454, 393166, 396910, 396253, 390883, 384470, 379032, 375553, 373098, 370661, 367881, 364941, 361719, 358319, 354809, 351213, 347849, 344762, 342062, 339914, 338159, 336968, 335937, 334863, 334280, 334863, 337367, 341227, 344946, 347880, 350458, 352722, 354312, 354950, 354576, 353005, 350550, 347628, 344738, 342467, 340970, 340491, 340601, 340534, 340337, 339988, 339595, 339202, 338932, 338588, 338073, 337293, 336213, 335004, 333758, 332623, 331751, 331408, 331162, 331064, 330794, 330444, 330076, 329763, 329493, 329260, 329094, 328947, 328824, 328505, 328364, 328057, 327738, 327517, 327320, 328180, 329880, 330561, 331285, 331524, 331211, 330714, 330180, 329561, 329051]
46999C29051m66l99l93k95k94l13k33j91j41n5j66m9r8k5%l6J78R2L74N83R08
50517C28032J228J313J271J129Q41P97M42K58j23k02k27L25Q84J479J595J522
53185C40564J547J369J374J283J105Q65L81P9j47l74n53p36r51r82j154j338
55869C42332j436j510j510j387j252j086q59m11q0K64N22P91P31O81N28L19Q6
58703C36723p4k64m91n89o38q41r08r03r82r32p92p80n83m66l93j78Q0M36Q84
61838C28309J282J442J492J258R51N40J84p3l44o44q10r03r08r94o88m35l1Q84
64839C30512K172M272P334J1912J7829K5285L3355M1789M8815N3921N6597N5695
66840F89488N2154M5109L7375K7550J8970R445K240m277r206j3060j4202j6711
$$ y = [329051, 328585, 328186, 327793, 327498, 327204, 326891, 326658, 326467, 326326, 326271, 326105, 326056, 325958, 325933, 325933, 325897, 326075, 326167, 326541, 327124, 328032, 329260, 330573, 331844, 332973, 333814, 334611, 335053, 335311, 335188, 334986, 334759, 335084, 335968, 337447, 339042, 340564, 342111, 343480, 344854, 346137, 347242, 348107, 348488, 348567, 348420, 348046, 347493, 346757, 345806, 344824, 343670, 342332, 340896, 339386, 337876, 336489, 335237, 334151, 333292, 332881, 332801, 333065, 333587, 334378, 335109, 335790, 336318, 336637, 336723, 336649, 336385, 335894, 335305, 334667, 333826, 332918, 332015, 331033, 330101, 329309, 328529, 327946, 327480, 327087, 326909, 326989, 327425, 328309, 329591, 331033, 332525, 333783, 334734, 335274, 335458, 335385, 335041, 334397, 333587, 332684, 331776, 330782, 330094, 329659, 329628, 330512, 332684, 336956, 344290, 356202, 374031, 399316, 432671, 474460, 523275, 577196, 633793, 689488, 741642, 786751, 824126, 851676, 870646, 880091, 882331, 878054, 868848, 855788, 841586, 824875]
68874H24875j5478j4367j4073j2029j3140j2470j3005j6442j8755k1633k4684
70691F48799k8115l0281l1858l2091l1202k8998k5948k3088j9025j5896j2740
72525C69557r937p462n732m217l099k289j786j277j006o94o26m48l86l69k08
75026C30021k58k45p4k95k51j91k51k70k27j97j72j35j04om9J72J72L25L13M05
78377C28683K15K51J48P3l0j29k46k64m17k52m78k77r8k02J35K08M73Q90J215
81545C29898J798K424K952L609M425N180N443N530N616N413M977M529L744L154
83879C88692J995R94J97r03j595k320k860l646l743m100m100m069m044l750l541
86380C53207l369l081k737k388j927j577r51l68M11J374K584M075N714P622R814
$$ y = [824875, 809397, 795030, 780957, 768928, 755788, 743318, 730313, 713871, 695116, 673483, 648799, 620684, 590403, 558545, 526454, 495252, 466254, 440306, 417218, 398193, 382297, 369557, 359620, 352158, 346426, 342209, 339110, 336821, 335035, 333758, 332752, 332058, 331432, 330984, 330598, 330229, 330021, 329763, 329518, 329444, 329149, 328898, 328707, 328456, 328186, 327959, 327762, 327590, 327455, 327351, 327345, 327296, 327468, 327640, 327965, 328278, 328683, 328898, 329149, 329297, 329370, 329340, 329211, 328965, 328701, 328284, 328032, 327554, 327277, 327179, 326977, 327112, 327320, 327793, 328683, 329898, 331696, 334120, 337072, 340681, 345106, 350286, 355729, 361259, 366875, 372288, 377265, 381794, 385538, 388692, 390687, 391681, 391878, 390975, 389380, 387060, 384200, 380554, 376811, 372711, 368611, 364542, 360498, 356748, 353207, 349838, 346757, 344020, 341632, 339705, 338128, 337177, 336809, 337220, 338594, 341178, 345253, 350967, 358589, 368403]
88881C68403J2016J4085J6423J7448J9228K0179J9173J8970J7368J4564J2311
90698E50168Q561N033J012k921o677r703j2305j4858j6325j6957j7878j6705
92699D50445j6700j5643j3723j2170j0470q525o438m332j903O51L608P040J1255
94849C83095J5859K1854K7452L4522M1683M8908N6087O2833O8215P2063P3701
96683I06272P3831P2081O7055O0138M8717L9309K6746J2372m78j6172k8182l9738
98717A221951m9717n7813o3814o7153o7184o5367o2428n8420n3326m7391m1850
100535E87488l6050l0195k5592k0725j7859j3864j1495q905o960n180l258j842
102535D05563o01M73J282J989K547K853K682K572J810J479M73k09j276j989k651
$$ y = [368403, 380419, 394504, 410927, 428375, 447603, 467782, 486955, 505925, 523293, 537857, 550168, 558729, 563762, 564774, 561853, 555176, 545473, 533168, 518310, 501985, 485028, 467150, 450445, 433745, 418102, 404379, 392209, 381739, 373214, 366776, 362444, 360541, 361192, 364800, 371840, 383095, 398954, 420808, 448260, 482782, 524465, 573373, 629460, 692293, 760508, 832571, 906272, 980103, 1052184, 1119239, 1179377, 1228094, 1267403, 1294149, 1306521, 1306043, 1289871, 1261689, 1221951, 1172234, 1114421, 1050607, 983454, 916270, 850903, 788475, 730055, 676729, 629338, 587488, 551438, 521243, 495651, 474926, 457067, 443203, 431708, 422803, 415843, 410663, 407405, 405563, 404962, 405435, 406717, 408706, 411253, 414106, 416788, 419360, 421170, 422649, 423122, 422913, 421637, 419648, 416997]
105036D16997l105l480l406l161k780j964r33Q04K148M247O002P739Q844J1697
107354D39649J2226J4410J3354J5135J4170J4582J3030J2636J1268R973Q248P236
109354E85917O137N475M283M088M050L670L609L885L965M105M266L964M075L413
111689F44902K553J356K21j191k381l891n235o603q384r592j1348j1722j2857
113889E75828j3502j3821j3778j4404j3717j4146j2618j3066j1734j1219j0550
115707D33273r709r458q230p223p279o192n781n229m677m191l953l412l106k853
118041C51980k658k301k173j933j620j430j221j173p91o32l75m9L19O94J276J755
120708C39668K560L191M100N167O107P438Q482R819J0924J2741J3312J4594J5416
$$ y = [416997, 413892, 410412, 407006, 403845, 401065, 399101, 398168, 398972, 401120, 405367, 411369, 419108, 427952, 439649, 451875, 466285, 479639, 494774, 508944, 523526, 536556, 549192, 560460, 570433, 578681, 585917, 592054, 597529, 601812, 605900, 609950, 613620, 617229, 621114, 625079, 629184, 633450, 637414, 641489, 644902, 647455, 648811, 649032, 647841, 645460, 641569, 636334, 629731, 621347, 611755, 600407, 588685, 575828, 562326, 548505, 534727, 520323, 506606, 492460, 479842, 466776, 455042, 443823, 433273, 423564, 414106, 405876, 398653, 391374, 385182, 379401, 374172, 369495, 365304, 361351, 357939, 354833, 351980, 349322, 347021, 344848, 342915, 341295, 339865, 338644, 337471, 336680, 336048, 335673, 335624, 335943, 336637, 337913, 339668, 342228, 345419, 349519, 354686, 360793, 368231, 376713, 386532, 397456, 410197, 423509, 438103, 453519]
122876D53519J6595J5699J6737J5846J5373J4674J2919J1489Q997O671M333K001
124860E94853n77l173n413q046r973j1740j3115j4300j4600j5448j4901j5631
126861D67936j4030j3741j2121j1875r820q205p390n265l940k339n89J185K743
129061C82549M425O014P077R469J0292J0845J2833J3305J4159J3900J4938J3410
131062E13216J3569J2091J1519R912Q340O076L780J627o02k381m541o751q955
133213E56900j0513j1660j3269j3348j4453j3300j4680j3440j3668j2366j2545
135047D13658j0537j0151r089q206p309o352n517m787m069l456k859k345k007
137198C36974j700j301j098q17o56n22m30l43l32l19j41k03r2j78j16j17j29j71
$$ y = [453519, 470114, 485813, 502550, 518396, 533769, 548443, 561362, 572851, 581848, 588519, 592852, 594853, 594276, 591103, 585690, 577644, 567671, 555931, 542816, 528516, 513916, 498468, 483567, 467936, 453906, 440165, 428044, 416169, 406349, 398144, 390754, 385489, 381549, 379210, 378621, 379806, 382549, 386974, 392988, 400065, 409534, 419826, 430671, 443504, 456809, 470968, 484868, 499806, 513216, 526785, 538876, 550395, 560307, 568647, 574723, 578503, 580130, 579528, 577147, 572606, 565855, 556900, 546387, 534727, 521458, 508110, 493657, 480357, 465677, 452237, 438569, 426203, 413658, 403121, 392970, 383881, 375675, 368366, 362014, 356497, 351710, 347641, 344185, 341326, 338981, 336974, 335274, 333973, 332875, 332058, 331402, 330880, 330450, 330107, 329775, 329456, 329315, 329112, 329020, 328842, 328726, 328609, 328480, 328309]
140215C28309j23j78j84o2j59p4j59j72j97l7j10q6l7q6l6r3Pk5J8L1O8M9m9J22
144200C26737P4l1J72J35J9M9J22Q0J35J3J8J8J3j3j8m9%o8j53m3j04j48l0j11
148218C26817j72n5j96o8q0l0o8j04R8J2J9J53K46K14L50M36P43Q10R94J375J749
151703C33243K093K589K983L646M357N223O014O935P874R114J0237J1513J2944
153903D18765J3575J5153J6895J6614J9240J9283K0155K0798K0873K1143K0700
155721F23194K0315J9933J8976J7632J5988J3459J2035J0089P635M247J859j166
157721G64196m234o383r500j0783j3852j5429j7608j8970j9737k0400k0952k0848
159705E85500k0946k0265k0296j9406j8559j7258j5729j4975j3134j2820j0611
$$ y = [328309, 328186, 328008, 327824, 327762, 327603, 327529, 327370, 327198, 327001, 326964, 326854, 326768, 326731, 326645, 326609, 326516, 326523, 326498, 326516, 326547, 326615, 326664, 326615, 326737, 326811, 326780, 326952, 327087, 327106, 327155, 327277, 327357, 327492, 327505, 327523, 327541, 327554, 327541, 327523, 327474, 327474, 327406, 327253, 327210, 327106, 326958, 326928, 326817, 326645, 326590, 326394, 326326, 326246, 326216, 326148, 326044, 326142, 326154, 326173, 326326, 326572, 326786, 327136, 327572, 328315, 329125, 330119, 331494, 333243, 335336, 337925, 340908, 344554, 348911, 354134, 360148, 367083, 374957, 384071, 394308, 405821, 418765, 432340, 447493, 464388, 481002, 500242, 519525, 539680, 560478, 581351, 602494, 623194, 643509, 663442, 682418, 700050, 716038, 729497, 741532, 751621, 759256, 763503, 765362, 764196, 759962, 753579, 744079, 733296, 719444, 704015, 686407, 667437, 647700, 627300, 606348, 585500, 564554, 544289, 523993, 504587, 486028, 468770, 453041, 438066, 424932, 412112, 401501]
161573D01501j0176q843p960o850n953n247m566l848l357k848k326k068j589j467
163907C34403j307r76q35p36o14m48m17l75k21k82k58j96j60q0j90j59j60j04
166875C26885o8q0j22p4oj17r2q6j2l7m3om9j8j23Ok5l0M3k5j59M3j9q0%l0j9
171409C25657or2L1q0j8p4L7k5%%q6J9j9j2K5%r3M3j2o1l7oo8n5OJ9j05j2p4J9
176411C24921j9J3L6j2k4Ok5n5J10n5M3OJ9m9p4K5J04k5OR3q0o2l0J04J8N0OK4
181080C25074L7m9L7l1ok5j2j2q6%q6j2o2%l6n0J3l7p4l7k4L7k5M9J3j9J9o2P4
185915C24608p4R2j8L7m3J8j2%M3N5O7p3O7J3O1l7J9P9oJ9j3ol0l7%j3k4OOp3
190916C24731l1m3%L7m3n5p4M9m3n5%p4Oo7O1m9K5o8K5j9n5r8p4%%op4L7j23n5
$$ y = [401501, 391325, 382482, 374522, 367672, 361719, 356472, 351906, 348058, 344701, 341853, 339527, 337459, 335870, 334403, 333096, 332120, 331285, 330549, 329935, 329487, 329070, 328695, 328474, 328192, 327934, 327738, 327578, 327498, 327308, 327149, 326989, 326885, 326817, 326737, 326615, 326541, 326535, 326418, 326326, 326240, 326228, 326191, 326148, 326142, 326093, 326075, 325952, 325958, 325933, 325903, 325946, 325921, 325762, 325805, 325786, 325706, 325706, 325676, 325657, 325651, 325559, 325590, 325510, 325492, 325418, 325455, 325430, 325430, 325430, 325344, 325363, 325344, 325332, 325357, 325357, 325264, 325307, 325295, 325234, 325197, 325191, 325123, 325068, 325074, 325093, 324988, 324976, 324902, 324921, 324902, 324915, 324951, 324939, 324915, 324921, 324896, 324841, 324951, 324896, 324939, 324945, 324964, 324915, 324841, 324866, 324970, 324945, 324951, 325044, 324964, 324902, 324872, 324976, 324994, 325044, 325050, 325074, 325111, 325062, 325099, 325068, 325062, 325037, 325025, 325013, 324927, 324927, 324841, 324829, 324767, 324767, 324731, 324681, 324694, 324657, 324583, 324546, 324522, 324559, 324534, 324583, 324596, 324577, 324596, 324534, 324608, 324534, 324626, 324608, 324645, 324602, 324620, 324608, 324608, 324651, 324706, 324773, 324700, 324767, 324780, 324841, 324804, 324823, 324902, 324896, 324915, 324902, 324896, 324866, 324829, 324829, 324816, 324792, 324798, 324804, 324731, 324700, 324657, 324657, 324694, 324651, 324596, 324522, 324571, 324528, 324473, 324473, 324399, 324405, 324338, 324399, 324350, 324375, 324307, 324332, 324313, 324258, 324160, 324086, 324086, 324086, 324080, 324006, 324043, 323920, 323865]
195918C23865%q0r2O8m9l7l1m3J9j23M9p4oL1p4J3j9oj2Q6q6J2%%j2j3k4m9K4
200736C23337O2%l7J2l7%L1OM9%K5n5J8j2J8L1%L7J2l7O2J2L7M9M3k5P4o8K5J16
205738C23785j2J2L1N5M9k4P4O1OM9%%%%L1O7%p3R2l7l1m9OJ11r8P3o7k5j8j3
210740C24055m3n5k4N5j23J9m3n6K5j23L7oK4Pj35J2k5L7j23%L7j2n5k5j2p4l0
215241C23344O7k5o1p4P4q0%ON0q0L0N0r9k4O7l0K4j2m9O1J2M3M3%L1l1Q0K5o
220077C23436P3L1L7K4J11k5L1P4R8M3O1R2R2R8J3J10O2%J47%M9R8m9J10k4P4
224395C24866j9M9M9J9p4O1o1m3L1o2p3l7l7k4p4m9L7p4j2r2l1q6l1j8p4J9j66
228930C23994L7o8p3n5p4J2j29K5%j05p3J8m9j2l1or8%j17O%n5j8J8m9J8j8j8
$$ y = [323865, 323865, 323785, 323693, 323761, 323712, 323675, 323644, 323601, 323620, 323497, 323546, 323472, 323466, 323497, 323423, 323436, 323417, 323411, 323399, 323485, 323399, 323411, 323411, 323411, 323399, 323386, 323362, 323313, 323337, 323399, 323399, 323362, 323374, 323337, 323337, 323368, 323374, 323423, 323423, 323448, 323393, 323411, 323399, 323417, 323448, 323448, 323485, 323497, 323460, 323522, 323534, 323571, 323620, 323663, 323638, 323712, 323644, 323669, 323785, 323773, 323785, 323816, 323871, 323920, 323896, 323970, 324031, 324037, 324086, 324086, 324086, 324086, 324086, 324117, 324184, 324184, 324111, 324203, 324166, 324135, 324086, 324092, 324203, 324105, 324178, 324111, 324086, 324068, 324055, 324012, 323957, 323933, 323988, 323865, 323884, 323841, 323785, 323810, 323687, 323724, 323718, 323742, 323749, 323614, 323626, 323601, 323638, 323515, 323515, 323552, 323540, 323485, 323460, 323448, 323374, 323344, 323411, 323386, 323325, 323251, 323325, 323245, 323245, 323251, 323301, 323221, 323251, 323301, 323202, 323178, 323245, 323215, 323239, 323227, 323178, 323239, 323251, 323294, 323337, 323337, 323368, 323337, 323417, 323442, 323436, 323509, 323540, 323577, 323601, 323712, 323687, 323718, 323792, 323890, 323933, 323994, 324086, 324178, 324276, 324289, 324399, 324461, 324461, 324608, 324608, 324657, 324755, 324706, 324816, 324792, 324866, 324847, 324896, 324945, 324964, 324890, 324951, 324890, 324847, 324878, 324816, 324743, 324706, 324669, 324645, 324571, 324522, 324559, 324485, 324473, 324381, 324350, 324264, 324233, 324215, 324141, 324160, 323994, 324031, 323963, 323890, 323835, 323761, 323773, 323644, 323669, 323669, 323564, 323491, 323509, 323460, 323448, 323417, 323411, 323313, 323313, 323196, 323202, 323202, 323147, 323129, 323147, 323098, 323116, 323098, 323080]
233598C23080J8oL1O%J8OO2j3k4R2k5OO2j35J2K5%OP3n5J2J3J2l7L7M9j2j9l0
238600C23264J2m9J2%OP4m3p4M9m9O8oM9m9%o8L1k5P4o1N5K4J9l7m9%l1%M3o1
243601C23178%L7%m3M3L6l0m9%oj9J9o8%N5k4J8Ol7L7M3m9k4R2%m9m3R2%q6O7
248770C23196L1M3n5j3oK5m3M9l7P4o2p3J10%m3P4j9K5%l7m9O1R9k5K5L6l6l7
253438C23313Q0po7R2l7K5l7R8j8M9%P3j04Q6J8n5k4P9j8K5pj8l1L1K5M9oON5
258257C23675j2m3N5J2Q6l7L1n5j9M9k4k5%O8%Om9M3Ok5m3O8J8m3j8M9k4pm3K5
263258C23724om3M3k5o7K4j2P4%%J2n5J8j2M3m3R8j10P3k4M9k5j2L7P4n0P4p4
267927C23785O2o2Q0k4m9%j9L7o8K5M3j8K4j8o2J3M3pj8M3r8N5r2k5m9M9l0L0
$$ y = [323080, 323098, 323092, 323123, 323129, 323129, 323147, 323153, 323215, 323202, 323178, 323270, 323245, 323251, 323313, 323178, 323190, 323215, 323215, 323221, 323294, 323239, 323251, 323264, 323276, 323239, 323276, 323325, 323313, 323294, 323264, 323276, 323227, 323239, 323239, 323245, 323319, 323276, 323202, 323251, 323202, 323270, 323264, 323313, 323264, 323264, 323196, 323227, 323202, 323276, 323215, 323270, 323294, 323313, 323276, 323227, 323227, 323196, 323196, 323239, 323178, 323178, 323215, 323215, 323172, 323215, 323251, 323221, 323172, 323172, 323166, 323147, 323166, 323098, 323098, 323153, 323129, 323147, 323153, 323116, 323153, 323196, 323147, 323123, 323215, 323215, 323166, 323123, 323215, 323215, 323129, 323196, 323227, 323270, 323215, 323202, 323196, 323221, 323178, 323227, 323190, 323264, 323202, 323129, 323239, 323239, 323196, 323270, 323251, 323276, 323276, 323239, 323190, 323251, 323350, 323325, 323350, 323386, 323350, 323313, 323393, 323386, 323319, 323411, 323374, 323399, 323362, 323460, 323442, 323491, 323491, 323564, 323460, 323546, 323564, 323509, 323485, 323564, 323546, 323571, 323564, 323546, 323515, 323546, 323571, 323620, 323614, 323620, 323675, 323663, 323620, 323675, 323687, 323773, 323736, 323767, 323712, 323693, 323742, 323718, 323693, 323693, 323761, 323761, 323767, 323718, 323761, 323767, 323742, 323699, 323767, 323785, 323742, 323724, 323773, 323749, 323742, 323699, 323724, 323718, 323675, 323718, 323693, 323626, 323650, 323638, 323712, 323712, 323712, 323724, 323669, 323687, 323675, 323718, 323675, 323773, 323663, 323736, 323712, 323761, 323736, 323724, 323761, 323835, 323785, 323859, 323785, 323847, 323785, 323865, 323841, 323792, 323792, 323773, 323810, 323742, 323767, 323810, 323792, 323816, 323798, 323736, 323749, 323792, 323785, 323767, 323810, 323712, 323767, 323675, 323650, 323601, 323650, 323620, 323650]
272595C23650%k4n5M9o8M3%M3o1l1l7O2o2o1R2j8L0%l7j8l1r2O8l1J04oj2j2R2
277413C23577o8j8j9P4j10J2K4%k4j2l7l1N5o1o8O8K4p3J23j9l1L7ok4L0j2N5
281915C23466l0P3m3R8l0j2L0J9%J8l7m3J17q6l1N5J3j3J3q6M9L1O7l7oJ9l7J2
286616C23589j2l1%m9%P4r9N0q6j3ok4M9l1m9Oo7K4k4%J8m3J2m9o1L7O1j2m3m3
291618C23178q0M3O1p3l7N5K5m3J8J9p4N5j8%M9J2L7m9K4k4oO7M9o7K4m3R2m9
296287C23245OM3p3%%M3j3p9M3N5ok5Om3K5l7j8M9m9m9k5j8%L6m3J9j9m9M3%M9
301455C23116K5Ol1j8M3j8M3j9m3J2L7%%j2j8K4L1k5M3k4k5L1o2m9N6n0P4n5J2
306290C23104p3K4M3j8P3%l7P4o7M3j9L1K4K5m9L7L6k4l1M9m9O8m3L0q5N5Oj2
$$ y = [323650, 323650, 323626, 323571, 323620, 323552, 323595, 323595, 323638, 323577, 323546, 323509, 323571, 323509, 323448, 323540, 323522, 323552, 323552, 323515, 323497, 323466, 323374, 323442, 323411, 323515, 323509, 323497, 323485, 323577, 323509, 323491, 323472, 323546, 323436, 323448, 323472, 323472, 323448, 323436, 323399, 323368, 323423, 323362, 323294, 323362, 323386, 323313, 323436, 323417, 323386, 323423, 323417, 323393, 323423, 323411, 323466, 323436, 323509, 323466, 323564, 323534, 323522, 323552, 323571, 323571, 323589, 323552, 323509, 323626, 323540, 323509, 323564, 323577, 323564, 323577, 323491, 323540, 323571, 323638, 323601, 323595, 323614, 323577, 323589, 323577, 323546, 323546, 323497, 323497, 323571, 323472, 323522, 323436, 323423, 323417, 323393, 323442, 323411, 323362, 323368, 323301, 323325, 323301, 323301, 323319, 323276, 323288, 323239, 323178, 323215, 323276, 323264, 323221, 323178, 323098, 323141, 323202, 323129, 323092, 323147, 323172, 323129, 323147, 323166, 323092, 323147, 323129, 323129, 323178, 323190, 323227, 323178, 323202, 323178, 323172, 323239, 323288, 323221, 323245, 323202, 323294, 323245, 323251, 323294, 323221, 323221, 323221, 323264, 323251, 323172, 323215, 323270, 323264, 323239, 323245, 323202, 323227, 323190, 323172, 323221, 323172, 323123, 323098, 323080, 323080, 323116, 323073, 323092, 323073, 323024, 323067, 323067, 323116, 323141, 323147, 323116, 323098, 323141, 323123, 323166, 323147, 323104, 323116, 323153, 323153, 323153, 323141, 323123, 323147, 323178, 323153, 323196, 323172, 323147, 323178, 323116, 323067, 323123, 323073, 323147, 323092, 323104, 323031, 323055, 323098, 323080, 323153, 323153, 323116, 323190, 323123, 323166, 323147, 323178, 323202, 323227, 323178, 323215, 323251, 323227, 323196, 323245, 323196, 323264, 323221, 323251, 323166, 323221, 323227, 323215]
310958C23215L6O8%m3%L7j9K5%M3O1j35%N6K4q0P4o8N0pj8m3J8o%%k4j17O8k5
315960C23190Ol0L0ok4%K4J2j2j8m3O1r2Ol1j8K5l1J8j2J8l0K4L1m3L7N5L1j2
320778C23166m3R2%L6O8%oJ2J9n0K5Q0J8OL7j8M3k5%o1J10o1O7J9j9p3K4K5P3
325613C23564k4m9J04m9L1%o2L7j8l7%j2J04k5n5N5%L1On5%%N5o1Q6j11L7l0k5
330448C23497P4l1L7o2L1j2J8L7m3R2K5p4K5P3j53L0N6m3o%l7J2k4k5l1K5%L1
335117C23522N5o8k4N5m3N5l7Pl7%J10m3o1P3n5M3n5%L7o2N0N5o8R2o7J2m9m9
339768C23448m9L7O1p4Q6K5o2L7q6L7j2Q6q6O1k4k5Q6k4K4q6R2l0j11Q6j29M9
344137C23417oj2k5n5N5%q6j8L1%J8%K5j05L1j9ooL7J8j8J2p3P9m3L7j8%l1l7
$$ y = [323215, 323251, 323319, 323319, 323276, 323276, 323313, 323294, 323319, 323319, 323362, 323423, 323288, 323288, 323344, 323368, 323288, 323362, 323294, 323344, 323337, 323319, 323276, 323294, 323288, 323288, 323288, 323264, 323147, 323215, 323190, 323196, 323166, 323196, 323190, 323166, 323166, 323190, 323202, 323190, 323172, 323129, 323190, 323098, 323104, 323073, 323055, 323080, 323049, 323067, 323055, 323073, 323043, 323067, 323098, 323055, 323092, 323147, 323178, 323166, 323123, 323215, 323215, 323251, 323319, 323319, 323313, 323325, 323344, 323294, 323319, 323399, 323417, 323423, 323460, 323442, 323485, 323460, 323460, 323399, 323509, 323448, 323515, 323534, 323515, 323442, 323466, 323491, 323564, 323540, 323491, 323595, 323546, 323577, 323577, 323515, 323552, 323534, 323497, 323497, 323485, 323589, 323564, 323509, 323564, 323564, 323595, 323601, 323546, 323546, 323546, 323601, 323540, 323626, 323515, 323552, 323522, 323497, 323571, 323540, 323577, 323515, 323546, 323534, 323552, 323589, 323546, 323638, 323663, 323589, 323614, 323687, 323534, 323564, 323620, 323577, 323571, 323571, 323534, 323546, 323522, 323497, 323466, 323491, 323491, 323522, 323577, 323509, 323485, 323540, 323497, 323552, 323515, 323522, 323485, 323485, 323595, 323552, 323491, 323564, 323509, 323552, 323497, 323497, 323534, 323472, 323522, 323577, 323509, 323601, 323534, 323546, 323497, 323448, 323399, 323436, 323497, 323423, 323509, 323534, 323472, 323509, 323423, 323460, 323448, 323534, 323448, 323509, 323485, 323460, 323546, 323522, 323546, 323460, 323552, 323522, 323411, 323497, 323368, 323417, 323411, 323399, 323374, 323319, 323374, 323374, 323288, 323270, 323301, 323301, 323319, 323319, 323344, 323239, 323270, 323251, 323245, 323239, 323276, 323294, 323276, 323288, 323215, 323294, 323251, 323288, 323270, 323270, 323239, 323202]
349138C23202l0P3%Or8j2P4m3OJ2o7P3m3J3m3M9oJ2oM9n5j9m3M9oOm9P4l1k4L0
354273C23153l0O7OK5K4K5M3j9P4L1M9J8J23L7P3O8J04R9J16Q0J35J84J84O2J71
358475C24902J91K70J53K39J91J84J84K58K14K15K83K82K21J78K70L44K27K33
361476C29039K82K46K08K03K02K34K57J60J53J91J10R8M9K21R8R3R2k5J23M9j2
364944C32071n6o7L7%j3l6q6l1j04r9q5M9k21j35r9k20k5j90j05j22k5k33j11
368812C30094j96j41j29q6k02j97j53j91j28j42r8k15j28j23j54k33j53k15j04
371946C27106j91l6j42j53j23l7j28p4j72m9n5k09oj17p9n6j16n6j10r8q6m9j35
375798C24829l1o7q6m9q6o2r8r8o8%M3j2j23or2M9p3pm9L1o1Oj05p3L7q0K4o%
$$ y = [323202, 323172, 323245, 323245, 323251, 323153, 323141, 323215, 323172, 323178, 323190, 323123, 323196, 323153, 323166, 323123, 323172, 323166, 323178, 323172, 323221, 323166, 323147, 323104, 323153, 323147, 323153, 323104, 323178, 323147, 323123, 323153, 323123, 323190, 323196, 323221, 323245, 323270, 323313, 323294, 323368, 323399, 323448, 323466, 323589, 323626, 323699, 323767, 323871, 323970, 324086, 324166, 324301, 324485, 324669, 324731, 324902, 325093, 325363, 325516, 325755, 325946, 326130, 326314, 326572, 326786, 327001, 327284, 327566, 327787, 327965, 328235, 328579, 328806, 329039, 329321, 329567, 329775, 329978, 330180, 330414, 330671, 330831, 330984, 331175, 331285, 331383, 331432, 331653, 331751, 331844, 331936, 331911, 332034, 332083, 332071, 332015, 331948, 331985, 331985, 331972, 331936, 331850, 331819, 331715, 331616, 331531, 331580, 331359, 331224, 331125, 330905, 330880, 330690, 330585, 330463, 330438, 330205, 330094, 329898, 329757, 329628, 329542, 329340, 329143, 328990, 328799, 328671, 328529, 328431, 328216, 328088, 327965, 327811, 327578, 327425, 327210, 327106, 326915, 326879, 326737, 326584, 326461, 326424, 326296, 326222, 326050, 326001, 325946, 325737, 325731, 325614, 325535, 325479, 325363, 325307, 325197, 325099, 325013, 324964, 324829, 324798, 324731, 324645, 324596, 324510, 324448, 324350, 324252, 324184, 324184, 324227, 324215, 324092, 324086, 323994, 324043, 323970, 323963, 323914, 323945, 323884, 323890, 323785, 323712, 323749, 323669, 323693, 323687, 323687]
380633C23687j2o1n0POk5o1L1j11J2J9m3m9l7R8m3j17%%j2OM9J9p4o7l1Q0m3J8
385468C23196oj8M3q6K4j2j8p4J04o1k5m3M3q6O8K4m2J2O1l7j8OR2o%j8%r9j8
390303C23006p4J9oP3l7M3r8M3%%j2P4J2j9l0k5j8j9M9m9O8l1r2N5M3J9m9J2k5
395138C22932j2M9k4J2q6Q0l1j2O1r8j2J2L1M3k5K5j9%N5j2K5m9Ol1%j2K4ok4
399956C22902l1Oj8l1k5K5K5j9L7k5Pm3R8q6Q0m3Q6m3l1k5POM3j9O2m3k5M3M9
404791C22969OJ9l7om3%K4o1OM9m3K5m9O1m9L1q0L7M9k5n5K5l1K4j2M3Oon5M9
409793C22871OL1L7m3OO1L1l1k4J2K4O8Om9O1k4M9L7j3J3Q6M9%l7J8J9%m9OL0
414795C23251K5j23O2L0L1%J8k4q0K5m3%N5m9J10m3%oOj8O7%N0%n6J3J8m3%oN5
$$ y = [323687, 323675, 323614, 323564, 323571, 323577, 323552, 323491, 323522, 323411, 323423, 323442, 323399, 323350, 323313, 323411, 323368, 323251, 323251, 323251, 323239, 323245, 323294, 323313, 323239, 323172, 323141, 323221, 323178, 323196, 323190, 323172, 323215, 323129, 323153, 323141, 323123, 323049, 323153, 323092, 323067, 323024, 323067, 322981, 323049, 323073, 323031, 323043, 323104, 323067, 323049, 323055, 323147, 323141, 323141, 323123, 323123, 323024, 323006, 322932, 322951, 322945, 323018, 322981, 323024, 322926, 322969, 322969, 322969, 322957, 323031, 323043, 323024, 322994, 322969, 322951, 322932, 322981, 322932, 323000, 322969, 322877, 322932, 322975, 322994, 322945, 322957, 322932, 322920, 322969, 322945, 322957, 322871, 322951, 322920, 322908, 322969, 322871, 322859, 322871, 322902, 322945, 322920, 322945, 322926, 322926, 322981, 322969, 322994, 322945, 322951, 322920, 322920, 322908, 322932, 322926, 322902, 322871, 322877, 322859, 322828, 322803, 322828, 322853, 322834, 322871, 322846, 322853, 322810, 322908, 322822, 322902, 322859, 322945, 322902, 322871, 322846, 322853, 322859, 322902, 322883, 322945, 322902, 322877, 322920, 322969, 322975, 322994, 322957, 322951, 322908, 322908, 322932, 322871, 322877, 322926, 322883, 322908, 322859, 322920, 322871, 322902, 322822, 322859, 322908, 322883, 322828, 322853, 322822, 322846, 322834, 322877, 322883, 322877, 322822, 322871, 322877, 322908, 322945, 322902, 322908, 322969, 323000, 322969, 322945, 322957, 322981, 323049, 323055, 323006, 323067, 323043, 323092, 323129, 323116, 323129, 323215, 323264, 323264, 323227, 323245, 323264, 323264, 323215, 323221, 323251, 323276, 323153, 323215, 323245, 323276, 323276, 323294, 323270, 323190, 323215, 323172, 323172, 323227, 323178, 323288, 323245, 323245, 323239, 323245, 323227, 323294, 323294, 323344, 323344, 323288, 323301, 323319, 323276, 323276, 323270, 323325]
419963C23325%l1L1l1L1oj8J8M9r2oL1l1q0Q0%m3L7j9l0Oj9M3l0L6J3j9r2O8j9
424965C23202%on5J23j11%k4p4O8K4O8j9m3j2ON5m9oJ9%l7l1M3l7M9q0M3K5r8
429800C23043j2K4%n5Q0l7j9m3%oJ9j9oL7k5l6J10n5M3k5M9r2%L1J8o7J2j2m9
434635C22908l1j8q0j9oK5o8M3K5j9q5J2J8K5m3k5Q6j16P3oL7n5m9M3j9%k4j9
439303C22613o%L1K4n5%m3J41l0L0J9L6j2j2q0M3O1N0j3k4%M9o2J3ON5%K5J8L1
444305C22908o2L7M9p3o2M9K5j8Oon0l0j3R9o2m3K5m3M3%R8%%k4M3L6j2J2J3%
449307C22945k5j8J8k4Om3J8m9M9m3O8n6J3%%J8%l1m9Q0q0Q0p4M3O2k5%l7o1J2
454309C22797J35l6n0N0j11m9R2r2R2k5l0K4m9J2J9K4O8o1j3m3M3o7j9K5O1j8
$$ y = [323325, 323325, 323294, 323325, 323294, 323325, 323319, 323301, 323319, 323368, 323276, 323270, 323301, 323270, 323190, 323270, 323270, 323227, 323264, 323245, 323215, 323221, 323202, 323245, 323215, 323251, 323264, 323245, 323153, 323221, 323202, 323202, 323196, 323141, 323264, 323153, 323153, 323129, 323055, 323123, 323147, 323215, 323196, 323153, 323141, 323147, 323202, 323153, 323147, 323166, 323166, 323129, 323098, 323141, 323104, 323153, 323073, 323116, 323141, 323043, 323031, 323055, 323055, 323000, 323080, 323043, 323024, 322981, 322981, 322975, 322994, 322975, 322969, 323006, 322981, 322945, 323055, 323000, 323043, 323018, 323067, 322975, 322975, 323006, 323024, 322957, 322969, 322957, 322908, 322877, 322859, 322779, 322760, 322754, 322779, 322711, 322754, 322779, 322760, 322675, 322687, 322705, 322730, 322687, 322662, 322748, 322632, 322705, 322699, 322736, 322681, 322632, 322675, 322656, 322656, 322632, 322613, 322607, 322607, 322638, 322662, 322607, 322607, 322564, 322705, 322675, 322705, 322724, 322760, 322748, 322736, 322656, 322699, 322760, 322810, 322797, 322773, 322773, 322822, 322760, 322773, 322779, 322834, 322834, 322859, 322877, 322908, 322846, 322883, 322932, 322859, 322797, 322846, 322871, 322853, 322859, 322853, 322803, 322773, 322760, 322859, 322797, 322754, 322779, 322736, 322779, 322779, 322877, 322877, 322877, 322853, 322896, 322932, 322920, 322932, 322945, 322945, 322920, 322902, 322920, 322896, 322902, 322859, 322877, 322828, 322877, 322834, 322902, 322846, 322859, 322859, 322859, 322877, 322877, 322846, 322797, 322877, 322797, 322877, 322803, 322846, 322908, 322883, 322883, 322846, 322785, 322797, 322932, 322896, 322846, 322896, 322785, 322736, 322828, 322736, 322828, 322803, 322773, 322797, 322748, 322760, 322779, 322803, 322871, 322810, 322797, 322754, 322797, 322730, 322711, 322736, 322797, 322779]
458677C22779p4O8q6Q6m3R2o2Q6l6J2M9%%O1p9P9op3P9q6J3M9l1%J9p4P4o2%L7
463678C22871j2j3m3K5%J8m9%%OR9j78L0OK5o1J53j8O1j23R9OK4OP4m9M9ook5
468680C22969OJ9q6M9p4M9J9n5OK4M9K5m3M3k5j8M9K5O7k5%j8m9J8j8R2o7pk4
473515C23000OK5pK5o%j2n0K5om3O7p3%k5oj8k5O%J9Ool1Ok4J8Ok4J8k5j2l1j8
479184C22785n5K4oj2n5n6j2%M9%k4j3o7%P4m9N5j3m2J8O1j2%Q0%m3oj9J3K4M9
484319C22748%j8%K4n5L1K4o7l1P4M9%m3J41o7K4L7L1l1j8OJ8n5j2j3R9k5%L7
489187C22908L7o8m3P4l7P4Oom3l1K5L0oL1l1j8j9O2J2k5j2OQ0M9j23J11l7l7
493856C22969j2k5%L7j8m3J8k4M9%M3K4Om3j2L1K4m3K5%%l7M9o1J8M3k4J2j23
$$ y = [322779, 322705, 322773, 322687, 322773, 322730, 322822, 322760, 322846, 322810, 322822, 322871, 322871, 322871, 322932, 322853, 322932, 322926, 322853, 322932, 322846, 322859, 322908, 322877, 322877, 322896, 322822, 322896, 322834, 322834, 322871, 322859, 322846, 322803, 322828, 322828, 322846, 322797, 322797, 322797, 322803, 322902, 322724, 322754, 322760, 322785, 322724, 322877, 322859, 322920, 322797, 322896, 322902, 322926, 322932, 323006, 322957, 323006, 323000, 322994, 322969, 322975, 322994, 322908, 322957, 322883, 322932, 322951, 322896, 322902, 322926, 322975, 323000, 322957, 323000, 322975, 322957, 323006, 323031, 323098, 323073, 323073, 323055, 323006, 323024, 323006, 323098, 323031, 323024, 323000, 323006, 323031, 323024, 323049, 323043, 323043, 323031, 322981, 323006, 323000, 322957, 323024, 322951, 322951, 322926, 322920, 322902, 322877, 322883, 322883, 322902, 322908, 322902, 322871, 322877, 322853, 322871, 322877, 322853, 322871, 322846, 322834, 322803, 322785, 322730, 322754, 322748, 322736, 322681, 322625, 322613, 322613, 322662, 322662, 322638, 322625, 322558, 322558, 322632, 322583, 322638, 322625, 322583, 322601, 322662, 322650, 322650, 322730, 322730, 322687, 322681, 322662, 322675, 322699, 322748, 322748, 322730, 322730, 322754, 322699, 322730, 322754, 322687, 322656, 322730, 322779, 322779, 322736, 322877, 322810, 322834, 322871, 322902, 322871, 322853, 322859, 322877, 322822, 322810, 322797, 322896, 322871, 322871, 322908, 322945, 322877, 322834, 322908, 322871, 322945, 322951, 322945, 322902, 322871, 322896, 322926, 322920, 322951, 322920, 322902, 322883, 322945, 322957, 322932, 322920, 322926, 323006, 323055, 322932, 323043, 323006, 322969, 322957, 322932, 322932, 322969, 322951, 322908, 322926, 322902, 322951, 322951, 322994, 323018, 323024, 322981, 322969, 323000, 323024, 322981, 323006, 323006, 323006, 322969, 323018, 322957, 322975, 323018, 322994, 323006, 322883]
498691C22883O2%J2k5M9j2L7q0J9%l7n5K4%ol7ool7l7O2J8j04j9Q0n5M3%K4m3
503692C22754m3K5L7k5J2J9O7m9k4L0m9O%m9oL1oom3P3j8o1K4L1k5M9o7J2k4J2
508694C22687J2m9N5m9o7O1m9j2m9P3J9q0M9L1OJ2L1j9l7J3J8m3k4P3P4q0M3O
513346C22705L1ooK4OoP4q6j2M9m3M9k5l0%L6%oO8r8L0oK5k5k4r2R8Q0J2m3J8
518531C22797j8n5N5k5l0k5J11J2r8J2oj9L7N5l0j3p3K4k4m9M3%p4M3J2l0OJ2
523183C22650j8K4n5OJ8J3J2OJ9o2k4O7q0K5m9O1J9J8L1m3j3N0j9k4K4j8oJ8p4
528018C22576Q0j8q6O1n5J17q6O7l1k4j2%Q6q6K4K5L7q6K4%Q6o7OoL0%%O2k5J2
533019C22711k4K4L7m9%L7oL0%n5ol7Q6p3N5r2M3o8J9m9%N5m9k5J2r2L1M9ol1
$$ y = [322883, 322945, 322945, 322957, 322932, 322981, 322969, 323006, 322926, 322945, 322945, 322908, 322853, 322877, 322877, 322871, 322834, 322828, 322822, 322785, 322748, 322810, 322828, 322724, 322705, 322785, 322730, 322773, 322773, 322797, 322754, 322711, 322736, 322773, 322748, 322760, 322779, 322846, 322797, 322773, 322803, 322754, 322760, 322760, 322711, 322705, 322736, 322730, 322724, 322681, 322754, 322736, 322675, 322699, 322730, 322705, 322754, 322687, 322699, 322675, 322687, 322699, 322650, 322705, 322656, 322589, 322650, 322601, 322589, 322540, 322613, 322632, 322552, 322601, 322632, 322638, 322650, 322681, 322662, 322625, 322638, 322656, 322613, 322589, 322662, 322736, 322656, 322699, 322705, 322736, 322730, 322724, 322748, 322754, 322748, 322822, 322736, 322724, 322773, 322730, 322779, 322754, 322724, 322724, 322760, 322760, 322754, 322822, 322724, 322754, 322748, 322773, 322748, 322724, 322632, 322730, 322810, 322822, 322779, 322797, 322779, 322724, 322779, 322754, 322724, 322699, 322810, 322822, 322724, 322736, 322730, 322711, 322748, 322803, 322773, 322760, 322687, 322711, 322687, 322638, 322681, 322681, 322607, 322650, 322662, 322632, 322638, 322650, 322632, 322656, 322601, 322607, 322625, 322638, 322650, 322656, 322675, 322613, 322589, 322656, 322576, 322601, 322552, 322613, 322632, 322650, 322681, 322638, 322625, 322675, 322656, 322632, 322656, 322638, 322632, 322650, 322576, 322656, 322638, 322552, 322613, 322558, 322675, 322589, 322656, 322625, 322601, 322589, 322589, 322675, 322589, 322613, 322638, 322675, 322589, 322613, 322613, 322699, 322632, 322638, 322632, 322662, 322662, 322662, 322724, 322699, 322711, 322687, 322711, 322748, 322699, 322699, 322736, 322730, 322760, 322760, 322705, 322699, 322662, 322748, 322675, 322730, 322638, 322681, 322613, 322632, 322583, 322583, 322638, 322589, 322564, 322576, 322484, 322515, 322564, 322558, 322527]
538021C22527k4Oj9J3k5j2%O7m9J9p4J2J9OoN5p4K5%M3q0J11j3N6M9o8L7j2J2
542856C22601j8N5M9M9p4O8%L0oN6j3OM3r2K5K4J9L1L0oK5p4M3L1r2O1%j2p4K5
547858C22810L6p3L7%J59k4o2M3m3l0L0O8o8P4J2q6M9O2K4m3k4L0r8L7m3%%O8
552510C22945k5O1j10k5%j8J23%p4Q0r8J8M9n5l7P4M9J2k4l7J8OM3oK5o2k4O1
557178C22969o1L7m9j9n5J2m9l1oo1%l7j8L0p3M3j9%m9O1l6j3j8K5m3P3ok4L0
562013C22613%J9pK5OL1n5m9J8L1n6J3m9M3OJ2m9j2M3j17J35r8N5m3l7q6M9j2
566715C22429k4M9OM3j3k4K4oK5O7k4Om3%l1R9k5j8K4j2m9Om3j2J2ooN5q0o1J2
571850C22380J2M9%M3K5j9O2J2K5n6R9m9M9K4m3K5k5J9L0n5P4l1m9O%J8j2M9m9
$$ y = [322527, 322503, 322509, 322490, 322503, 322478, 322466, 322466, 322533, 322484, 322503, 322429, 322441, 322460, 322466, 322460, 322515, 322441, 322466, 322466, 322509, 322429, 322540, 322527, 322583, 322632, 322564, 322601, 322589, 322601, 322583, 322638, 322687, 322736, 322662, 322730, 322730, 322760, 322754, 322810, 322797, 322803, 322846, 322754, 322779, 322803, 322822, 322853, 322883, 322877, 322902, 322828, 322871, 322902, 322810, 322871, 322871, 322859, 322785, 322810, 322846, 322773, 322810, 322810, 322969, 322945, 322883, 322926, 322883, 322853, 322883, 322951, 322883, 322957, 322969, 322883, 322932, 322994, 323018, 322975, 322951, 322981, 322883, 322920, 322877, 322877, 322877, 322945, 322920, 322981, 322871, 322846, 322846, 322828, 322951, 322951, 322877, 322957, 322859, 322877, 322926, 322871, 322834, 322908, 322957, 322969, 322945, 322908, 322926, 322932, 322975, 322969, 322994, 322932, 322908, 322969, 322908, 322945, 322896, 322877, 322822, 322834, 322785, 322754, 322748, 322687, 322687, 322650, 322632, 322662, 322589, 322632, 322613, 322613, 322564, 322625, 322589, 322576, 322558, 322583, 322540, 322613, 322607, 322583, 322613, 322613, 322632, 322625, 322650, 322656, 322687, 322632, 322583, 322601, 322632, 322576, 322589, 322540, 322583, 322589, 322601, 322552, 322540, 322583, 322466, 322601, 322503, 322558, 322515, 322478, 322392, 322441, 322429, 322405, 322454, 322460, 322503, 322490, 322466, 322490, 322484, 322509, 322576, 322552, 322558, 322515, 322515, 322484, 322583, 322558, 322540, 322564, 322552, 322503, 322509, 322466, 322454, 322466, 322460, 322454, 322509, 322429, 322368, 322380, 322392, 322441, 322441, 322484, 322509, 322490, 322552, 322564, 322589, 322533, 322632, 322583, 322632, 322656, 322613, 322638, 322613, 322632, 322662, 322607, 322681, 322650, 322601, 322607, 322607, 322625, 322613, 322662, 322613]
576718C22613L7l7Q6%K5K4L1J8Om9P4k5M3j8R2p4J29j41M9l7POl7j9%k4J8o1J2
581553C22748M9o7K4K5j47P3k4M3m9J2n5m9L0q0J9M9m9L7o2M9p3%M9m9O1l1N6
586055C22589l1oO1oOo%Q0r8op4J23n6N6k5M3m3%Oo1L1L0%K5p4%j2L1L0o1O1%
591390C22613o1O%J8M9o1K5l1Oj10L6J9o8P4m9J2k4m3k5%m3O8j05P4o8oj2L7j9
596225C22312n5ON6n6oL7L7N5K5oo2J2O2l1l1j2J9N5M3r8K4j8O1ON5l0o8k4%l7
601227C22331L1J8l7P4n5m3%K4m9P4j3Pl1l7L7q6k5%oP4m3j2r2M9J8%o7M9l1j8
606228C22141n6P4m9J2L7j8m3J8m3n5M3L1%j9p4Q6l6l1k5oOO%n5P4%M9j8R8p4
611230C22073m9M9J2l6k5P4%%%%%K4J3%j3R2%n5N5j8J8oL7J8Pj3L1m3oJ04K5o
$$ y = [322613, 322650, 322613, 322699, 322699, 322724, 322748, 322779, 322797, 322803, 322754, 322828, 322803, 322846, 322828, 322920, 322846, 322975, 322834, 322883, 322846, 322853, 322859, 322822, 322803, 322803, 322779, 322797, 322736, 322748, 322797, 322730, 322754, 322779, 322632, 322705, 322681, 322724, 322675, 322687, 322632, 322583, 322613, 322533, 322552, 322601, 322552, 322589, 322527, 322576, 322503, 322503, 322552, 322503, 322564, 322533, 322589, 322558, 322552, 322613, 322607, 322613, 322607, 322607, 322687, 322589, 322583, 322509, 322632, 322576, 322632, 322607, 322650, 322607, 322607, 322613, 322552, 322583, 322613, 322613, 322638, 322564, 322564, 322552, 322583, 322613, 322552, 322613, 322613, 322552, 322558, 322558, 322576, 322625, 322564, 322589, 322558, 322564, 322454, 322490, 322509, 322441, 322515, 322466, 322478, 322454, 322411, 322386, 322386, 322343, 322411, 322306, 322380, 322312, 322306, 322294, 322331, 322312, 322257, 322263, 322319, 322263, 322257, 322294, 322331, 322386, 322411, 322405, 322343, 322355, 322417, 322386, 322355, 322343, 322362, 322417, 322460, 322362, 322386, 322368, 322429, 322435, 322490, 322460, 322392, 322368, 322368, 322331, 322362, 322380, 322343, 322417, 322362, 322319, 322319, 322343, 322294, 322368, 322355, 322362, 322331, 322294, 322331, 322245, 322220, 322220, 322214, 322288, 322245, 322233, 322141, 322190, 322208, 322208, 322141, 322190, 322159, 322141, 322085, 322159, 322110, 322122, 322159, 322141, 322098, 322116, 322073, 322018, 322061, 322092, 322092, 322073, 321999, 322085, 322049, 322018, 321993, 321987, 321993, 321999, 321999, 321944, 322018, 322018, 322067, 322049, 322147, 322073, 322024, 322073, 322085, 322049, 322024, 322098, 322098, 322098, 322098, 322098, 322098, 322122, 322135, 322135, 322122, 322214, 322214, 322159, 322214, 322196, 322214, 322208, 322245, 322263, 322270, 322257, 322288, 322245, 322239, 322343, 322368, 322362]
616565C22362r2k5k5N0j3j2oOl1J9j9Ok4M9J2j8m3J2%j8l1K5M9k5%m3k4%M9m3
621567C22147J8m3l0J8J2L7k4l7%O7p3n0o7M3j9m9Q6o1k5oJ9OP3o%L7l7j2k5J3
626569C22012M9L7%%o2OL1om3P4l1M9oOm3K5L7N5M3%l7o1O1%q0j8J2j8Ok5q6J2
631871C21999l6%j3m9l0o8M3k4Om9K4l1L1j04j9%o%k4O7%j8r2P3k4M3oN5m9m9
636872C21650m3l1OO2j9oL1m9k5J8m3k4K4L1m9j2o2%%o1L1K4oK5OM9M9k5O8O%
642041C21625K5l1Q0j9J9%J47l1j8n5J22J3%Q6M9k5o1J2K5l7M3K4K5k5j8%J17
646576C22092l1m9Q6j3PpK5J2oP4L0o1J2M3J9N5oOk5R2Pj9m9l1M9m2O1r2L1K4
651578C22294p4J9m3R2j8pM3j8l1j2J8Pj3N5r8K5n5j3%J3%p4J10j2q6O2J2oM9
$$ y = [322362, 322270, 322245, 322220, 322270, 322257, 322245, 322239, 322245, 322214, 322233, 322214, 322220, 322196, 322245, 322257, 322239, 322196, 322208, 322208, 322190, 322159, 322184, 322233, 322208, 322208, 322165, 322141, 322141, 322190, 322147, 322165, 322122, 322092, 322110, 322122, 322159, 322135, 322098, 322098, 322165, 322092, 322042, 321975, 322018, 321999, 321950, 322036, 321975, 321950, 321944, 321963, 321969, 322042, 322036, 322036, 322073, 322036, 322024, 321999, 322012, 322061, 322098, 322098, 322098, 322036, 322042, 322073, 322067, 322024, 322098, 322067, 322116, 322110, 322116, 322073, 322098, 322135, 322190, 322233, 322233, 322196, 322135, 322196, 322196, 322116, 322098, 322110, 322092, 322098, 322073, 321987, 321999, 321963, 321963, 321950, 321901, 321871, 321803, 321846, 321822, 321828, 321779, 321803, 321772, 321803, 321699, 321680, 321680, 321674, 321674, 321650, 321717, 321717, 321699, 321607, 321680, 321656, 321699, 321693, 321748, 321699, 321650, 321607, 321576, 321582, 321644, 321625, 321619, 321650, 321601, 321576, 321594, 321551, 321527, 321551, 321582, 321533, 321521, 321459, 321459, 321459, 321398, 321429, 321453, 321447, 321472, 321478, 321527, 321576, 321551, 321619, 321625, 321625, 321650, 321619, 321699, 321680, 321699, 321699, 321846, 321815, 321797, 321742, 321864, 321877, 321877, 321963, 322012, 321987, 321926, 321938, 321963, 321926, 321969, 321993, 322018, 321993, 321975, 321975, 322092, 322061, 322012, 322098, 322085, 322092, 322085, 322110, 322122, 322116, 322190, 322220, 322159, 322171, 322214, 322233, 322288, 322282, 322288, 322263, 322355, 322362, 322343, 322294, 322263, 322312, 322270, 322331, 322239, 322270, 322294, 322220, 322239, 322196, 322288, 322270, 322263, 322306, 322288, 322257, 322245, 322263, 322270, 322257, 322312, 322214, 322239, 322184, 322171, 322171, 322184, 322184, 322110, 322220, 322208, 322122, 322184, 322196, 322190, 322239]
656413C22239p4R2j8n5R8J2M9oJ8%j2k4n6O8l7M3N5m9K5q6Q0l1K4l6pL1n5p4%
661248C22214J23r2k5m9M3L1q6L1K4Oj2K5j3j2%j2K4O8M9l1%k4k5Oj8l1Q0j2l7
666083C22245m9oK4%%J9M9k5%o1M9o1o8Q0L7m9m3m3m9l1O7r2P4p4%j8k5K5J8l0
671084C21963P3o1K4oj8Q6j17R2m3J9L7%l7L7j3M9j2M3j8%%%O1j2k5Q6p3N5m3
675903C22147J8n5L1L0n5K5J8m9Q0q0Ok4J8j2m9l1P4r9N6l7K4OM3PM3O%k5N5l0
680904C22141p4%m3K5k5m9K4n5M3m9m3R2m9o1P3p9P9ol0j3k4j3%j8K5O7r2k4k5
685740C21797%o%o2j2j8oP9m9j41J41m9O%%J9n5k5%J2J9Ol1Oj2%%L1m9m3M3O7
691091C21668m9m9%k5J3M9r8J16M3%J2L7m9m9M9%j8Om9J2l7K5o2N6pl6K4l1oK5
$$ y = [322239, 322165, 322257, 322239, 322184, 322282, 322294, 322343, 322337, 322355, 322355, 322343, 322319, 322263, 322331, 322294, 322337, 322392, 322343, 322368, 322282, 322362, 322331, 322355, 322319, 322312, 322343, 322288, 322214, 322214, 322337, 322245, 322220, 322171, 322214, 322245, 322159, 322190, 322214, 322220, 322208, 322233, 322220, 322208, 322208, 322196, 322220, 322288, 322337, 322306, 322306, 322282, 322257, 322263, 322245, 322214, 322294, 322282, 322245, 322196, 322190, 322214, 322214, 322214, 322233, 322282, 322257, 322257, 322196, 322245, 322184, 322116, 322196, 322233, 322184, 322141, 322098, 322049, 322018, 322085, 321993, 322067, 321993, 321993, 321975, 321950, 321975, 321993, 321963, 322036, 321975, 321999, 321993, 321975, 322061, 321944, 322036, 321993, 322012, 322049, 322049, 322012, 322049, 322036, 322085, 322073, 322116, 322098, 322098, 322098, 322098, 322159, 322147, 322122, 322208, 322135, 322190, 322147, 322165, 322110, 322141, 322171, 322116, 322141, 322159, 322110, 322190, 322110, 322116, 322092, 322110, 322098, 322049, 322018, 322092, 321993, 322049, 322012, 322036, 322042, 322085, 322092, 322135, 322141, 322141, 322116, 322171, 322141, 322067, 322067, 322024, 322049, 322024, 321975, 321999, 321944, 321987, 321938, 321895, 321987, 321938, 321877, 321950, 321871, 321950, 321944, 321914, 321901, 321877, 321864, 321864, 321846, 321871, 321938, 321846, 321822, 321797, 321797, 321791, 321791, 321729, 321717, 321699, 321693, 321772, 321723, 321582, 321723, 321674, 321680, 321680, 321680, 321699, 321644, 321619, 321619, 321631, 321650, 321656, 321625, 321631, 321619, 321619, 321619, 321650, 321601, 321558, 321601, 321668, 321619, 321570, 321570, 321545, 321558, 321607, 321509, 321625, 321668, 321668, 321680, 321717, 321668, 321619, 321668, 321668, 321650, 321656, 321607, 321619, 321582, 321607, 321545, 321601, 321594, 321558, 321582, 321551, 321545, 321570]
696093C21570K4N6%on0L7oL1m9Q6k5%l7k4J2j2J35m3L0J3k5O2l1m3J10K5k5M9
700745C21864J3m9l7%N5OJ9P3j04P4m3m3Q6j3om3O8oL0j8L7K4J2J3j3om9R2ON0
705747C22092m3n6L1J2N6k5J8k4OK5OJ8M9m9P4M9j29J2k4%R2%j9J3M9j11O8o8
710415C22122k4P3r8R8%j2%o1M3o8l1J42j3l0J8k4%k5L1J8m3oQ0j41O7l1N6l1
715066C22110m3k5L1r8J10L7l0Ol1m9Oj2l7J17k5o8J42q0Oj29M9j2M9n5O%k5K5
719735C21975l1M3p3O1%M3l1J2J9J8K5OoOq0J2J48l7m9%M9l7o1l7O1j8M9o8J9
724570C22018L1j3L1J8Q0k4N5L7Ol1L1M9L1k5M3p4L1k4M2L1q0N6j3j8l1L1o8l0
729271C22190p4M9R2j35P4L7j17L1r8M9R8J8Op9N5O1k4m9O1p4n5j8J2M9J2O2O
$$ y = [321570, 321594, 321650, 321650, 321644, 321594, 321631, 321625, 321656, 321607, 321693, 321668, 321668, 321631, 321607, 321619, 321607, 321742, 321699, 321729, 321742, 321717, 321779, 321748, 321705, 321815, 321840, 321815, 321864, 321877, 321828, 321791, 321791, 321846, 321852, 321871, 321944, 321840, 321914, 321871, 321828, 321914, 321901, 321895, 321852, 321920, 321914, 321944, 321926, 321963, 321987, 321999, 322012, 321999, 321993, 321944, 322036, 322042, 322092, 322049, 321993, 322024, 322036, 322092, 322067, 322085, 322061, 322067, 322092, 322098, 322116, 322165, 322116, 322190, 322239, 322110, 322122, 322098, 322098, 322190, 322190, 322171, 322184, 322233, 322122, 322190, 322122, 322098, 322171, 322073, 322171, 322171, 322159, 322159, 322098, 322141, 322073, 322042, 322184, 322171, 322141, 322159, 322135, 322135, 322110, 322141, 322159, 322116, 322110, 322190, 322049, 322116, 322085, 322141, 322110, 322067, 322042, 322073, 321975, 322085, 322122, 322092, 322098, 322067, 322018, 322024, 322012, 321975, 322092, 322067, 321999, 322141, 322061, 322067, 321938, 321987, 321975, 322024, 321969, 321975, 321975, 321950, 321975, 321944, 321987, 321914, 321975, 321975, 322018, 321987, 321999, 322018, 322036, 322061, 322067, 322061, 322067, 321987, 321999, 322147, 322110, 322061, 322061, 322110, 322073, 322012, 321975, 322036, 322018, 322067, 321999, 322018, 322049, 322036, 322067, 322085, 322165, 322141, 322196, 322233, 322239, 322208, 322239, 322288, 322319, 322294, 322337, 322263, 322294, 322270, 322312, 322343, 322263, 322319, 322306, 322288, 322257, 322288, 322220, 322190, 322116, 322165, 322257, 322122, 322196, 322233, 322116, 322147, 322049, 322098, 322196, 322214, 322220, 322141, 322196, 322257, 322233, 322184, 322245, 322171, 322116, 322098, 322110, 322159, 322171, 322233, 322239]
733773C22239o8m9M9m9O2m9j3P4q6Q0p4K5K4Ok4L7o8j8L7j48Q0M9j8R8q0R2m3
738258C22165M3%J2O2m9j3O8m9J8%p3O1l1M3J3j05OJ9m9J8L1r2%%k5r8%%%%l7
743426C21938L1m9J16q6M9l0Oo1O1J2N5J9m3Q0%opk4N5r8Q0oO%j3J3n6J9J2J9
748428C22092j9O2l7J2%k5Pm3P3oj8oJ8J04k4l1L1k5K5%oj3O8M3j17J05K4j10
753096C22184L6J9L1l1J8L1o8q5L0J05k5oM3k5k4r8P3j2J8k4M3m3k5M9%m3M9N0
757765C22270%n6Ol0K4O%J3O1j2M9p4N5J9L1M9ok5o8r2ok4P3j8k5ol0j60J47j35
762766C22036P4OM3o1l1p4J17p4j2Q6p4J3l1Ol7j2R2j23N5o1O1l0K4m9j8l1%%
767418C21895Ol0O7m3%OL7K5m9L6J9OJ8oM9q6O8j9k4oR2r8M9%l7Q6l7%o1M9j9
$$ y = [322239, 322171, 322122, 322171, 322122, 322184, 322135, 322122, 322196, 322110, 322190, 322116, 322141, 322165, 322171, 322147, 322184, 322116, 322098, 322135, 321987, 322067, 322116, 322098, 322196, 322116, 322208, 322165, 322208, 322208, 322220, 322282, 322233, 322220, 322288, 322239, 322257, 322257, 322184, 322245, 322214, 322257, 322270, 322165, 322171, 322190, 322141, 322159, 322190, 322098, 322098, 322098, 322073, 321975, 321975, 321975, 321975, 321975, 321938, 321969, 321920, 322036, 321950, 321999, 321969, 321975, 321914, 321975, 321987, 322042, 322061, 322018, 322098, 322098, 322092, 322085, 322061, 322116, 322018, 322098, 322092, 322098, 322098, 322085, 322098, 322042, 322061, 322073, 322092, 322073, 322135, 322098, 322110, 322110, 322085, 322092, 322049, 322122, 322116, 322098, 322092, 322110, 322214, 322190, 322159, 322190, 322165, 322190, 322190, 322184, 322171, 322239, 322282, 322165, 322270, 322294, 322184, 322220, 322239, 322270, 322239, 322257, 322288, 322220, 322135, 322165, 322270, 322245, 322239, 322282, 322257, 322233, 322135, 322208, 322196, 322214, 322190, 322233, 322190, 322165, 322214, 322214, 322171, 322220, 322270, 322270, 322214, 322220, 322190, 322214, 322220, 322220, 322233, 322294, 322282, 322331, 322257, 322312, 322331, 322362, 322411, 322405, 322380, 322312, 322220, 322214, 322190, 322263, 322245, 322220, 322214, 322184, 322024, 322171, 322036, 322110, 322116, 322159, 322098, 322067, 321993, 322110, 322036, 322024, 322110, 322036, 322049, 322018, 322024, 321987, 321975, 322067, 321944, 321999, 321938, 321999, 321969, 321993, 321944, 321926, 321895, 321895, 321895, 321901, 321871, 321938, 321895, 321895, 321901, 321938, 321963, 321914, 321950, 321969, 321975, 321993, 321987, 322036, 321950, 322018, 321999, 321975, 321969, 322061, 321963, 322012, 322012, 321975, 322061, 322024, 322024, 321963, 322012, 321993]
772587C21993k4%oK4Om9K5OM3j9J3j9R2o1K5%O7Om9M3M3M9N5l0K4L7j2K4m3Q0
777588C22343ok5P4m3L7%j2k5n5K4%oj22N5m3q0J29l1K5q0P4J2l7j8OJ2%o1J8
782423C22165M9%j8M3K4m9M9j8ooJ04p4M3j2k4%p4M9m9M3k5%m3p3k5J2m3K5m3
787258C22024L7K4o1J2l7k4j2%Ool7L7k5K5j3J9OJ8k4%%L0om9M3L1K4m3O8p4J9
792427C22012K4J3l1Q0r9N0o2M9m3oJ2j2R8j35R2om3J05p4K5p4P4l7Q0j17R8o1
796928C22012J2q6K5M9m9k5L1%L0l0m3O1j8%j9K5k5m9m9K5O7n5K5L6l0M3%m9J2
801797C21926l1Q0om3J8k4OK4o1R8k4P3m9j8J8Ok4J16l6l1K4ok4M9j2pL1K5o2
806632C22036j2P4o2j8k5J17j11k4M3OoL1L6j35L7%Om9K5m3O7o7%oJ8L7l1k4L0
$$ y = [321993, 321969, 321969, 321963, 321987, 321993, 321944, 321969, 321975, 322018, 321999, 322012, 321993, 322085, 322024, 322049, 322049, 322116, 322122, 322073, 322116, 322159, 322208, 322263, 322233, 322257, 322294, 322282, 322306, 322263, 322343, 322337, 322312, 322386, 322343, 322380, 322380, 322368, 322343, 322288, 322312, 322312, 322306, 322184, 322239, 322196, 322116, 322245, 322214, 322239, 322159, 322233, 322245, 322208, 322190, 322196, 322208, 322208, 322147, 322165, 322214, 322214, 322196, 322239, 322263, 322214, 322263, 322245, 322239, 322233, 322337, 322263, 322306, 322294, 322270, 322270, 322196, 322245, 322196, 322239, 322214, 322214, 322171, 322098, 322073, 322085, 322042, 322067, 322024, 322061, 322085, 322024, 322036, 321999, 321975, 321963, 321963, 321969, 321963, 321926, 321963, 321938, 321963, 321950, 321969, 321975, 321993, 321969, 321969, 321969, 321999, 321993, 321944, 321987, 322018, 322042, 321999, 322067, 321993, 322012, 322036, 322049, 322018, 322098, 321999, 322049, 321987, 322036, 321993, 321987, 321999, 321987, 322085, 321950, 322042, 322036, 321993, 322098, 322024, 322049, 321975, 322049, 322012, 322092, 321975, 322073, 322012, 322024, 321938, 321963, 322012, 321963, 321938, 321969, 321969, 321999, 321969, 321926, 321987, 321969, 321969, 321950, 321975, 321950, 321901, 321852, 321877, 321944, 321889, 321914, 321950, 321920, 321963, 321963, 321914, 321926, 321895, 321975, 321969, 321926, 321944, 321920, 321926, 321950, 321889, 321987, 321963, 322036, 321987, 321969, 321987, 321993, 321969, 322085, 322049, 322018, 322042, 322036, 322012, 322061, 322049, 322042, 322073, 322098, 322036, 322024, 322098, 322036, 322018, 321993, 322110, 321999, 321975, 322018, 322024, 322018, 322049, 322085, 321950, 321987, 321987, 321993, 321944, 321969, 321926, 321993, 321926, 321926, 321920, 321938, 321975, 321944, 321920, 321950]
811467C21950k4M9k5K5M3k5p9J53j17j2P4r8O1m9J8M3L1O7j16M3l7Q6p4L1J41
815618C22159p4K5k5L7l0r9K15j10j3L1j8J2k5J3%J22n5j8l7R8j59J10l7J3p4
819770C22061J23j85Q6J3%%oJ8j2k5M3j8J2j2j3j8J8q6P4o1O1q6L7M9J9m3O1j11
824438C21999J9j9J9oK4m9k4L0j8J8J9L0m3O8o8%j2%K5j3j2O2p4l7%OK5j9J3j9
829440C21944%K5K4k4R2m9K4m9j2Q6p4L7M3j04L6l0J16j16O7l7N0%n6OM3o7J8
833975C21993J9m9L6j04oOL1l7K5m3j9J9K4O%j2K5K4k4o8oJ2oOl7j2L7l7j2%j9
839143C21772K5o8J9j9J3O1j04L0ooQ6l1J9j9J9j9J9L7P3j35R8r8j8Oom3O7oM9
843978C21815K5p4k4L7pK5n5L0m3m9%l6Om3J2%Om9K5k5m3Q6%k5K5o1L6L1%K5M9
$$ y = [321950, 321926, 321975, 321950, 321975, 322018, 321993, 321914, 322067, 321950, 321938, 322012, 321914, 321975, 321926, 321944, 321987, 322018, 322085, 321969, 322012, 321975, 322061, 321987, 322018, 322159, 322085, 322110, 322085, 322122, 322092, 321993, 322208, 322098, 322085, 322116, 322098, 322110, 322085, 322098, 322098, 322220, 322165, 322147, 322110, 322208, 322049, 322159, 322122, 322135, 322061, 322184, 321999, 322085, 322098, 322098, 322098, 322092, 322110, 322098, 322073, 322116, 322098, 322110, 322098, 322085, 322067, 322085, 321999, 322073, 322012, 322073, 321987, 322024, 322073, 322092, 322049, 322110, 321999, 322018, 321999, 322018, 322012, 322036, 321987, 321963, 321993, 321975, 321993, 322012, 322042, 321999, 322067, 321999, 321999, 321987, 321987, 322012, 321999, 321987, 322049, 321975, 321938, 321938, 321944, 321969, 321950, 321963, 321944, 321944, 321969, 321993, 321969, 322061, 322012, 322036, 321987, 321975, 322061, 321987, 322024, 322067, 321963, 321999, 321969, 322085, 321969, 322036, 321999, 322049, 322049, 321993, 321999, 322042, 321975, 321993, 322012, 321963, 321999, 321895, 321889, 321895, 321926, 321889, 321914, 321871, 321852, 321871, 321895, 321901, 321901, 321889, 321914, 321938, 321914, 321846, 321840, 321852, 321846, 321852, 321815, 321803, 321840, 321803, 321791, 321791, 321772, 321797, 321729, 321748, 321729, 321742, 321803, 321699, 321729, 321723, 321717, 321803, 321772, 321791, 321772, 321791, 321772, 321791, 321828, 321901, 321766, 321864, 321766, 321748, 321754, 321748, 321705, 321772, 321766, 321815, 321840, 321766, 321742, 321779, 321772, 321797, 321742, 321772, 321729, 321680, 321680, 321644, 321650, 321607, 321619, 321619, 321625, 321576, 321601, 321576, 321533, 321619, 321619, 321594, 321619, 321558, 321594, 321625, 321625, 321650, 321699]
849147C21699l1M9j2o1N5L0o1N5M3k4j3j2K5%Om9J8k4j3K5l7L7j2j3%L7o7O7m9
853982C21668ON5k4l7%k4m3O7Q6j10L6k4M3m3k5K5n5N5j2P3%j2n5On5J16N5p9
858650C21693J2%j2k5m3R2j8Ol1k4O7l7j2J2O2j3O2p4K5L7j3K5M9%j8N5j23O8
863302C21822j9%O8k5j8M3l1N5J9j9P4m9Oj2N5k5L1Q6J2k4Q6K4p4L1oP4OK4P4
868137C22288j8J2OM9M3K5L0O8j17O8K4%K5%j9m9J9p4o8R3l7m9M9m9j3l6M9O1
872805C22380o1J2K4Q0n5K5J2m9J8j8L7L6n5j8K4p3M9O1j8L0o1L7l7P4%l7l7K5
877457C22405J2%l1L1%n5j9P4J8om9%L7K4J9%q0j8OO1L1J8o1oj9J9m3O7j8P3J9
882625C22509%q0L7%k5J3OQ0p4J8On5J29j10O1J8PK4p4J9L1l7%O1p4K5q0l0L0
$$ y = [321699, 321668, 321717, 321705, 321644, 321699, 321729, 321668, 321723, 321766, 321742, 321729, 321717, 321742, 321742, 321748, 321699, 321717, 321693, 321680, 321705, 321668, 321705, 321693, 321680, 321680, 321717, 321650, 321717, 321668, 321674, 321729, 321705, 321668, 321668, 321644, 321601, 321668, 321754, 321644, 321680, 321656, 321699, 321656, 321631, 321656, 321601, 321656, 321644, 321717, 321717, 321705, 321650, 321656, 321601, 321717, 321772, 321693, 321705, 321705, 321693, 321668, 321625, 321717, 321699, 321705, 321674, 321650, 321717, 321680, 321668, 321680, 321742, 321729, 321791, 321717, 321742, 321779, 321766, 321791, 321840, 321840, 321822, 321877, 321754, 321822, 321803, 321803, 321871, 321846, 321828, 321871, 321840, 321895, 321914, 321895, 321969, 321920, 321926, 321914, 321969, 321944, 321975, 322061, 322073, 322049, 322135, 322159, 322085, 322116, 322110, 322184, 322190, 322214, 322288, 322270, 322282, 322288, 322337, 322380, 322405, 322435, 322503, 322386, 322454, 322478, 322478, 322503, 322503, 322484, 322435, 322454, 322380, 322312, 322405, 322368, 322319, 322368, 322319, 322306, 322270, 322319, 322380, 322319, 322331, 322355, 322435, 322380, 322405, 322417, 322368, 322386, 322368, 322405, 322441, 322386, 322368, 322392, 322319, 322368, 322429, 322411, 322441, 322380, 322417, 322380, 322454, 322454, 322417, 322380, 322405, 322417, 322417, 322386, 322417, 322417, 322362, 322343, 322417, 322435, 322429, 322380, 322380, 322417, 322441, 322460, 322460, 322380, 322362, 322368, 322429, 322460, 322478, 322417, 322411, 322392, 322411, 322368, 322435, 322417, 322490, 322509, 322509, 322429, 322466, 322466, 322441, 322454, 322460, 322540, 322466, 322484, 322490, 322435, 322564, 322454, 322515, 322533, 322540, 322564, 322490, 322509, 322540, 322503, 322503, 322564, 322490, 322515, 322435, 322405, 322435]
887460C22435OJ9Ok5oj8%L7%%k5OoL1r2L7L0m3j29N6K4n5m3J8m9OJ3q6M9j11l6
892629C22049R8j2J2J2o1J8m3J2r2O8m9Q6%oj17L7M9L7oJ8q6K5j3j8j9l0K4OM3
897464C22042L1m9oR2r8Q6%%J2l7L7k5L7%M9m9M9m9j2j8K4l1POl7m3q0m3K5O7
902465C21987m9l7%o1m3K5o8oM9ol7%q0J9m3L0o1K5%o8%j8J8q0j8j9R2m2j3k4
907467C21472%j9N6M9r9Q6q6o%K5R2o1%n0K5o%K4PJ8p4O8j9oo1K4k4L7j9om9K5
912819C21423j9N5K5%M9n5M3j2J8N5M3k4O%P3l6M9Q6l7j3P4l1L1K5k5K5L6N0j3
917637C21901ok4O7j2K4%K5K4N0q0k5Q0%o1J84p4%K5n6M3r2L1j2%M9p4m3N5j04
922472C21895M9k4Op4J9L0J9k5j8o2O2K4j2m9l7J9l1k5J11L7l7n5L0M9oM9Oj2
$$ y = [322435, 322441, 322460, 322466, 322441, 322435, 322417, 322417, 322454, 322454, 322454, 322429, 322435, 322429, 322460, 322368, 322405, 322435, 322392, 322263, 322319, 322343, 322288, 322245, 322263, 322214, 322220, 322233, 322147, 322196, 322085, 322049, 322147, 322135, 322147, 322159, 322098, 322116, 322073, 322085, 321993, 322061, 322012, 322098, 322098, 322092, 321975, 322012, 322061, 322098, 322092, 322110, 322024, 322049, 322036, 322018, 321999, 321969, 321993, 321999, 322042, 322073, 322024, 322018, 322110, 322012, 322098, 322098, 322098, 322110, 322073, 322110, 322085, 322122, 322122, 322171, 322122, 322171, 322122, 322110, 322092, 322116, 322085, 322092, 322098, 322061, 322018, 321938, 321895, 321920, 321987, 321938, 321901, 321901, 321840, 321797, 321822, 321754, 321748, 321797, 321791, 321754, 321754, 321674, 321693, 321650, 321680, 321619, 321644, 321644, 321576, 321576, 321558, 321576, 321496, 321478, 321459, 321551, 321509, 321496, 321472, 321472, 321453, 321509, 321558, 321459, 321545, 321459, 321453, 321453, 321478, 321570, 321509, 321509, 321459, 321484, 321478, 321478, 321502, 321509, 321527, 321453, 321521, 321502, 321496, 321435, 321459, 321435, 321472, 321453, 321447, 321398, 321423, 321404, 321459, 321484, 321484, 321533, 321478, 321521, 321509, 321527, 321582, 321625, 321601, 321607, 321607, 321680, 321644, 321693, 321779, 321742, 321729, 321803, 321772, 321803, 321828, 321803, 321828, 321864, 321914, 321901, 321895, 321871, 321938, 321926, 321950, 321950, 321975, 321999, 322049, 321969, 321944, 322024, 322024, 321963, 322147, 322073, 322073, 322098, 322042, 322085, 321993, 322024, 322012, 322012, 322061, 321987, 321944, 321999, 321895, 321944, 321920, 321926, 321852, 321871, 321901, 321920, 321895, 321877, 321815, 321877, 321901, 321889, 321840, 321803, 321822, 321791, 321766, 321877, 321914, 321877, 321822, 321852, 321901, 321895, 321944, 321950, 321938]
927141C21938J2l0J8p4Q6k4L7o8OM3om9%o7M9M9n6j2j2Ok4n6L1%m9ok5O%L1k5
932309C21729j2j8K4m3J3L0%%J9K4o1p4L7j2o%J8m9%k5L7l0O7Oj8O7j8%j2m3R2
937478C21742L0oL7j2K4l6J8N5j2%m3j8r9k4%J8O8m9%r2J8O1j2m9K5L6J9m9N5
942313C21705p4L7OL1%l1r8oJ2J9P3o7K4l7j8L1m9O7m3J9K4J9o2m9J8m2K4J2Q6
947148C21631p3K4k4J16k4L0J3j9j8om3L7J2o%R2o8l0N5o8P4oP3k4oM9o8o7M3
951983C21699K4M3o1l1%l0J2J2j2K4%O2o8OM3l0L0J9o8K5r2L7j3oK5L0n5N5j2
956851C21668j10J2m9j2J2O1m9J8Pl7L0o%o7K4k4m9K4p3pJ3M3oq6%k5p4L7o7N5
961853C21263on5j3p9R8m9j9M3oJ2J3j9m9OM9M3l0l7J2j8O7l7%O2Ol1j8m3J8J9
$$ y = [321938, 321950, 321920, 321938, 321864, 321950, 321926, 321963, 321895, 321901, 321944, 321938, 321889, 321889, 321822, 321871, 321920, 321864, 321852, 321840, 321846, 321822, 321766, 321797, 321797, 321748, 321742, 321717, 321723, 321723, 321754, 321729, 321717, 321699, 321723, 321680, 321693, 321723, 321723, 321723, 321742, 321766, 321705, 321631, 321668, 321656, 321650, 321650, 321668, 321619, 321619, 321594, 321631, 321601, 321668, 321674, 321656, 321723, 321705, 321705, 321693, 321650, 321742, 321772, 321766, 321803, 321791, 321815, 321779, 321797, 321852, 321840, 321840, 321797, 321779, 321680, 321656, 321656, 321674, 321742, 321693, 321693, 321601, 321619, 321680, 321668, 321619, 321644, 321680, 321699, 321650, 321705, 321631, 321668, 321674, 321705, 321705, 321674, 321576, 321570, 321582, 321601, 321674, 321607, 321631, 321594, 321576, 321607, 321558, 321625, 321582, 321601, 321625, 321644, 321582, 321533, 321551, 321509, 321533, 321545, 321631, 321558, 321582, 321558, 321674, 321650, 321680, 321693, 321674, 321656, 321650, 321607, 321644, 321656, 321650, 321650, 321742, 321674, 321644, 321699, 321631, 321705, 321699, 321772, 321748, 321742, 321791, 321723, 321656, 321699, 321723, 321766, 321705, 321674, 321674, 321644, 321656, 321668, 321656, 321680, 321680, 321742, 321674, 321680, 321723, 321693, 321723, 321742, 321674, 321699, 321607, 321644, 321631, 321625, 321650, 321680, 321625, 321680, 321668, 321558, 321570, 321521, 321509, 321521, 321582, 321533, 321551, 321558, 321521, 321551, 321545, 321545, 321478, 321502, 321478, 321429, 321453, 321380, 321373, 321386, 321429, 321423, 321337, 321337, 321312, 321238, 321275, 321208, 321263, 321257, 321202, 321189, 321110, 321208, 321159, 321140, 321183, 321177, 321189, 321202, 321183, 321134, 321140, 321189, 321232, 321202, 321165, 321177, 321159, 321226, 321189, 321189, 321251, 321257, 321226, 321208, 321165, 321183, 321202]
966855C21202j3K5J2K5r8O1j2L0j8k5M3j8oj9j2K5j3j2J2ooL1j9%K5l1L1J2M9
971690C21275L1m9K4N0n0N6p4M9J2N6j9K5P3%j2K5m3R2M9j2p%M3N6oK4p4Q0M9
976525C21723Ol0J23q0P3j2%O1j8oJ2k4M9J8M9m9j8M3O7o1oN5k5n5M9R8r8oj8
981360C21920p4%L1L7p4M9p4J3l1n5J2O1m3p3OJ8j8j2K4%J2l6k5k4L0oj2P3J3
986195C21742m3%l1M9L1%m3L7L7n6oj8j9oJ23j8n0L7l7k4R2k5K5k5R2o1M9M3J9
991013C21914k5L7k5%R8L7m3OO8M3Q0On5M9O7OPL6o1M3K4o7L7j2l7j3Q6j2om9
996015C22239M9l1OR9l1m3OoOR2l1PP9l0N5J8p3P9O8l1%%L1L1k5
$$ y = [321202, 321189, 321214, 321226, 321251, 321153, 321214, 321202, 321232, 321214, 321189, 321232, 321214, 321208, 321189, 321177, 321202, 321189, 321177, 321189, 321183, 321177, 321208, 321189, 321189, 321214, 321183, 321214, 321226, 321275, 321306, 321257, 321281, 321331, 321281, 321337, 321263, 321312, 321324, 321380, 321361, 321386, 321459, 321459, 321447, 321472, 321429, 321521, 321570, 321558, 321551, 321551, 321594, 321650, 321644, 321668, 321594, 321674, 321723, 321729, 321699, 321822, 321742, 321815, 321803, 321803, 321864, 321846, 321840, 321852, 321828, 321877, 321895, 321944, 321895, 321877, 321920, 321987, 321926, 321920, 321975, 321950, 321895, 321944, 322042, 321944, 321938, 321920, 321846, 321846, 321877, 321914, 321840, 321889, 321815, 321828, 321797, 321742, 321754, 321815, 321772, 321699, 321705, 321723, 321705, 321693, 321717, 321717, 321729, 321693, 321668, 321644, 321674, 321668, 321656, 321729, 321742, 321699, 321699, 321668, 321717, 321748, 321748, 321705, 321742, 321779, 321723, 321717, 321699, 321680, 321674, 321797, 321779, 321729, 321766, 321729, 321705, 321797, 321772, 321797, 321772, 321864, 321803, 321852, 321895, 321914, 321889, 321926, 321901, 321901, 321999, 322036, 321993, 321999, 322067, 322110, 322190, 322196, 322141, 322190, 322257, 322263, 322270, 322306, 322245, 322288, 322312, 322245, 322282, 322270, 322233, 322220, 322306, 322294, 322288, 322239, 322288, 322257, 322263, 322362, 322331, 322288, 322294, 322288, 322294, 322386, 322355, 322362, 322441, 322411, 322466, 322484, 322411, 322490, 322558, 322527, 322527, 322527, 322558, 322589, 322564]
##END=
